{"text_format":"1","workbook":"xlsx","n_sheets":29,"sheets":["+","Mode emploi","Groupes","G1","G1_C","G2","G2_C","G3","G3_C","G4","G4_C","G5","G5_C","G6","G6_C","G7","G7_C","G8","G8_C","G9","G9_C","Projets_Individuels","Projets_Collectifs","Fiches_Juges","Referentiel","Tableau_Images","Tableau_Pyr","Tableau_Eleves","Tableau_Collectif"],"not_rendered":{"charts":0,"images":90,"macros":1,"external_links":0,"defined_names":83,"comments":0,"pivot_tables":0},"unopened":[],"bounds":{"document_bytes":16777216,"sheet_cells":100000,"rows_first":2000,"rows_last":500,"rows_between":2000,"halvings":0,"cell_chars":16384,"cell_head_chars":4096},"cells_cut":0,"cells_raw":0,"read":"whole","date_system":"1900"}

{"sheet":"+","index":0,"n_rows":0,"n_cols":0,"rows_kept":0,"cut":false,"hidden":true,"merged":[]}

{"sheet":"Mode emploi","index":1,"n_rows":27,"n_cols":15,"rows_kept":27,"cut":false,"hidden":false,"merged":[[0,0,0,11],[3,1,3,11],[17,1,17,11],[34,0,34,11],[22,0,22,11],[1,0,1,11],[9,1,9,11],[10,1,10,11],[11,1,11,11],[12,1,12,11],[5,1,5,11],[7,1,7,11],[8,1,8,11],[26,0,26,11],[6,13,7,15],[23,0,23,11],[24,0,24,11],[25,0,25,11],[20,1,20,11],[15,1,15,11],[22,13,22,16],[23,16,34,16],[34,13,34,15],[8,13,8,15],[0,16,8,16],[18,1,18,11],[0,14,0,15],[0,12,34,12],[14,1,14,11]]}
["Mode d'emploi Acrosport Bac, à destination des enseignants",null,null,null,null,null,null,null,null,null,null,null,null,"Lycée :","Colbert"]
["¤ Attention : Ce fichier contient des macros indispensables à son fonctionnement. Avant toute chose, cliquez sur activer le contenu quand le fichier s'ouvre. \n¤ De plus ce fichier ne peut pas fonctionner sur tablette IOS ou autres systèmes hormis les tablettes Windows.\n¤ Si besoin, modifiez le document avant l'utilisation, puis enregistrez le en copie avant de le remplir avec vos élèves ",null,null,null,null,null,null,null,null,null,null,null,null,"Session :",2019]
[]
["Informations :","Ce fichier comprend les figures, codes et images de pyramides du programme UNSS 2016-2020. De plus, il se base sur le référentiel BAC session 2019. \nLes cellules qui ne doivent pas être modifiées ont été verrouillées pour éviter toutes erreurs. "]
[]
["A quoi sert ce fichier :","¤ Permet d'imprimer des fiches bacs pré-remplies (voir feuilles \"Projets Individuels\"). Toute la partie execution individuelle du programme BAC est près-remplie en fonction des choix de pyramides/éléments de chacun et noté. L'enseignant n'a plus qu'à imprimer les feuilles en appuyant sur un seul bouton et compléter le reste des exigences lors de l'épreuve.\n¤ Avec la version 2 du fichier, vous pouvez imprimer les fiches juges et les fiches de projets collectif afin de vous aider à évaluer la partie execution qui est pré remplis."]
[]
["Utilisation :","1 : Inscrire les groupes d'élèves dans la feuille \"Groupes\"."]
[null,"2 : La séance avant le bac, faire remplir aux élèves les cases jaunes de la feuille correspondant à leurs groupes. Puis cliquer sur le bouton noir \"+\" en haut à gauche pour remplir la fiche de projet collectif. Refermer la feuille collectif de son groupe avec le bouton noir en haut de celle ci. "]
[null,"3 : Vérifier que dans chaque feuille groupes, la cellule tout à gauche (correspondant au nom du groupe) apparaisse en vert. Verifier que les projets collectif soit remplis. "]
[null,"4 : Enregistrer son excel."]
[null,"5 : Suite au cours, allez dans la feuille \"Projets Individuels\" et cliquer sur le boutons \"Imprimer\". Faire de même avec la feuille \"Projets Collectifs\" et \"Juges\"."]
[null,"6 : Allez à l'épreuve du bac avec la partie exécution remplie automatiquement sur la fiche \"Projets Individuels\". Aider vous de la fiche de \"Projet Collectifs\" pour noter la partie execution en suivant la chorégraphie. Repartisser les fiches juges entre chaque élèves."]
[]
[null,"¤ Si des cases avec le nom des élèves apparaissent en rouge. Soit l'élève ne valide pas le critère \"au moins une fois porteur et voltigeur\". Soit il ne valide pas le critère \"au moins un élément individuels et un synchronisé\". Dans ce cas, une exigence est manquante (-0,5 sur la partie execution)."]
[null,"¤ Les codes utilisés pour le choix des pyramides dans les feuilles groupe sont les abrévations des codes UNSS. Par exemple D_St_EQ = duo statique equerre. Le signe \"+\", dans les listes A1, A2, A3 ... +, permet aux élèves de selectionner un code de pyramides non présents dans la liste. L'enseignant devra, alors, ajouter manuellement le nombre de points en fonction de s'il juge que la pyramide est A, B, C, ou D ainsi que modifier la note."]
[]
["Modification :","Pour toutes formes de modification du fichier, ou pour avoir un accès complet au fichier sans cellule vérouille, un tutoriel youtube est accèssible via le liens ci-dessous ou en cherchant la chaine BlablablaEPS."]
[]
[]
["Commencer l'utilisation :","Pour commencer à utiliser le fichier et masquer le mode d'emploi : remplissez votre lycée et la session en haut à droite et cliquez sur le bouton \"J'ai fini de lire le mode d'emploi\". Si vous voulez supprimer toutes les données de l'exemple, ou de votre classe, cliquer sur le bouton bleu \"Effacer les données\" en bas a droite de ce mode d'emploi.\nPour réafficher la feuille \"Mode emploi\" si celle-ci est masquée taper Ctrl + Shift + M. \nLe raccourci est aussi affiché en dessous du nombre total d'élèves dans la feuille \"Groupes\" en bas à gauche des tableaux groupes."]
[]
[]
["Propriétaire"]
["Cet outil a été réalisé par monsieur BREDIER NICOLAS."]
["Pour tout renseignement supplémentaire, modification de l'outil, ou retour, merci de me joindre à l'adresse suivante : nicolas.bredier@outlook.com"]
["Cet outil peut être modifié, réutilisé, dans un usage professionnel de l'enseignement. Toutes utilisations commerciales pourront être poursuivies. "]

{"sheet":"Groupes","index":2,"n_rows":39,"n_cols":13,"rows_kept":39,"cut":false,"hidden":false,"merged":[[24,0,24,1],[24,5,24,6],[24,10,24,11],[0,5,0,6],[0,10,0,11],[12,0,12,1],[12,5,12,6],[12,10,12,11],[0,0,0,1]]}
["Groupe 1",null,{"$f":"IF(A3=\"\",\"\",COUNTA(A3:A8))","v":3},null,null,"Groupe 2",null,{"$f":"IF(F3=\"\",\"\",COUNTA(F3:F8))","v":5},null,null,"Groupe 3",null,{"$f":"IF(K3=\"\",\"\",COUNTA(K3:K8))","v":""}]
["Nom","Prenom","Classe",null,null,"Nom","Prenom","Classe",null,null,"Nom","Prenom","Classe"]
["Metral","Lucie","TL",null,null,"Hebert","Georges","TS"]
["Bredier","Nicolas","TS",null,null,"Tissié","Phillippe","TS"]
["Sophie","Lasgne","TL",null,null,"Leboulch","Jean","TL"]
[null,null,null,null,null,"Mérand","Robert","TS"]
[null,null,null,null,null,"Coubertin","Pierre","TL"]
[]
[]
[]
[]
[]
["Groupe 4",null,{"$f":"IF(A15=\"\",\"\",COUNTA(A15:A20))","v":""},null,null,"Groupe 5",null,{"$f":"IF(F15=\"\",\"\",COUNTA(F15:F20))","v":""},null,null,"Groupe 6",null,{"$f":"IF(K15=\"\",\"\",COUNTA(K15:K20))","v":""}]
["Nom","Prenom","Classe",null,null,"Nom","Prenom","Classe",null,null,"Nom","Prenom","Classe"]
[]
[]
[]
[]
[]
[]
[]
[]
[]
[]
["Groupe 7",null,{"$f":"IF(A27=\"\",\"\",COUNTA(A27:A32))","v":""},null,null,"Groupe 8",null,{"$f":"IF(F27=\"\",\"\",COUNTA(F27:F32))","v":""},null,null,"Groupe 9",null,{"$f":"IF(K27=\"\",\"\",COUNTA(K27:K32))","v":""}]
["Nom","Prenom","Classe",null,null,"Nom","Prenom","Classe",null,null,"Nom","Prenom","Classe"]
[]
[]
[]
[]
[]
[]
[]
[]
[]
[]
[]
["Total élèves",{"$f":"IF(A3=\"\",\"\",SUM(C1,H1,M1,C13,H13,M13,C25,H25,M25))","v":8}]
["Afficher mode emploi","Ctrl + Shift + M"]

{"sheet":"G1","index":3,"n_rows":34,"n_cols":17,"rows_kept":34,"cut":false,"hidden":false,"merged":[[6,1,9,2],[0,13,0,14],[2,5,2,6],[2,7,2,8],[2,9,2,10],[2,11,2,12],[2,13,2,14],[0,3,0,4],[2,3,2,4],[0,5,0,6],[0,7,0,8],[0,9,0,10],[0,11,0,12],[0,1,3,2],[6,11,6,12],[6,13,6,14],[8,13,8,14],[6,9,6,10],[6,3,6,4],[6,5,6,6],[6,7,6,8],[8,3,8,4],[8,5,8,6],[8,7,8,8],[8,9,8,10],[8,11,8,12],[18,1,21,2],[12,11,12,12],[12,13,12,14],[14,3,14,4],[14,5,14,6],[14,7,14,8],[14,9,14,10],[14,11,14,12],[14,13,14,14],[12,9,12,10],[12,3,12,4],[12,5,12,6],[12,7,12,8],[12,1,15,2],[18,11,18,12],[18,13,18,14],[20,13,20,14],[18,9,18,10],[18,3,18,4],[18,5,18,6],[18,7,18,8],[20,3,20,4],[20,5,20,6],[20,7,20,8],[20,9,20,10],[20,11,20,12],[24,13,24,14],[26,3,26,4],[26,5,26,6],[26,7,26,8],[26,9,26,10],[26,11,26,12],[26,13,26,14],[24,9,24,10],[24,3,24,4],[24,5,24,6],[24,7,24,8],[30,5,30,6],[30,7,30,8],[30,9,30,10],[30,1,33,2],[24,11,24,12],[24,1,27,2],[24,15,24,16],[30,15,30,16],[0,0,33,0],[0,15,0,16],[6,15,6,16],[12,15,12,16],[18,15,18,16],[30,11,30,12],[30,13,30,14],[32,3,32,4],[32,5,32,6],[32,7,32,8],[32,9,32,10],[32,11,32,12],[32,13,32,14],[30,3,30,4]]}
["Groupe 1",{"$f":"IF(Groupes!A3=\"\",\"\",Groupes!A3&\" \"&Groupes!B3)","v":"Metral Lucie"},null,"Figure / élément 1",null,"Figure / élément 2",null,"Figure / élément 3",null,"Figure / élément 4",null,"Figure / élément 5",null,"Figure / élément 6",null,"Exigence validé ou non"]
[null,null,null,"D_Dy_","C6","D_St_PV_","C6","D_St_EQ_","B1","El_Sou_","C2","D_St_EQ_","B4","El_Ag_","B1","Points execution",{"$f":"IF(AND(E4=\"\",G4=\"\",I4=\"\",K4=\"\",M4=\"\",O4=\"\"),\"\",(COUNTIF(D4:O4,\"A\")*0.4)+(COUNTIF(D4:O4,\"B\")*0.6)+(COUNTIF(D4:O4,\"C\")*0.8)+(COUNTIF(D4:O4,\"D\")))","v":4.2}]
[null,null,null,{"$f":"IF(OR(D2=\"\",E2=\"\"),\"\",D2&\"\"&E2)","v":"D_Dy_C6"},null,{"$f":"IF(OR(F2=\"\",G2=\"\"),\"\",F2&\"\"&G2)","v":"D_St_PV_C6"},null,{"$f":"IF(OR(H2=\"\",I2=\"\"),\"\",H2&\"\"&I2)","v":"D_St_EQ_B1"},null,{"$f":"IF(OR(J2=\"\",K2=\"\"),\"\",J2&\"\"&K2)","v":"El_Sou_C2"},null,{"$f":"IF(OR(L2=\"\",M2=\"\"),\"\",L2&\"\"&M2)","v":"D_St_EQ_B4"},null,{"$f":"IF(OR(N2=\"\",O2=\"\"),\"\",N2&\"\"&O2)","v":"El_Ag_B1"},null,"P /V présent",{"$f":"IF(AND(D4=\"\",F4=\"\",H4=\"\",J4=\"\",L4=\"\",N4=\"\"),\"\",AND(OR(D4=\"P\",F4=\"P\",H4=\"P\",J4=\"P\",L4=\"P\",N4=\"P\"),OR(D4=\"V\",F4=\"V\",H4=\"V\",J4=\"V\",L4=\"V\",N4=\"V\")))","v":true}]
[null,null,null,"V",{"$f":"IF(D3=\"\",\"\",IFERROR(VLOOKUP(D3,Tableau_Images!$A$2:$D$231,2,0),\"?\"))","v":"C"},"V",{"$f":"IF(F3=\"\",\"\",IFERROR(VLOOKUP(F3,Tableau_Images!$A$2:$D$231,2,0),\"?\"))","v":"C"},"V",{"$f":"IF(H3=\"\",\"\",IFERROR(VLOOKUP(H3,Tableau_Images!$A$2:$D$231,2,0),\"?\"))","v":"B"},"El Ind",{"$f":"IF(J3=\"\",\"\",IFERROR(VLOOKUP(J3,Tableau_Images!$A$2:$D$231,2,0),\"?\"))","v":"C"},"P",{"$f":"IF(L3=\"\",\"\",IFERROR(VLOOKUP(L3,Tableau_Images!$A$2:$D$231,2,0),\"?\"))","v":"B"},"El Syn",{"$f":"IF(N3=\"\",\"\",IFERROR(VLOOKUP(N3,Tableau_Images!$A$2:$D$231,2,0),\"?\"))","v":"B"},"El Ind/El Syn Présent",{"$f":"IF(AND(D4=\"\",F4=\"\",H4=\"\",J4=\"\",L4=\"\",N4=\"\"),\"\",AND(OR(D4=\"El Ind\",F4=\"El Ind\",H4=\"El Ind\",J4=\"El Ind\",L4=\"El Ind\",N4=\"El Ind\"),OR(D4=\"El Syn\",F4=\"El Syn\",H4=\"El Syn\",J4=\"El Syn\",L4=\"El Syn\",N4=\"El Syn\")))","v":true}]
[]
[]
[null,{"$f":"IF(Groupes!A4=\"\",\"\",Groupes!A4&\" \"&Groupes!B4)","v":"Bredier Nicolas"},null,"Figure / élément 1",null,"Figure / élément 2",null,"Figure / élément 3",null,"Figure / élément 4",null,"Figure / élément 5",null,"Figure / élément 6",null,"Exigence Validé ou non"]
[null,null,null,"D_St_EQ_","B1","D_St_ATR_","C4","T_St_EQ_","B6","D_Dy_","B2","El_Ag_","B3","El_Ag_","B1","Points execution",{"$f":"IF(AND(E10=\"\",G10=\"\",I10=\"\",K10=\"\",M10=\"\",O10=\"\"),\"\",(COUNTIF(D10:O10,\"A\")*0.4)+(COUNTIF(D10:O10,\"B\")*0.6)+(COUNTIF(D10:O10,\"C\")*0.8)+(COUNTIF(D10:O10,\"D\")))","v":3.8}]
[null,null,null,{"$f":"IF(OR(D8=\"\",E8=\"\"),\"\",D8&\"\"&E8)","v":"D_St_EQ_B1"},null,{"$f":"IF(OR(F8=\"\",G8=\"\"),\"\",F8&\"\"&G8)","v":"D_St_ATR_C4"},null,{"$f":"IF(OR(H8=\"\",I8=\"\"),\"\",H8&\"\"&I8)","v":"T_St_EQ_B6"},null,{"$f":"IF(OR(J8=\"\",K8=\"\"),\"\",J8&\"\"&K8)","v":"D_Dy_B2"},null,{"$f":"IF(OR(L8=\"\",M8=\"\"),\"\",L8&\"\"&M8)","v":"El_Ag_B3"},null,{"$f":"IF(OR(N8=\"\",O8=\"\"),\"\",N8&\"\"&O8)","v":"El_Ag_B1"},null,"P /V présent",{"$f":"IF(AND(D10=\"\",F10=\"\",H10=\"\",J10=\"\",L10=\"\",N10=\"\"),\"\",AND(OR(D10=\"P\",F10=\"P\",H10=\"P\",J10=\"P\",L10=\"P\",N10=\"P\"),OR(D10=\"V\",F10=\"V\",H10=\"V\",J10=\"V\",L10=\"V\",N10=\"V\")))","v":true}]
[null,null,null,null,{"$f":"IF(D9=\"\",\"\",IFERROR(VLOOKUP(D9,Tableau_Images!$A$2:$D$231,2,0),\"?\"))","v":"B"},"P",{"$f":"IF(F9=\"\",\"\",IFERROR(VLOOKUP(F9,Tableau_Images!$A$2:$D$231,2,0),\"?\"))","v":"C"},"P",{"$f":"IF(H9=\"\",\"\",IFERROR(VLOOKUP(H9,Tableau_Images!$A$2:$D$231,2,0),\"?\"))","v":"B"},"V",{"$f":"IF(J9=\"\",\"\",IFERROR(VLOOKUP(J9,Tableau_Images!$A$2:$D$231,2,0),\"?\"))","v":"B"},"El Ind",{"$f":"IF(L9=\"\",\"\",IFERROR(VLOOKUP(L9,Tableau_Images!$A$2:$D$231,2,0),\"?\"))","v":"B"},"El Syn",{"$f":"IF(N9=\"\",\"\",IFERROR(VLOOKUP(N9,Tableau_Images!$A$2:$D$231,2,0),\"?\"))","v":"B"},"El Ind/El Syn Présent",{"$f":"IF(AND(D10=\"\",F10=\"\",H10=\"\",J10=\"\",L10=\"\",N10=\"\"),\"\",AND(OR(D10=\"El Ind\",F10=\"El Ind\",H10=\"El Ind\",J10=\"El Ind\",L10=\"El Ind\",N10=\"El Ind\"),OR(D10=\"El Syn\",F10=\"El Syn\",H10=\"El Syn\",J10=\"El Syn\",L10=\"El Syn\",N10=\"El Syn\")))","v":true}]
[]
[]
[null,{"$f":"IF(Groupes!A5=\"\",\"\",Groupes!A5&\" \"&Groupes!B5)","v":"Sophie Lasgne"},null,"Figure / élément 1",null,"Figure / élément 2",null,"Figure / élément 3",null,"Figure / élément 4",null,"Figure / élément 5",null,"Figure / élément 6",null,"Exigence Validé ou non"]
[null,null,null,"D_St_EQ_","B1","D_St_ATR_","B2","T_Dy_","D6","El_M_","A2","T_St_PV_","B1","El_Ag_","B1","Points execution",{"$f":"IF(AND(E16=\"\",G16=\"\",I16=\"\",K16=\"\",M16=\"\",O16=\"\"),\"\",(COUNTIF(D16:O16,\"A\")*0.4)+(COUNTIF(D16:O16,\"B\")*0.6)+(COUNTIF(D16:O16,\"C\")*0.8)+(COUNTIF(D16:O16,\"D\")))","v":3.8}]
[null,null,null,{"$f":"IF(OR(D14=\"\",E14=\"\"),\"\",D14&\"\"&E14)","v":"D_St_EQ_B1"},null,{"$f":"IF(OR(F14=\"\",G14=\"\"),\"\",F14&\"\"&G14)","v":"D_St_ATR_B2"},null,{"$f":"IF(OR(H14=\"\",I14=\"\"),\"\",H14&\"\"&I14)","v":"T_Dy_D6"},null,{"$f":"IF(OR(J14=\"\",K14=\"\"),\"\",J14&\"\"&K14)","v":"El_M_A2"},null,{"$f":"IF(OR(L14=\"\",M14=\"\"),\"\",L14&\"\"&M14)","v":"T_St_PV_B1"},null,{"$f":"IF(OR(N14=\"\",O14=\"\"),\"\",N14&\"\"&O14)","v":"El_Ag_B1"},null,"P /V présent",{"$f":"IF(AND(D16=\"\",F16=\"\",H16=\"\",J16=\"\",L16=\"\",N16=\"\"),\"\",AND(OR(D16=\"P\",F16=\"P\",H16=\"P\",J16=\"P\",L16=\"P\",N16=\"P\"),OR(D16=\"V\",F16=\"V\",H16=\"V\",J16=\"V\",L16=\"V\",N16=\"V\")))","v":true}]
[null,null,null,"El Ind",{"$f":"IF(D15=\"\",\"\",IFERROR(VLOOKUP(D15,Tableau_Images!$A$2:$D$231,2,0),\"?\"))","v":"B"},"P",{"$f":"IF(F15=\"\",\"\",IFERROR(VLOOKUP(F15,Tableau_Images!$A$2:$D$231,2,0),\"?\"))","v":"B"},"V",{"$f":"IF(H15=\"\",\"\",IFERROR(VLOOKUP(H15,Tableau_Images!$A$2:$D$231,2,0),\"?\"))","v":"D"},"El Ind",{"$f":"IF(J15=\"\",\"\",IFERROR(VLOOKUP(J15,Tableau_Images!$A$2:$D$231,2,0),\"?\"))","v":"A"},"V",{"$f":"IF(L15=\"\",\"\",IFERROR(VLOOKUP(L15,Tableau_Images!$A$2:$D$231,2,0),\"?\"))","v":"B"},"El Syn",{"$f":"IF(N15=\"\",\"\",IFERROR(VLOOKUP(N15,Tableau_Images!$A$2:$D$231,2,0),\"?\"))","v":"B"},"El Ind/El Syn Présent",{"$f":"IF(AND(D16=\"\",F16=\"\",H16=\"\",J16=\"\",L16=\"\",N16=\"\"),\"\",AND(OR(D16=\"El Ind\",F16=\"El Ind\",H16=\"El Ind\",J16=\"El Ind\",L16=\"El Ind\",N16=\"El Ind\"),OR(D16=\"El Syn\",F16=\"El Syn\",H16=\"El Syn\",J16=\"El Syn\",L16=\"El Syn\",N16=\"El Syn\")))","v":true}]
[]
[]
[null,{"$f":"IF(Groupes!A6=\"\",\"\",Groupes!A6&\" \"&Groupes!B6)","v":""},null,"Figure / élément 1",null,"Figure / élément 2",null,"Figure / élément 3",null,"Figure / élément 4",null,"Figure / élément 5",null,"Figure / élément 6",null,"Exigence Validé ou non"]
[null,null,null,null,null,null,null,null,null,null,null,null,null,null,null,"Points execution",{"$f":"IF(AND(E22=\"\",G22=\"\",I22=\"\",K22=\"\",M22=\"\",O22=\"\"),\"\",(COUNTIF(D22:O22,\"A\")*0.4)+(COUNTIF(D22:O22,\"B\")*0.6)+(COUNTIF(D22:O22,\"C\")*0.8)+(COUNTIF(D22:O22,\"D\")))","v":""}]
[null,null,null,{"$f":"IF(OR(D20=\"\",E20=\"\"),\"\",D20&\"\"&E20)","v":""},null,{"$f":"IF(OR(F20=\"\",G20=\"\"),\"\",F20&\"\"&G20)","v":""},null,{"$f":"IF(OR(H20=\"\",I20=\"\"),\"\",H20&\"\"&I20)","v":""},null,{"$f":"IF(OR(J20=\"\",K20=\"\"),\"\",J20&\"\"&K20)","v":""},null,{"$f":"IF(OR(L20=\"\",M20=\"\"),\"\",L20&\"\"&M20)","v":""},null,{"$f":"IF(OR(N20=\"\",O20=\"\"),\"\",N20&\"\"&O20)","v":""},null,"P /V présent",{"$f":"IF(AND(D22=\"\",F22=\"\",H22=\"\",J22=\"\",L22=\"\",N22=\"\"),\"\",AND(OR(D22=\"P\",F22=\"P\",H22=\"P\",J22=\"P\",L22=\"P\",N22=\"P\"),OR(D22=\"V\",F22=\"V\",H22=\"V\",J22=\"V\",L22=\"V\",N22=\"V\")))","v":""}]
[null,null,null,null,{"$f":"IF(D21=\"\",\"\",IFERROR(VLOOKUP(D21,Tableau_Images!$A$2:$D$231,2,0),\"?\"))","v":""},null,{"$f":"IF(F21=\"\",\"\",IFERROR(VLOOKUP(F21,Tableau_Images!$A$2:$D$231,2,0),\"?\"))","v":""},null,{"$f":"IF(H21=\"\",\"\",IFERROR(VLOOKUP(H21,Tableau_Images!$A$2:$D$231,2,0),\"?\"))","v":""},null,{"$f":"IF(J21=\"\",\"\",IFERROR(VLOOKUP(J21,Tableau_Images!$A$2:$D$231,2,0),\"?\"))","v":""},null,{"$f":"IF(L21=\"\",\"\",IFERROR(VLOOKUP(L21,Tableau_Images!$A$2:$D$231,2,0),\"?\"))","v":""},null,{"$f":"IF(N21=\"\",\"\",IFERROR(VLOOKUP(N21,Tableau_Images!$A$2:$D$231,2,0),\"?\"))","v":""},"El Ind/El Syn Présent",{"$f":"IF(AND(D22=\"\",F22=\"\",H22=\"\",J22=\"\",L22=\"\",N22=\"\"),\"\",AND(OR(D22=\"El Ind\",F22=\"El Ind\",H22=\"El Ind\",J22=\"El Ind\",L22=\"El Ind\",N22=\"El Ind\"),OR(D22=\"El Syn\",F22=\"El Syn\",H22=\"El Syn\",J22=\"El Syn\",L22=\"El Syn\",N22=\"El Syn\")))","v":""}]
[]
[]
[null,{"$f":"IF(Groupes!A7=\"\",\"\",Groupes!A7&\" \"&Groupes!B7)","v":""},null,"Figure / élément 1",null,"Figure / élément 2",null,"Figure / élément 3",null,"Figure / élément 4",null,"Figure / élément 5",null,"Figure / élément 6",null,"Exigence Validé ou non"]
[null,null,null,null,null,null,null,null,null,null,null,null,null,null,null,"Points execution",{"$f":"IF(AND(E28=\"\",G28=\"\",I28=\"\",K28=\"\",M28=\"\",O28=\"\"),\"\",(COUNTIF(D28:O28,\"A\")*0.4)+(COUNTIF(D28:O28,\"B\")*0.6)+(COUNTIF(D28:O28,\"C\")*0.8)+(COUNTIF(D28:O28,\"D\")))","v":""}]
[null,null,null,{"$f":"IF(OR(D26=\"\",E26=\"\"),\"\",D26&\"\"&E26)","v":""},null,{"$f":"IF(OR(F26=\"\",G26=\"\"),\"\",F26&\"\"&G26)","v":""},null,{"$f":"IF(OR(H26=\"\",I26=\"\"),\"\",H26&\"\"&I26)","v":""},null,{"$f":"IF(OR(J26=\"\",K26=\"\"),\"\",J26&\"\"&K26)","v":""},null,{"$f":"IF(OR(L26=\"\",M26=\"\"),\"\",L26&\"\"&M26)","v":""},null,{"$f":"IF(OR(N26=\"\",O26=\"\"),\"\",N26&\"\"&O26)","v":""},null,"P /V présent",{"$f":"IF(AND(D28=\"\",F28=\"\",H28=\"\",J28=\"\",L28=\"\",N28=\"\"),\"\",AND(OR(D28=\"P\",F28=\"P\",H28=\"P\",J28=\"P\",L28=\"P\",N28=\"P\"),OR(D28=\"V\",F28=\"V\",H28=\"V\",J28=\"V\",L28=\"V\",N28=\"V\")))","v":""}]
[null,null,null,null,{"$f":"IF(D27=\"\",\"\",IFERROR(VLOOKUP(D27,Tableau_Images!$A$2:$D$231,2,0),\"?\"))","v":""},null,{"$f":"IF(F27=\"\",\"\",IFERROR(VLOOKUP(F27,Tableau_Images!$A$2:$D$231,2,0),\"?\"))","v":""},null,{"$f":"IF(H27=\"\",\"\",IFERROR(VLOOKUP(H27,Tableau_Images!$A$2:$D$231,2,0),\"?\"))","v":""},null,{"$f":"IF(J27=\"\",\"\",IFERROR(VLOOKUP(J27,Tableau_Images!$A$2:$D$231,2,0),\"?\"))","v":""},null,{"$f":"IF(L27=\"\",\"\",IFERROR(VLOOKUP(L27,Tableau_Images!$A$2:$D$231,2,0),\"?\"))","v":""},null,{"$f":"IF(N27=\"\",\"\",IFERROR(VLOOKUP(N27,Tableau_Images!$A$2:$D$231,2,0),\"?\"))","v":""},"El Ind/El Syn Présent",{"$f":"IF(AND(D28=\"\",F28=\"\",H28=\"\",J28=\"\",L28=\"\",N28=\"\"),\"\",AND(OR(D28=\"El Ind\",F28=\"El Ind\",H28=\"El Ind\",J28=\"El Ind\",L28=\"El Ind\",N28=\"El Ind\"),OR(D28=\"El Syn\",F28=\"El Syn\",H28=\"El Syn\",J28=\"El Syn\",L28=\"El Syn\",N28=\"El Syn\")))","v":""}]
[]
[]
[null,{"$f":"IF(Groupes!A8=\"\",\"\",Groupes!A8&\" \"&Groupes!B8)","v":""},null,"Figure / élément 1",null,"Figure / élément 2",null,"Figure / élément 3",null,"Figure / élément 4",null,"Figure / élément 5",null,"Figure / élément 6",null,"Exigence Validé ou non"]
[null,null,null,null,null,null,null,null,null,null,null,null,null,null,null,"Points execution",{"$f":"IF(AND(E34=\"\",G34=\"\",I34=\"\",K34=\"\",M34=\"\",O34=\"\"),\"\",(COUNTIF(D34:O34,\"A\")*0.4)+(COUNTIF(D34:O34,\"B\")*0.6)+(COUNTIF(D34:O34,\"C\")*0.8)+(COUNTIF(D34:O34,\"D\")))","v":""}]
[null,null,null,{"$f":"IF(OR(D32=\"\",E32=\"\"),\"\",D32&\"\"&E32)","v":""},null,{"$f":"IF(OR(F32=\"\",G32=\"\"),\"\",F32&\"\"&G32)","v":""},null,{"$f":"IF(OR(H32=\"\",I32=\"\"),\"\",H32&\"\"&I32)","v":""},null,{"$f":"IF(OR(J32=\"\",K32=\"\"),\"\",J32&\"\"&K32)","v":""},null,{"$f":"IF(OR(L32=\"\",M32=\"\"),\"\",L32&\"\"&M32)","v":""},null,{"$f":"IF(OR(N32=\"\",O32=\"\"),\"\",N32&\"\"&O32)","v":""},null,"P /V présent",{"$f":"IF(AND(D34=\"\",F34=\"\",H34=\"\",J34=\"\",L34=\"\",N34=\"\"),\"\",AND(OR(D34=\"P\",F34=\"P\",H34=\"P\",J34=\"P\",L34=\"P\",N34=\"P\"),OR(D34=\"V\",F34=\"V\",H34=\"V\",J34=\"V\",L34=\"V\",N34=\"V\")))","v":""}]
[null,null,null,null,{"$f":"IF(D33=\"\",\"\",IFERROR(VLOOKUP(D33,Tableau_Images!$A$2:$D$231,2,0),\"?\"))","v":""},null,{"$f":"IF(F33=\"\",\"\",IFERROR(VLOOKUP(F33,Tableau_Images!$A$2:$D$231,2,0),\"?\"))","v":""},null,{"$f":"IF(H33=\"\",\"\",IFERROR(VLOOKUP(H33,Tableau_Images!$A$2:$D$231,2,0),\"?\"))","v":""},null,{"$f":"IF(J33=\"\",\"\",IFERROR(VLOOKUP(J33,Tableau_Images!$A$2:$D$231,2,0),\"?\"))","v":""},null,{"$f":"IF(L33=\"\",\"\",IFERROR(VLOOKUP(L33,Tableau_Images!$A$2:$D$231,2,0),\"?\"))","v":""},null,{"$f":"IF(N33=\"\",\"\",IFERROR(VLOOKUP(N33,Tableau_Images!$A$2:$D$231,2,0),\"?\"))","v":""},"El Ind/El Syn Présent",{"$f":"IF(AND(D34=\"\",F34=\"\",H34=\"\",J34=\"\",L34=\"\",N34=\"\"),\"\",AND(OR(D34=\"El Ind\",F34=\"El Ind\",H34=\"El Ind\",J34=\"El Ind\",L34=\"El Ind\",N34=\"El Ind\"),OR(D34=\"El Syn\",F34=\"El Syn\",H34=\"El Syn\",J34=\"El Syn\",L34=\"El Syn\",N34=\"El Syn\")))","v":""}]

{"sheet":"G1_C","index":4,"n_rows":20,"n_cols":23,"rows_kept":20,"cut":false,"hidden":true,"merged":[[15,21,18,21],[15,22,18,22],[15,23,18,23],[0,12,0,23],[0,0,0,11],[11,21,11,23],[12,21,12,23],[13,21,13,23],[14,21,14,23],[1,21,1,23],[2,21,2,23],[3,21,3,23],[4,21,4,23],[5,21,8,21],[5,22,8,22],[5,23,8,23],[11,18,11,20],[12,18,12,20],[13,18,13,20],[14,18,14,20],[15,18,18,18],[15,19,18,19],[15,20,18,20],[11,15,11,17],[12,15,12,17],[13,15,13,17],[14,15,14,17],[15,15,18,15],[15,16,18,16],[15,17,18,17],[11,6,11,8],[12,6,12,8],[13,6,13,8],[14,6,14,8],[15,6,18,6],[15,7,18,7],[11,12,11,14],[12,12,12,14],[13,12,13,14],[14,12,14,14],[15,12,18,12],[15,13,18,13],[15,14,18,14],[15,8,18,8],[11,9,11,11],[12,9,12,11],[13,9,13,11],[14,9,14,11],[15,9,18,9],[15,10,18,10],[15,11,18,11],[15,1,18,1],[15,2,18,2],[15,3,18,3],[11,0,11,2],[12,0,12,2],[13,0,13,2],[14,0,14,2],[15,0,18,0],[11,3,11,5],[12,3,12,5],[13,3,13,5],[14,3,14,5],[15,4,18,4],[15,5,18,5],[1,18,1,20],[2,18,2,20],[3,18,3,20],[4,18,4,20],[5,18,8,18],[5,19,8,19],[5,20,8,20],[1,15,1,17],[2,15,2,17],[3,15,3,17],[4,15,4,17],[5,15,8,15],[5,16,8,16],[5,17,8,17],[1,12,1,14],[2,12,2,14],[3,12,3,14],[4,12,4,14],[5,12,8,12],[5,13,8,13],[5,14,8,14],[1,9,1,11],[2,9,2,11],[3,9,3,11],[4,9,4,11],[5,9,8,9],[5,10,8,10],[5,11,8,11],[4,0,4,2],[2,0,2,2],[5,1,8,1],[5,0,8,0],[5,2,8,2],[1,0,1,2],[3,0,3,2],[1,6,1,8],[2,6,2,8],[3,6,3,8],[4,6,4,8],[5,6,8,6],[5,7,8,7],[5,8,8,8],[1,3,1,5],[2,3,2,5],[3,3,3,5],[4,3,4,5],[5,3,8,3],[5,4,8,4],[5,5,8,5]]}
[{"$f":"IF(Groupes!C1=\"\",\"\",\"Groupe 1\")","v":"Groupe 1"},null,null,null,null,null,null,null,null,null,null,null,": Projet collectif"]
["Figure / élément 1",null,null,"Figure / élément 2",null,null,"Figure / élément 3",null,null,"Figure / élément 4",null,null,"Figure / élément 5",null,null,"Figure / élément 6",null,null,"Figure / élément 7",null,null,"Figure / élément 8"]
["Dynamique",null,null,"Elément Indiv",null,null,"Elément Indiv",null,null,"Elément Indiv",null,null,"Dynamique",null,null,"Elément Indiv",null,null,"Elément Indiv",null,null,"Elément Indiv"]
["D_St_EQ_+",null,null,"D_St_ATR_C4",null,null,"D_St_EQ_B4",null,null,"El_Ag_B3",null,null,"T_St_EQ_B6",null,null,"T_St_EQ_B6",null,null,"El_M_A2",null,null,"El_M_A2"]
["Espace : Où ? Direction ?",null,null,"Espace : Où ? Direction ?",null,null,"Espace : Où ? Direction ?",null,null,"Espace : Où ? Direction ?",null,null,"Espace : Où ? Direction ?",null,null,"Espace : Où ? Direction ?",null,null,"Espace : Où ? Direction ?",null,null,"Espace : Où ? Direction ?"]
[]
[]
[]
[]
[null,"Juge ",null,null,"Juge ",null,null,"Juge ",null,null,"Juge ",null,null,"Juge ",null,null,"Juge ",null,null,"Juge ",null,null,"Juge "]
[]
["Figure / élément 9",null,null,"Figure / élément 10",null,null,"Figure / élément 11",null,null,"Figure / élément 12",null,null,"Figure / élément 13",null,null,"Figure / élément 14",null,null,"Figure / élément 15",null,null,"Figure / élément 16"]
[null,null,null,"Dynamique",null,null,"Statique",null,null,"Statique",null,null,"Elément Synchro"]
[null,null,null,"D_Dy_B2",null,null,"T_Dy_D6",null,null,"D_St_ATR_C4",null,null,"El_M_A2"]
["Espace : Où ? Direction ?",null,null,"Espace : Où ? Direction ?",null,null,"Espace : Où ? Direction ?",null,null,"Espace : Où ? Direction ?",null,null,"Espace : Où ? Direction ?",null,null,"Espace : Où ? Direction ?",null,null,"Espace : Où ? Direction ?",null,null,"Espace : Où ? Direction ?"]
[]
[]
[]
[]
[null,"Juge ",null,null,"Juge ",null,null,"Juge ",null,null,"Juge ",null,null,"Juge ",null,null,"Juge ",null,null,"Juge ",null,null,"Juge "]

{"sheet":"G2","index":5,"n_rows":34,"n_cols":17,"rows_kept":34,"cut":false,"hidden":false,"merged":[[30,13,30,14],[30,15,30,16],[32,3,32,4],[32,5,32,6],[32,7,32,8],[32,9,32,10],[32,11,32,12],[32,13,32,14],[30,11,30,12],[30,1,33,2],[30,3,30,4],[30,5,30,6],[30,7,30,8],[30,9,30,10],[24,13,24,14],[24,15,24,16],[26,3,26,4],[26,5,26,6],[26,7,26,8],[26,9,26,10],[26,11,26,12],[26,13,26,14],[24,11,24,12],[24,1,27,2],[24,3,24,4],[24,5,24,6],[24,7,24,8],[24,9,24,10],[18,7,18,8],[18,9,18,10],[18,13,18,14],[18,15,18,16],[20,3,20,4],[20,5,20,6],[20,7,20,8],[20,9,20,10],[20,11,20,12],[20,13,20,14],[18,11,18,12],[12,9,12,10],[12,13,12,14],[12,15,12,16],[14,3,14,4],[14,5,14,6],[14,7,14,8],[14,9,14,10],[14,11,14,12],[14,13,14,14],[12,11,12,12],[6,9,6,10],[6,11,6,12],[6,13,6,14],[6,15,6,16],[8,3,8,4],[8,5,8,6],[8,7,8,8],[8,9,8,10],[8,11,8,12],[8,13,8,14],[0,11,0,12],[0,13,0,14],[0,15,0,16],[2,3,2,4],[2,5,2,6],[2,7,2,8],[2,9,2,10],[2,11,2,12],[2,13,2,14],[0,9,0,10],[0,0,33,0],[0,1,3,2],[0,3,0,4],[0,5,0,6],[0,7,0,8],[6,1,9,2],[6,3,6,4],[6,5,6,6],[6,7,6,8],[12,1,15,2],[12,3,12,4],[12,5,12,6],[12,7,12,8],[18,1,21,2],[18,3,18,4],[18,5,18,6]]}
["Groupe 2",{"$f":"IF(Groupes!F3=\"\",\"\",Groupes!F3&\" \"&Groupes!G3)","v":"Hebert Georges"},null,"Figure / élément 1",null,"Figure / élément 2",null,"Figure / élément 3",null,"Figure / élément 4",null,"Figure / élément 5",null,"Figure / élément 6",null,"Exigence validé ou non"]
[null,null,null,"D_St_EQ_","D4","D_St_ATR_","B2","D_Dy_","B2","T_St_PV_","B1","T_St_EQ_","B6","Q_St_ATR_","C1","Points execution",{"$f":"IF(AND(E4=\"\",G4=\"\",I4=\"\",K4=\"\",M4=\"\",O4=\"\"),\"\",(COUNTIF(D4:O4,\"A\")*0.4)+(COUNTIF(D4:O4,\"B\")*0.6)+(COUNTIF(D4:O4,\"C\")*0.8)+(COUNTIF(D4:O4,\"D\")))","v":4.2}]
[null,null,null,{"$f":"IF(OR(D2=\"\",E2=\"\"),\"\",D2&\"\"&E2)","v":"D_St_EQ_D4"},null,{"$f":"IF(OR(F2=\"\",G2=\"\"),\"\",F2&\"\"&G2)","v":"D_St_ATR_B2"},null,{"$f":"IF(OR(H2=\"\",I2=\"\"),\"\",H2&\"\"&I2)","v":"D_Dy_B2"},null,{"$f":"IF(OR(J2=\"\",K2=\"\"),\"\",J2&\"\"&K2)","v":"T_St_PV_B1"},null,{"$f":"IF(OR(L2=\"\",M2=\"\"),\"\",L2&\"\"&M2)","v":"T_St_EQ_B6"},null,{"$f":"IF(OR(N2=\"\",O2=\"\"),\"\",N2&\"\"&O2)","v":"Q_St_ATR_C1"},null,"P /V présent",{"$f":"IF(AND(D4=\"\",F4=\"\",H4=\"\",J4=\"\",L4=\"\",N4=\"\"),\"\",AND(OR(D4=\"P\",F4=\"P\",H4=\"P\",J4=\"P\",L4=\"P\",N4=\"P\"),OR(D4=\"V\",F4=\"V\",H4=\"V\",J4=\"V\",L4=\"V\",N4=\"V\")))","v":false}]
[null,null,null,"P",{"$f":"IF(D3=\"\",\"\",IFERROR(VLOOKUP(D3,Tableau_Images!$A$2:$D$231,2,0),\"?\"))","v":"D"},"P",{"$f":"IF(F3=\"\",\"\",IFERROR(VLOOKUP(F3,Tableau_Images!$A$2:$D$231,2,0),\"?\"))","v":"B"},"P",{"$f":"IF(H3=\"\",\"\",IFERROR(VLOOKUP(H3,Tableau_Images!$A$2:$D$231,2,0),\"?\"))","v":"B"},"P",{"$f":"IF(J3=\"\",\"\",IFERROR(VLOOKUP(J3,Tableau_Images!$A$2:$D$231,2,0),\"?\"))","v":"B"},"P",{"$f":"IF(L3=\"\",\"\",IFERROR(VLOOKUP(L3,Tableau_Images!$A$2:$D$231,2,0),\"?\"))","v":"B"},"P",{"$f":"IF(N3=\"\",\"\",IFERROR(VLOOKUP(N3,Tableau_Images!$A$2:$D$231,2,0),\"?\"))","v":"C"},"El Ind/El Syn Présent",{"$f":"IF(AND(D4=\"\",F4=\"\",H4=\"\",J4=\"\",L4=\"\",N4=\"\"),\"\",AND(OR(D4=\"El Ind\",F4=\"El Ind\",H4=\"El Ind\",J4=\"El Ind\",L4=\"El Ind\",N4=\"El Ind\"),OR(D4=\"El Syn\",F4=\"El Syn\",H4=\"El Syn\",J4=\"El Syn\",L4=\"El Syn\",N4=\"El Syn\")))","v":false}]
[]
[]
[null,{"$f":"IF(Groupes!F4=\"\",\"\",Groupes!F4&\" \"&Groupes!G4)","v":"Tissié Phillippe"},null,"Figure / élément 1",null,"Figure / élément 2",null,"Figure / élément 3",null,"Figure / élément 4",null,"Figure / élément 5",null,"Figure / élément 6",null,"Exigence Validé ou non"]
[null,null,null,"D_Dy_","B1","D_St_EQ_","B1","D_Dy_","B1","D_St_ATR_","B3","D_Dy_","A2","T_St_PV_","A6","Points execution",{"$f":"IF(AND(E10=\"\",G10=\"\",I10=\"\",K10=\"\",M10=\"\",O10=\"\"),\"\",(COUNTIF(D10:O10,\"A\")*0.4)+(COUNTIF(D10:O10,\"B\")*0.6)+(COUNTIF(D10:O10,\"C\")*0.8)+(COUNTIF(D10:O10,\"D\")))","v":3.2}]
[null,null,null,{"$f":"IF(OR(D8=\"\",E8=\"\"),\"\",D8&\"\"&E8)","v":"D_Dy_B1"},null,{"$f":"IF(OR(F8=\"\",G8=\"\"),\"\",F8&\"\"&G8)","v":"D_St_EQ_B1"},null,{"$f":"IF(OR(H8=\"\",I8=\"\"),\"\",H8&\"\"&I8)","v":"D_Dy_B1"},null,{"$f":"IF(OR(J8=\"\",K8=\"\"),\"\",J8&\"\"&K8)","v":"D_St_ATR_B3"},null,{"$f":"IF(OR(L8=\"\",M8=\"\"),\"\",L8&\"\"&M8)","v":"D_Dy_A2"},null,{"$f":"IF(OR(N8=\"\",O8=\"\"),\"\",N8&\"\"&O8)","v":"T_St_PV_A6"},null,"P /V présent",{"$f":"IF(AND(D10=\"\",F10=\"\",H10=\"\",J10=\"\",L10=\"\",N10=\"\"),\"\",AND(OR(D10=\"P\",F10=\"P\",H10=\"P\",J10=\"P\",L10=\"P\",N10=\"P\"),OR(D10=\"V\",F10=\"V\",H10=\"V\",J10=\"V\",L10=\"V\",N10=\"V\")))","v":false}]
[null,null,null,"V",{"$f":"IF(D9=\"\",\"\",IFERROR(VLOOKUP(D9,Tableau_Images!$A$2:$D$231,2,0),\"?\"))","v":"B"},"V",{"$f":"IF(F9=\"\",\"\",IFERROR(VLOOKUP(F9,Tableau_Images!$A$2:$D$231,2,0),\"?\"))","v":"B"},"V",{"$f":"IF(H9=\"\",\"\",IFERROR(VLOOKUP(H9,Tableau_Images!$A$2:$D$231,2,0),\"?\"))","v":"B"},"V",{"$f":"IF(J9=\"\",\"\",IFERROR(VLOOKUP(J9,Tableau_Images!$A$2:$D$231,2,0),\"?\"))","v":"B"},"V",{"$f":"IF(L9=\"\",\"\",IFERROR(VLOOKUP(L9,Tableau_Images!$A$2:$D$231,2,0),\"?\"))","v":"A"},"V",{"$f":"IF(N9=\"\",\"\",IFERROR(VLOOKUP(N9,Tableau_Images!$A$2:$D$231,2,0),\"?\"))","v":"A"},"El Ind/El Syn Présent",{"$f":"IF(AND(D10=\"\",F10=\"\",H10=\"\",J10=\"\",L10=\"\",N10=\"\"),\"\",AND(OR(D10=\"El Ind\",F10=\"El Ind\",H10=\"El Ind\",J10=\"El Ind\",L10=\"El Ind\",N10=\"El Ind\"),OR(D10=\"El Syn\",F10=\"El Syn\",H10=\"El Syn\",J10=\"El Syn\",L10=\"El Syn\",N10=\"El Syn\")))","v":false}]
[]
[]
[null,{"$f":"IF(Groupes!F5=\"\",\"\",Groupes!F5&\" \"&Groupes!G5)","v":"Leboulch Jean"},null,"Figure / élément 1",null,"Figure / élément 2",null,"Figure / élément 3",null,"Figure / élément 4",null,"Figure / élément 5",null,"Figure / élément 6",null,"Exigence Validé ou non"]
[null,null,null,"D_Dy_","B1","D_Dy_","B2","Q_St_PV_","A1","D_Dy_","B1","D_Dy_","B3","T_St_PV_","B4","Points execution",{"$f":"IF(AND(E16=\"\",G16=\"\",I16=\"\",K16=\"\",M16=\"\",O16=\"\"),\"\",(COUNTIF(D16:O16,\"A\")*0.4)+(COUNTIF(D16:O16,\"B\")*0.6)+(COUNTIF(D16:O16,\"C\")*0.8)+(COUNTIF(D16:O16,\"D\")))","v":3.4}]
[null,null,null,{"$f":"IF(OR(D14=\"\",E14=\"\"),\"\",D14&\"\"&E14)","v":"D_Dy_B1"},null,{"$f":"IF(OR(F14=\"\",G14=\"\"),\"\",F14&\"\"&G14)","v":"D_Dy_B2"},null,{"$f":"IF(OR(H14=\"\",I14=\"\"),\"\",H14&\"\"&I14)","v":"Q_St_PV_A1"},null,{"$f":"IF(OR(J14=\"\",K14=\"\"),\"\",J14&\"\"&K14)","v":"D_Dy_B1"},null,{"$f":"IF(OR(L14=\"\",M14=\"\"),\"\",L14&\"\"&M14)","v":"D_Dy_B3"},null,{"$f":"IF(OR(N14=\"\",O14=\"\"),\"\",N14&\"\"&O14)","v":"T_St_PV_B4"},null,"P /V présent",{"$f":"IF(AND(D16=\"\",F16=\"\",H16=\"\",J16=\"\",L16=\"\",N16=\"\"),\"\",AND(OR(D16=\"P\",F16=\"P\",H16=\"P\",J16=\"P\",L16=\"P\",N16=\"P\"),OR(D16=\"V\",F16=\"V\",H16=\"V\",J16=\"V\",L16=\"V\",N16=\"V\")))","v":false}]
[null,null,null,"El Ind",{"$f":"IF(D15=\"\",\"\",IFERROR(VLOOKUP(D15,Tableau_Images!$A$2:$D$231,2,0),\"?\"))","v":"B"},"El Ind",{"$f":"IF(F15=\"\",\"\",IFERROR(VLOOKUP(F15,Tableau_Images!$A$2:$D$231,2,0),\"?\"))","v":"B"},"El Ind",{"$f":"IF(H15=\"\",\"\",IFERROR(VLOOKUP(H15,Tableau_Images!$A$2:$D$231,2,0),\"?\"))","v":"A"},"El Ind",{"$f":"IF(J15=\"\",\"\",IFERROR(VLOOKUP(J15,Tableau_Images!$A$2:$D$231,2,0),\"?\"))","v":"B"},"El Ind",{"$f":"IF(L15=\"\",\"\",IFERROR(VLOOKUP(L15,Tableau_Images!$A$2:$D$231,2,0),\"?\"))","v":"B"},"El Ind",{"$f":"IF(N15=\"\",\"\",IFERROR(VLOOKUP(N15,Tableau_Images!$A$2:$D$231,2,0),\"?\"))","v":"B"},"El Ind/El Syn Présent",{"$f":"IF(AND(D16=\"\",F16=\"\",H16=\"\",J16=\"\",L16=\"\",N16=\"\"),\"\",AND(OR(D16=\"El Ind\",F16=\"El Ind\",H16=\"El Ind\",J16=\"El Ind\",L16=\"El Ind\",N16=\"El Ind\"),OR(D16=\"El Syn\",F16=\"El Syn\",H16=\"El Syn\",J16=\"El Syn\",L16=\"El Syn\",N16=\"El Syn\")))","v":false}]
[]
[]
[null,{"$f":"IF(Groupes!F6=\"\",\"\",Groupes!F6&\" \"&Groupes!G6)","v":"Mérand Robert"},null,"Figure / élément 1",null,"Figure / élément 2",null,"Figure / élément 3",null,"Figure / élément 4",null,"Figure / élément 5",null,"Figure / élément 6",null,"Exigence Validé ou non"]
[null,null,null,"D_Dy_","B1","El_M_","B3","El_M_","B3","El_Ag_","B3","El_Ag_","B3","El_Ag_","C2","Points execution",{"$f":"IF(AND(E22=\"\",G22=\"\",I22=\"\",K22=\"\",M22=\"\",O22=\"\"),\"\",(COUNTIF(D22:O22,\"A\")*0.4)+(COUNTIF(D22:O22,\"B\")*0.6)+(COUNTIF(D22:O22,\"C\")*0.8)+(COUNTIF(D22:O22,\"D\")))","v":3.8}]
[null,null,null,{"$f":"IF(OR(D20=\"\",E20=\"\"),\"\",D20&\"\"&E20)","v":"D_Dy_B1"},null,{"$f":"IF(OR(F20=\"\",G20=\"\"),\"\",F20&\"\"&G20)","v":"El_M_B3"},null,{"$f":"IF(OR(H20=\"\",I20=\"\"),\"\",H20&\"\"&I20)","v":"El_M_B3"},null,{"$f":"IF(OR(J20=\"\",K20=\"\"),\"\",J20&\"\"&K20)","v":"El_Ag_B3"},null,{"$f":"IF(OR(L20=\"\",M20=\"\"),\"\",L20&\"\"&M20)","v":"El_Ag_B3"},null,{"$f":"IF(OR(N20=\"\",O20=\"\"),\"\",N20&\"\"&O20)","v":"El_Ag_C2"},null,"P /V présent",{"$f":"IF(AND(D22=\"\",F22=\"\",H22=\"\",J22=\"\",L22=\"\",N22=\"\"),\"\",AND(OR(D22=\"P\",F22=\"P\",H22=\"P\",J22=\"P\",L22=\"P\",N22=\"P\"),OR(D22=\"V\",F22=\"V\",H22=\"V\",J22=\"V\",L22=\"V\",N22=\"V\")))","v":false}]
[null,null,null,"El Syn",{"$f":"IF(D21=\"\",\"\",IFERROR(VLOOKUP(D21,Tableau_Images!$A$2:$D$231,2,0),\"?\"))","v":"B"},"El Syn",{"$f":"IF(F21=\"\",\"\",IFERROR(VLOOKUP(F21,Tableau_Images!$A$2:$D$231,2,0),\"?\"))","v":"B"},"El Syn",{"$f":"IF(H21=\"\",\"\",IFERROR(VLOOKUP(H21,Tableau_Images!$A$2:$D$231,2,0),\"?\"))","v":"B"},"El Syn",{"$f":"IF(J21=\"\",\"\",IFERROR(VLOOKUP(J21,Tableau_Images!$A$2:$D$231,2,0),\"?\"))","v":"B"},"El Syn",{"$f":"IF(L21=\"\",\"\",IFERROR(VLOOKUP(L21,Tableau_Images!$A$2:$D$231,2,0),\"?\"))","v":"B"},"El Syn",{"$f":"IF(N21=\"\",\"\",IFERROR(VLOOKUP(N21,Tableau_Images!$A$2:$D$231,2,0),\"?\"))","v":"C"},"El Ind/El Syn Présent",{"$f":"IF(AND(D22=\"\",F22=\"\",H22=\"\",J22=\"\",L22=\"\",N22=\"\"),\"\",AND(OR(D22=\"El Ind\",F22=\"El Ind\",H22=\"El Ind\",J22=\"El Ind\",L22=\"El Ind\",N22=\"El Ind\"),OR(D22=\"El Syn\",F22=\"El Syn\",H22=\"El Syn\",J22=\"El Syn\",L22=\"El Syn\",N22=\"El Syn\")))","v":false}]
[]
[]
[null,{"$f":"IF(Groupes!F7=\"\",\"\",Groupes!F7&\" \"&Groupes!G7)","v":"Coubertin Pierre"},null,"Figure / élément 1",null,"Figure / élément 2",null,"Figure / élément 3",null,"Figure / élément 4",null,"Figure / élément 5",null,"Figure / élément 6",null,"Exigence Validé ou non"]
[null,null,null,"D_Dy_","B1","T_St_PV_","B3","El_Sou_","B2","D_Dy_","B3","T_St_EQ_","B2","El_Ag_","C2","Points execution",{"$f":"IF(AND(E28=\"\",G28=\"\",I28=\"\",K28=\"\",M28=\"\",O28=\"\"),\"\",(COUNTIF(D28:O28,\"A\")*0.4)+(COUNTIF(D28:O28,\"B\")*0.6)+(COUNTIF(D28:O28,\"C\")*0.8)+(COUNTIF(D28:O28,\"D\")))","v":3.8}]
[null,null,null,{"$f":"IF(OR(D26=\"\",E26=\"\"),\"\",D26&\"\"&E26)","v":"D_Dy_B1"},null,{"$f":"IF(OR(F26=\"\",G26=\"\"),\"\",F26&\"\"&G26)","v":"T_St_PV_B3"},null,{"$f":"IF(OR(H26=\"\",I26=\"\"),\"\",H26&\"\"&I26)","v":"El_Sou_B2"},null,{"$f":"IF(OR(J26=\"\",K26=\"\"),\"\",J26&\"\"&K26)","v":"D_Dy_B3"},null,{"$f":"IF(OR(L26=\"\",M26=\"\"),\"\",L26&\"\"&M26)","v":"T_St_EQ_B2"},null,{"$f":"IF(OR(N26=\"\",O26=\"\"),\"\",N26&\"\"&O26)","v":"El_Ag_C2"},null,"P /V présent",{"$f":"IF(AND(D28=\"\",F28=\"\",H28=\"\",J28=\"\",L28=\"\",N28=\"\"),\"\",AND(OR(D28=\"P\",F28=\"P\",H28=\"P\",J28=\"P\",L28=\"P\",N28=\"P\"),OR(D28=\"V\",F28=\"V\",H28=\"V\",J28=\"V\",L28=\"V\",N28=\"V\")))","v":true}]
[null,null,null,"P",{"$f":"IF(D27=\"\",\"\",IFERROR(VLOOKUP(D27,Tableau_Images!$A$2:$D$231,2,0),\"?\"))","v":"B"},"V",{"$f":"IF(F27=\"\",\"\",IFERROR(VLOOKUP(F27,Tableau_Images!$A$2:$D$231,2,0),\"?\"))","v":"B"},"El Ind",{"$f":"IF(H27=\"\",\"\",IFERROR(VLOOKUP(H27,Tableau_Images!$A$2:$D$231,2,0),\"?\"))","v":"B"},"V",{"$f":"IF(J27=\"\",\"\",IFERROR(VLOOKUP(J27,Tableau_Images!$A$2:$D$231,2,0),\"?\"))","v":"B"},"V",{"$f":"IF(L27=\"\",\"\",IFERROR(VLOOKUP(L27,Tableau_Images!$A$2:$D$231,2,0),\"?\"))","v":"B"},"El Ind",{"$f":"IF(N27=\"\",\"\",IFERROR(VLOOKUP(N27,Tableau_Images!$A$2:$D$231,2,0),\"?\"))","v":"C"},"El Ind/El Syn Présent",{"$f":"IF(AND(D28=\"\",F28=\"\",H28=\"\",J28=\"\",L28=\"\",N28=\"\"),\"\",AND(OR(D28=\"El Ind\",F28=\"El Ind\",H28=\"El Ind\",J28=\"El Ind\",L28=\"El Ind\",N28=\"El Ind\"),OR(D28=\"El Syn\",F28=\"El Syn\",H28=\"El Syn\",J28=\"El Syn\",L28=\"El Syn\",N28=\"El Syn\")))","v":false}]
[]
[]
[null,{"$f":"IF(Groupes!F8=\"\",\"\",Groupes!F8&\" \"&Groupes!G8)","v":""},null,"Figure / élément 1",null,"Figure / élément 2",null,"Figure / élément 3",null,"Figure / élément 4",null,"Figure / élément 5",null,"Figure / élément 6",null,"Exigence Validé ou non"]
[null,null,null,null,null,null,null,null,null,null,null,null,null,null,null,"Points execution",{"$f":"IF(AND(E34=\"\",G34=\"\",I34=\"\",K34=\"\",M34=\"\",O34=\"\"),\"\",(COUNTIF(D34:O34,\"A\")*0.4)+(COUNTIF(D34:O34,\"B\")*0.6)+(COUNTIF(D34:O34,\"C\")*0.8)+(COUNTIF(D34:O34,\"D\")))","v":""}]
[null,null,null,{"$f":"IF(OR(D32=\"\",E32=\"\"),\"\",D32&\"\"&E32)","v":""},null,{"$f":"IF(OR(F32=\"\",G32=\"\"),\"\",F32&\"\"&G32)","v":""},null,{"$f":"IF(OR(H32=\"\",I32=\"\"),\"\",H32&\"\"&I32)","v":""},null,{"$f":"IF(OR(J32=\"\",K32=\"\"),\"\",J32&\"\"&K32)","v":""},null,{"$f":"IF(OR(L32=\"\",M32=\"\"),\"\",L32&\"\"&M32)","v":""},null,{"$f":"IF(OR(N32=\"\",O32=\"\"),\"\",N32&\"\"&O32)","v":""},null,"P /V présent",{"$f":"IF(AND(D34=\"\",F34=\"\",H34=\"\",J34=\"\",L34=\"\",N34=\"\"),\"\",AND(OR(D34=\"P\",F34=\"P\",H34=\"P\",J34=\"P\",L34=\"P\",N34=\"P\"),OR(D34=\"V\",F34=\"V\",H34=\"V\",J34=\"V\",L34=\"V\",N34=\"V\")))","v":""}]
[null,null,null,null,{"$f":"IF(D33=\"\",\"\",IFERROR(VLOOKUP(D33,Tableau_Images!$A$2:$D$231,2,0),\"?\"))","v":""},null,{"$f":"IF(F33=\"\",\"\",IFERROR(VLOOKUP(F33,Tableau_Images!$A$2:$D$231,2,0),\"?\"))","v":""},null,{"$f":"IF(H33=\"\",\"\",IFERROR(VLOOKUP(H33,Tableau_Images!$A$2:$D$231,2,0),\"?\"))","v":""},null,{"$f":"IF(J33=\"\",\"\",IFERROR(VLOOKUP(J33,Tableau_Images!$A$2:$D$231,2,0),\"?\"))","v":""},null,{"$f":"IF(L33=\"\",\"\",IFERROR(VLOOKUP(L33,Tableau_Images!$A$2:$D$231,2,0),\"?\"))","v":""},null,{"$f":"IF(N33=\"\",\"\",IFERROR(VLOOKUP(N33,Tableau_Images!$A$2:$D$231,2,0),\"?\"))","v":""},"El Ind/El Syn Présent",{"$f":"IF(AND(D34=\"\",F34=\"\",H34=\"\",J34=\"\",L34=\"\",N34=\"\"),\"\",AND(OR(D34=\"El Ind\",F34=\"El Ind\",H34=\"El Ind\",J34=\"El Ind\",L34=\"El Ind\",N34=\"El Ind\"),OR(D34=\"El Syn\",F34=\"El Syn\",H34=\"El Syn\",J34=\"El Syn\",L34=\"El Syn\",N34=\"El Syn\")))","v":""}]

{"sheet":"G2_C","index":6,"n_rows":20,"n_cols":23,"rows_kept":20,"cut":false,"hidden":true,"merged":[[15,17,18,17],[14,0,14,2],[14,3,14,5],[14,6,14,8],[14,9,14,11],[14,12,14,14],[14,15,14,17],[14,18,14,20],[14,21,14,23],[15,6,18,6],[15,7,18,7],[15,8,18,8],[15,9,18,9],[15,10,18,10],[15,11,18,11],[15,0,18,0],[15,1,18,1],[11,15,11,17],[15,2,18,2],[15,3,18,3],[15,4,18,4],[15,5,18,5],[15,18,18,18],[15,19,18,19],[15,20,18,20],[15,21,18,21],[13,0,13,2],[13,3,13,5],[13,6,13,8],[13,9,13,11],[13,12,13,14],[13,15,13,17],[13,18,13,20],[13,21,13,23],[15,22,18,22],[15,23,18,23],[15,12,18,12],[15,13,18,13],[15,14,18,14],[15,15,18,15],[15,16,18,16],[11,18,11,20],[11,21,11,23],[12,18,12,20],[12,21,12,23],[5,22,8,22],[5,23,8,23],[5,12,8,12],[5,13,8,13],[5,14,8,14],[5,15,8,15],[5,16,8,16],[5,17,8,17],[10,0,10,23],[12,0,12,2],[12,3,12,5],[12,6,12,8],[12,9,12,11],[12,12,12,14],[12,15,12,17],[11,0,11,2],[11,3,11,5],[11,6,11,8],[11,9,11,11],[11,12,11,14],[4,0,4,2],[4,3,4,5],[4,6,4,8],[4,9,4,11],[4,12,4,14],[4,15,4,17],[4,18,4,20],[4,21,4,23],[5,6,8,6],[5,7,8,7],[5,8,8,8],[5,9,8,9],[5,10,8,10],[5,11,8,11],[5,0,8,0],[5,1,8,1],[5,2,8,2],[5,3,8,3],[5,4,8,4],[5,5,8,5],[5,18,8,18],[5,19,8,19],[5,20,8,20],[5,21,8,21],[2,18,2,20],[2,21,2,23],[3,0,3,2],[3,3,3,5],[3,6,3,8],[3,9,3,11],[3,12,3,14],[3,15,3,17],[3,18,3,20],[3,21,3,23],[2,0,2,2],[2,3,2,5],[2,6,2,8],[2,9,2,11],[2,12,2,14],[2,15,2,17],[0,0,0,11],[0,12,0,23],[1,0,1,2],[1,3,1,5],[1,6,1,8],[1,9,1,11],[1,12,1,14],[1,15,1,17],[1,18,1,20],[1,21,1,23]]}
[{"$f":"IF(Groupes!H1=\"\",\"\",\"Groupe 2\")","v":"Groupe 2"},null,null,null,null,null,null,null,null,null,null,null,": Projet collectif"]
["Figure / élément 1",null,null,"Figure / élément 2",null,null,"Figure / élément 3",null,null,"Figure / élément 4",null,null,"Figure / élément 5",null,null,"Figure / élément 6",null,null,"Figure / élément 7",null,null,"Figure / élément 8"]
[]
["",null,null,"",null,null,"",null,null,"",null,null,"",null,null,"",null,null,"",null,null,""]
["Espace : Où ? Direction ?",null,null,"Espace : Où ? Direction ?",null,null,"Espace : Où ? Direction ?",null,null,"Espace : Où ? Direction ?",null,null,"Espace : Où ? Direction ?",null,null,"Espace : Où ? Direction ?",null,null,"Espace : Où ? Direction ?",null,null,"Espace : Où ? Direction ?"]
[]
[]
[]
[]
[null,"Juge ",null,null,"Juge ",null,null,"Juge ",null,null,"Juge ",null,null,"Juge ",null,null,"Juge ",null,null,"Juge ",null,null,"Juge "]
[]
["Figure / élément 9",null,null,"Figure / élément 10",null,null,"Figure / élément 11",null,null,"Figure / élément 12",null,null,"Figure / élément 13",null,null,"Figure / élément 14",null,null,"Figure / élément 15",null,null,"Figure / élément 16"]
[]
["",null,null,"",null,null,"",null,null,"",null,null,"",null,null,"",null,null,"",null,null,""]
["Espace : Où ? Direction ?",null,null,"Espace : Où ? Direction ?",null,null,"Espace : Où ? Direction ?",null,null,"Espace : Où ? Direction ?",null,null,"Espace : Où ? Direction ?",null,null,"Espace : Où ? Direction ?",null,null,"Espace : Où ? Direction ?",null,null,"Espace : Où ? Direction ?"]
[]
[]
[]
[]
[null,"Juge ",null,null,"Juge ",null,null,"Juge ",null,null,"Juge ",null,null,"Juge ",null,null,"Juge ",null,null,"Juge ",null,null,"Juge "]

{"sheet":"G3","index":7,"n_rows":34,"n_cols":17,"rows_kept":34,"cut":false,"hidden":false,"merged":[[30,13,30,14],[30,15,30,16],[32,3,32,4],[32,5,32,6],[32,7,32,8],[32,9,32,10],[32,11,32,12],[32,13,32,14],[30,11,30,12],[30,1,33,2],[30,3,30,4],[30,5,30,6],[30,7,30,8],[30,9,30,10],[24,13,24,14],[24,15,24,16],[26,3,26,4],[26,5,26,6],[26,7,26,8],[26,9,26,10],[26,11,26,12],[26,13,26,14],[24,11,24,12],[24,1,27,2],[24,3,24,4],[24,5,24,6],[24,7,24,8],[24,9,24,10],[18,7,18,8],[18,9,18,10],[18,13,18,14],[18,15,18,16],[20,3,20,4],[20,5,20,6],[20,7,20,8],[20,9,20,10],[20,11,20,12],[20,13,20,14],[18,11,18,12],[12,9,12,10],[12,13,12,14],[12,15,12,16],[14,3,14,4],[14,5,14,6],[14,7,14,8],[14,9,14,10],[14,11,14,12],[14,13,14,14],[12,11,12,12],[6,9,6,10],[6,11,6,12],[6,13,6,14],[6,15,6,16],[8,3,8,4],[8,5,8,6],[8,7,8,8],[8,9,8,10],[8,11,8,12],[8,13,8,14],[0,11,0,12],[0,13,0,14],[0,15,0,16],[2,3,2,4],[2,5,2,6],[2,7,2,8],[2,9,2,10],[2,11,2,12],[2,13,2,14],[0,9,0,10],[0,0,33,0],[0,1,3,2],[0,3,0,4],[0,5,0,6],[0,7,0,8],[6,1,9,2],[6,3,6,4],[6,5,6,6],[6,7,6,8],[12,1,15,2],[12,3,12,4],[12,5,12,6],[12,7,12,8],[18,1,21,2],[18,3,18,4],[18,5,18,6]]}
["Groupe 3",{"$f":"IF(Groupes!K3=\"\",\"\",Groupes!K3&\" \"&Groupes!L3)","v":""},null,"Figure / élément 1",null,"Figure / élément 2",null,"Figure / élément 3",null,"Figure / élément 4",null,"Figure / élément 5",null,"Figure / élément 6",null,"Exigence validé ou non"]
[null,null,null,"D_St_PV_","A1",null,null,null,null,null,null,null,null,null,null,"Points execution",{"$f":"IF(AND(E4=\"\",G4=\"\",I4=\"\",K4=\"\",M4=\"\",O4=\"\"),\"\",(COUNTIF(D4:O4,\"A\")*0.4)+(COUNTIF(D4:O4,\"B\")*0.6)+(COUNTIF(D4:O4,\"C\")*0.8)+(COUNTIF(D4:O4,\"D\")))","v":0.4}]
[null,null,null,{"$f":"IF(OR(D2=\"\",E2=\"\"),\"\",D2&\"\"&E2)","v":"D_St_PV_A1"},null,{"$f":"IF(OR(F2=\"\",G2=\"\"),\"\",F2&\"\"&G2)","v":""},null,{"$f":"IF(OR(H2=\"\",I2=\"\"),\"\",H2&\"\"&I2)","v":""},null,{"$f":"IF(OR(J2=\"\",K2=\"\"),\"\",J2&\"\"&K2)","v":""},null,{"$f":"IF(OR(L2=\"\",M2=\"\"),\"\",L2&\"\"&M2)","v":""},null,{"$f":"IF(OR(N2=\"\",O2=\"\"),\"\",N2&\"\"&O2)","v":""},null,"P /V présent",{"$f":"IF(AND(D4=\"\",F4=\"\",H4=\"\",J4=\"\",L4=\"\",N4=\"\"),\"\",AND(OR(D4=\"P\",F4=\"P\",H4=\"P\",J4=\"P\",L4=\"P\",N4=\"P\"),OR(D4=\"V\",F4=\"V\",H4=\"V\",J4=\"V\",L4=\"V\",N4=\"V\")))","v":""}]
[null,null,null,null,{"$f":"IF(D3=\"\",\"\",IFERROR(VLOOKUP(D3,Tableau_Images!$A$2:$D$231,2,0),\"?\"))","v":"A"},null,{"$f":"IF(F3=\"\",\"\",IFERROR(VLOOKUP(F3,Tableau_Images!$A$2:$D$231,2,0),\"?\"))","v":""},null,{"$f":"IF(H3=\"\",\"\",IFERROR(VLOOKUP(H3,Tableau_Images!$A$2:$D$231,2,0),\"?\"))","v":""},null,{"$f":"IF(J3=\"\",\"\",IFERROR(VLOOKUP(J3,Tableau_Images!$A$2:$D$231,2,0),\"?\"))","v":""},null,{"$f":"IF(L3=\"\",\"\",IFERROR(VLOOKUP(L3,Tableau_Images!$A$2:$D$231,2,0),\"?\"))","v":""},null,{"$f":"IF(N3=\"\",\"\",IFERROR(VLOOKUP(N3,Tableau_Images!$A$2:$D$231,2,0),\"?\"))","v":""},"El Ind/El Syn Présent",{"$f":"IF(AND(D4=\"\",F4=\"\",H4=\"\",J4=\"\",L4=\"\",N4=\"\"),\"\",AND(OR(D4=\"El Ind\",F4=\"El Ind\",H4=\"El Ind\",J4=\"El Ind\",L4=\"El Ind\",N4=\"El Ind\"),OR(D4=\"El Syn\",F4=\"El Syn\",H4=\"El Syn\",J4=\"El Syn\",L4=\"El Syn\",N4=\"El Syn\")))","v":""}]
[]
[]
[null,{"$f":"IF(Groupes!K4=\"\",\"\",Groupes!K4&\" \"&Groupes!L4)","v":""},null,"Figure / élément 1",null,"Figure / élément 2",null,"Figure / élément 3",null,"Figure / élément 4",null,"Figure / élément 5",null,"Figure / élément 6",null,"Exigence Validé ou non"]
[null,null,null,null,null,null,null,null,null,null,null,null,null,null,null,"Points execution",{"$f":"IF(AND(E10=\"\",G10=\"\",I10=\"\",K10=\"\",M10=\"\",O10=\"\"),\"\",(COUNTIF(D10:O10,\"A\")*0.4)+(COUNTIF(D10:O10,\"B\")*0.6)+(COUNTIF(D10:O10,\"C\")*0.8)+(COUNTIF(D10:O10,\"D\")))","v":""}]
[null,null,null,{"$f":"IF(OR(D8=\"\",E8=\"\"),\"\",D8&\"\"&E8)","v":""},null,{"$f":"IF(OR(F8=\"\",G8=\"\"),\"\",F8&\"\"&G8)","v":""},null,{"$f":"IF(OR(H8=\"\",I8=\"\"),\"\",H8&\"\"&I8)","v":""},null,{"$f":"IF(OR(J8=\"\",K8=\"\"),\"\",J8&\"\"&K8)","v":""},null,{"$f":"IF(OR(L8=\"\",M8=\"\"),\"\",L8&\"\"&M8)","v":""},null,{"$f":"IF(OR(N8=\"\",O8=\"\"),\"\",N8&\"\"&O8)","v":""},null,"P /V présent",{"$f":"IF(AND(D10=\"\",F10=\"\",H10=\"\",J10=\"\",L10=\"\",N10=\"\"),\"\",AND(OR(D10=\"P\",F10=\"P\",H10=\"P\",J10=\"P\",L10=\"P\",N10=\"P\"),OR(D10=\"V\",F10=\"V\",H10=\"V\",J10=\"V\",L10=\"V\",N10=\"V\")))","v":""}]
[null,null,null,null,{"$f":"IF(D9=\"\",\"\",IFERROR(VLOOKUP(D9,Tableau_Images!$A$2:$D$231,2,0),\"?\"))","v":""},null,{"$f":"IF(F9=\"\",\"\",IFERROR(VLOOKUP(F9,Tableau_Images!$A$2:$D$231,2,0),\"?\"))","v":""},null,{"$f":"IF(H9=\"\",\"\",IFERROR(VLOOKUP(H9,Tableau_Images!$A$2:$D$231,2,0),\"?\"))","v":""},null,{"$f":"IF(J9=\"\",\"\",IFERROR(VLOOKUP(J9,Tableau_Images!$A$2:$D$231,2,0),\"?\"))","v":""},null,{"$f":"IF(L9=\"\",\"\",IFERROR(VLOOKUP(L9,Tableau_Images!$A$2:$D$231,2,0),\"?\"))","v":""},null,{"$f":"IF(N9=\"\",\"\",IFERROR(VLOOKUP(N9,Tableau_Images!$A$2:$D$231,2,0),\"?\"))","v":""},"El Ind/El Syn Présent",{"$f":"IF(AND(D10=\"\",F10=\"\",H10=\"\",J10=\"\",L10=\"\",N10=\"\"),\"\",AND(OR(D10=\"El Ind\",F10=\"El Ind\",H10=\"El Ind\",J10=\"El Ind\",L10=\"El Ind\",N10=\"El Ind\"),OR(D10=\"El Syn\",F10=\"El Syn\",H10=\"El Syn\",J10=\"El Syn\",L10=\"El Syn\",N10=\"El Syn\")))","v":""}]
[]
[]
[null,{"$f":"IF(Groupes!K5=\"\",\"\",Groupes!K5&\" \"&Groupes!L5)","v":""},null,"Figure / élément 1",null,"Figure / élément 2",null,"Figure / élément 3",null,"Figure / élément 4",null,"Figure / élément 5",null,"Figure / élément 6",null,"Exigence Validé ou non"]
[null,null,null,null,null,null,null,null,null,null,null,null,null,null,null,"Points execution",{"$f":"IF(AND(E16=\"\",G16=\"\",I16=\"\",K16=\"\",M16=\"\",O16=\"\"),\"\",(COUNTIF(D16:O16,\"A\")*0.4)+(COUNTIF(D16:O16,\"B\")*0.6)+(COUNTIF(D16:O16,\"C\")*0.8)+(COUNTIF(D16:O16,\"D\")))","v":""}]
[null,null,null,{"$f":"IF(OR(D14=\"\",E14=\"\"),\"\",D14&\"\"&E14)","v":""},null,{"$f":"IF(OR(F14=\"\",G14=\"\"),\"\",F14&\"\"&G14)","v":""},null,{"$f":"IF(OR(H14=\"\",I14=\"\"),\"\",H14&\"\"&I14)","v":""},null,{"$f":"IF(OR(J14=\"\",K14=\"\"),\"\",J14&\"\"&K14)","v":""},null,{"$f":"IF(OR(L14=\"\",M14=\"\"),\"\",L14&\"\"&M14)","v":""},null,{"$f":"IF(OR(N14=\"\",O14=\"\"),\"\",N14&\"\"&O14)","v":""},null,"P /V présent",{"$f":"IF(AND(D16=\"\",F16=\"\",H16=\"\",J16=\"\",L16=\"\",N16=\"\"),\"\",AND(OR(D16=\"P\",F16=\"P\",H16=\"P\",J16=\"P\",L16=\"P\",N16=\"P\"),OR(D16=\"V\",F16=\"V\",H16=\"V\",J16=\"V\",L16=\"V\",N16=\"V\")))","v":""}]
[null,null,null,null,{"$f":"IF(D15=\"\",\"\",IFERROR(VLOOKUP(D15,Tableau_Images!$A$2:$D$231,2,0),\"?\"))","v":""},null,{"$f":"IF(F15=\"\",\"\",IFERROR(VLOOKUP(F15,Tableau_Images!$A$2:$D$231,2,0),\"?\"))","v":""},null,{"$f":"IF(H15=\"\",\"\",IFERROR(VLOOKUP(H15,Tableau_Images!$A$2:$D$231,2,0),\"?\"))","v":""},null,{"$f":"IF(J15=\"\",\"\",IFERROR(VLOOKUP(J15,Tableau_Images!$A$2:$D$231,2,0),\"?\"))","v":""},null,{"$f":"IF(L15=\"\",\"\",IFERROR(VLOOKUP(L15,Tableau_Images!$A$2:$D$231,2,0),\"?\"))","v":""},null,{"$f":"IF(N15=\"\",\"\",IFERROR(VLOOKUP(N15,Tableau_Images!$A$2:$D$231,2,0),\"?\"))","v":""},"El Ind/El Syn Présent",{"$f":"IF(AND(D16=\"\",F16=\"\",H16=\"\",J16=\"\",L16=\"\",N16=\"\"),\"\",AND(OR(D16=\"El Ind\",F16=\"El Ind\",H16=\"El Ind\",J16=\"El Ind\",L16=\"El Ind\",N16=\"El Ind\"),OR(D16=\"El Syn\",F16=\"El Syn\",H16=\"El Syn\",J16=\"El Syn\",L16=\"El Syn\",N16=\"El Syn\")))","v":""}]
[]
[]
[null,{"$f":"IF(Groupes!K6=\"\",\"\",Groupes!K6&\" \"&Groupes!L6)","v":""},null,"Figure / élément 1",null,"Figure / élément 2",null,"Figure / élément 3",null,"Figure / élément 4",null,"Figure / élément 5",null,"Figure / élément 6",null,"Exigence Validé ou non"]
[null,null,null,null,null,null,null,null,null,null,null,null,null,null,null,"Points execution",{"$f":"IF(AND(E22=\"\",G22=\"\",I22=\"\",K22=\"\",M22=\"\",O22=\"\"),\"\",(COUNTIF(D22:O22,\"A\")*0.4)+(COUNTIF(D22:O22,\"B\")*0.6)+(COUNTIF(D22:O22,\"C\")*0.8)+(COUNTIF(D22:O22,\"D\")))","v":""}]
[null,null,null,{"$f":"IF(OR(D20=\"\",E20=\"\"),\"\",D20&\"\"&E20)","v":""},null,{"$f":"IF(OR(F20=\"\",G20=\"\"),\"\",F20&\"\"&G20)","v":""},null,{"$f":"IF(OR(H20=\"\",I20=\"\"),\"\",H20&\"\"&I20)","v":""},null,{"$f":"IF(OR(J20=\"\",K20=\"\"),\"\",J20&\"\"&K20)","v":""},null,{"$f":"IF(OR(L20=\"\",M20=\"\"),\"\",L20&\"\"&M20)","v":""},null,{"$f":"IF(OR(N20=\"\",O20=\"\"),\"\",N20&\"\"&O20)","v":""},null,"P /V présent",{"$f":"IF(AND(D22=\"\",F22=\"\",H22=\"\",J22=\"\",L22=\"\",N22=\"\"),\"\",AND(OR(D22=\"P\",F22=\"P\",H22=\"P\",J22=\"P\",L22=\"P\",N22=\"P\"),OR(D22=\"V\",F22=\"V\",H22=\"V\",J22=\"V\",L22=\"V\",N22=\"V\")))","v":""}]
[null,null,null,null,{"$f":"IF(D21=\"\",\"\",IFERROR(VLOOKUP(D21,Tableau_Images!$A$2:$D$231,2,0),\"?\"))","v":""},null,{"$f":"IF(F21=\"\",\"\",IFERROR(VLOOKUP(F21,Tableau_Images!$A$2:$D$231,2,0),\"?\"))","v":""},null,{"$f":"IF(H21=\"\",\"\",IFERROR(VLOOKUP(H21,Tableau_Images!$A$2:$D$231,2,0),\"?\"))","v":""},null,{"$f":"IF(J21=\"\",\"\",IFERROR(VLOOKUP(J21,Tableau_Images!$A$2:$D$231,2,0),\"?\"))","v":""},null,{"$f":"IF(L21=\"\",\"\",IFERROR(VLOOKUP(L21,Tableau_Images!$A$2:$D$231,2,0),\"?\"))","v":""},null,{"$f":"IF(N21=\"\",\"\",IFERROR(VLOOKUP(N21,Tableau_Images!$A$2:$D$231,2,0),\"?\"))","v":""},"El Ind/El Syn Présent",{"$f":"IF(AND(D22=\"\",F22=\"\",H22=\"\",J22=\"\",L22=\"\",N22=\"\"),\"\",AND(OR(D22=\"El Ind\",F22=\"El Ind\",H22=\"El Ind\",J22=\"El Ind\",L22=\"El Ind\",N22=\"El Ind\"),OR(D22=\"El Syn\",F22=\"El Syn\",H22=\"El Syn\",J22=\"El Syn\",L22=\"El Syn\",N22=\"El Syn\")))","v":""}]
[]
[]
[null,{"$f":"IF(Groupes!K7=\"\",\"\",Groupes!K7&\" \"&Groupes!L7)","v":""},null,"Figure / élément 1",null,"Figure / élément 2",null,"Figure / élément 3",null,"Figure / élément 4",null,"Figure / élément 5",null,"Figure / élément 6",null,"Exigence Validé ou non"]
[null,null,null,null,null,null,null,null,null,null,null,null,null,null,null,"Points execution",{"$f":"IF(AND(E28=\"\",G28=\"\",I28=\"\",K28=\"\",M28=\"\",O28=\"\"),\"\",(COUNTIF(D28:O28,\"A\")*0.4)+(COUNTIF(D28:O28,\"B\")*0.6)+(COUNTIF(D28:O28,\"C\")*0.8)+(COUNTIF(D28:O28,\"D\")))","v":""}]
[null,null,null,{"$f":"IF(OR(D26=\"\",E26=\"\"),\"\",D26&\"\"&E26)","v":""},null,{"$f":"IF(OR(F26=\"\",G26=\"\"),\"\",F26&\"\"&G26)","v":""},null,{"$f":"IF(OR(H26=\"\",I26=\"\"),\"\",H26&\"\"&I26)","v":""},null,{"$f":"IF(OR(J26=\"\",K26=\"\"),\"\",J26&\"\"&K26)","v":""},null,{"$f":"IF(OR(L26=\"\",M26=\"\"),\"\",L26&\"\"&M26)","v":""},null,{"$f":"IF(OR(N26=\"\",O26=\"\"),\"\",N26&\"\"&O26)","v":""},null,"P /V présent",{"$f":"IF(AND(D28=\"\",F28=\"\",H28=\"\",J28=\"\",L28=\"\",N28=\"\"),\"\",AND(OR(D28=\"P\",F28=\"P\",H28=\"P\",J28=\"P\",L28=\"P\",N28=\"P\"),OR(D28=\"V\",F28=\"V\",H28=\"V\",J28=\"V\",L28=\"V\",N28=\"V\")))","v":""}]
[null,null,null,null,{"$f":"IF(D27=\"\",\"\",IFERROR(VLOOKUP(D27,Tableau_Images!$A$2:$D$231,2,0),\"?\"))","v":""},null,{"$f":"IF(F27=\"\",\"\",IFERROR(VLOOKUP(F27,Tableau_Images!$A$2:$D$231,2,0),\"?\"))","v":""},null,{"$f":"IF(H27=\"\",\"\",IFERROR(VLOOKUP(H27,Tableau_Images!$A$2:$D$231,2,0),\"?\"))","v":""},null,{"$f":"IF(J27=\"\",\"\",IFERROR(VLOOKUP(J27,Tableau_Images!$A$2:$D$231,2,0),\"?\"))","v":""},null,{"$f":"IF(L27=\"\",\"\",IFERROR(VLOOKUP(L27,Tableau_Images!$A$2:$D$231,2,0),\"?\"))","v":""},null,{"$f":"IF(N27=\"\",\"\",IFERROR(VLOOKUP(N27,Tableau_Images!$A$2:$D$231,2,0),\"?\"))","v":""},"El Ind/El Syn Présent",{"$f":"IF(AND(D28=\"\",F28=\"\",H28=\"\",J28=\"\",L28=\"\",N28=\"\"),\"\",AND(OR(D28=\"El Ind\",F28=\"El Ind\",H28=\"El Ind\",J28=\"El Ind\",L28=\"El Ind\",N28=\"El Ind\"),OR(D28=\"El Syn\",F28=\"El Syn\",H28=\"El Syn\",J28=\"El Syn\",L28=\"El Syn\",N28=\"El Syn\")))","v":""}]
[]
[]
[null,{"$f":"IF(Groupes!K8=\"\",\"\",Groupes!K8&\" \"&Groupes!L8)","v":""},null,"Figure / élément 1",null,"Figure / élément 2",null,"Figure / élément 3",null,"Figure / élément 4",null,"Figure / élément 5",null,"Figure / élément 6",null,"Exigence Validé ou non"]
[null,null,null,null,null,null,null,null,null,null,null,null,null,null,null,"Points execution",{"$f":"IF(AND(E34=\"\",G34=\"\",I34=\"\",K34=\"\",M34=\"\",O34=\"\"),\"\",(COUNTIF(D34:O34,\"A\")*0.4)+(COUNTIF(D34:O34,\"B\")*0.6)+(COUNTIF(D34:O34,\"C\")*0.8)+(COUNTIF(D34:O34,\"D\")))","v":""}]
[null,null,null,{"$f":"IF(OR(D32=\"\",E32=\"\"),\"\",D32&\"\"&E32)","v":""},null,{"$f":"IF(OR(F32=\"\",G32=\"\"),\"\",F32&\"\"&G32)","v":""},null,{"$f":"IF(OR(H32=\"\",I32=\"\"),\"\",H32&\"\"&I32)","v":""},null,{"$f":"IF(OR(J32=\"\",K32=\"\"),\"\",J32&\"\"&K32)","v":""},null,{"$f":"IF(OR(L32=\"\",M32=\"\"),\"\",L32&\"\"&M32)","v":""},null,{"$f":"IF(OR(N32=\"\",O32=\"\"),\"\",N32&\"\"&O32)","v":""},null,"P /V présent",{"$f":"IF(AND(D34=\"\",F34=\"\",H34=\"\",J34=\"\",L34=\"\",N34=\"\"),\"\",AND(OR(D34=\"P\",F34=\"P\",H34=\"P\",J34=\"P\",L34=\"P\",N34=\"P\"),OR(D34=\"V\",F34=\"V\",H34=\"V\",J34=\"V\",L34=\"V\",N34=\"V\")))","v":""}]
[null,null,null,null,{"$f":"IF(D33=\"\",\"\",IFERROR(VLOOKUP(D33,Tableau_Images!$A$2:$D$231,2,0),\"?\"))","v":""},null,{"$f":"IF(F33=\"\",\"\",IFERROR(VLOOKUP(F33,Tableau_Images!$A$2:$D$231,2,0),\"?\"))","v":""},null,{"$f":"IF(H33=\"\",\"\",IFERROR(VLOOKUP(H33,Tableau_Images!$A$2:$D$231,2,0),\"?\"))","v":""},null,{"$f":"IF(J33=\"\",\"\",IFERROR(VLOOKUP(J33,Tableau_Images!$A$2:$D$231,2,0),\"?\"))","v":""},null,{"$f":"IF(L33=\"\",\"\",IFERROR(VLOOKUP(L33,Tableau_Images!$A$2:$D$231,2,0),\"?\"))","v":""},null,{"$f":"IF(N33=\"\",\"\",IFERROR(VLOOKUP(D33,Tableau_Images!$A$2:$D$231,2,0),\"?\"))","v":""},"El Ind/El Syn Présent",{"$f":"IF(AND(D34=\"\",F34=\"\",H34=\"\",J34=\"\",L34=\"\",N34=\"\"),\"\",AND(OR(D34=\"El Ind\",F34=\"El Ind\",H34=\"El Ind\",J34=\"El Ind\",L34=\"El Ind\",N34=\"El Ind\"),OR(D34=\"El Syn\",F34=\"El Syn\",H34=\"El Syn\",J34=\"El Syn\",L34=\"El Syn\",N34=\"El Syn\")))","v":""}]

{"sheet":"G3_C","index":8,"n_rows":20,"n_cols":23,"rows_kept":20,"cut":false,"hidden":true,"merged":[[15,17,18,17],[14,0,14,2],[14,3,14,5],[14,6,14,8],[14,9,14,11],[14,12,14,14],[14,15,14,17],[14,18,14,20],[14,21,14,23],[15,6,18,6],[15,7,18,7],[15,8,18,8],[15,9,18,9],[15,10,18,10],[15,11,18,11],[15,0,18,0],[15,1,18,1],[11,15,11,17],[15,2,18,2],[15,3,18,3],[15,4,18,4],[15,5,18,5],[15,18,18,18],[15,19,18,19],[15,20,18,20],[15,21,18,21],[13,0,13,2],[13,3,13,5],[13,6,13,8],[13,9,13,11],[13,12,13,14],[13,15,13,17],[13,18,13,20],[13,21,13,23],[15,22,18,22],[15,23,18,23],[15,12,18,12],[15,13,18,13],[15,14,18,14],[15,15,18,15],[15,16,18,16],[11,18,11,20],[11,21,11,23],[12,18,12,20],[12,21,12,23],[5,22,8,22],[5,23,8,23],[5,12,8,12],[5,13,8,13],[5,14,8,14],[5,15,8,15],[5,16,8,16],[5,17,8,17],[10,0,10,23],[12,0,12,2],[12,3,12,5],[12,6,12,8],[12,9,12,11],[12,12,12,14],[12,15,12,17],[11,0,11,2],[11,3,11,5],[11,6,11,8],[11,9,11,11],[11,12,11,14],[4,0,4,2],[4,3,4,5],[4,6,4,8],[4,9,4,11],[4,12,4,14],[4,15,4,17],[4,18,4,20],[4,21,4,23],[5,6,8,6],[5,7,8,7],[5,8,8,8],[5,9,8,9],[5,10,8,10],[5,11,8,11],[5,0,8,0],[5,1,8,1],[5,2,8,2],[5,3,8,3],[5,4,8,4],[5,5,8,5],[5,18,8,18],[5,19,8,19],[5,20,8,20],[5,21,8,21],[2,18,2,20],[2,21,2,23],[3,0,3,2],[3,3,3,5],[3,6,3,8],[3,9,3,11],[3,12,3,14],[3,15,3,17],[3,18,3,20],[3,21,3,23],[2,0,2,2],[2,3,2,5],[2,6,2,8],[2,9,2,11],[2,12,2,14],[2,15,2,17],[0,0,0,11],[0,12,0,23],[1,0,1,2],[1,3,1,5],[1,6,1,8],[1,9,1,11],[1,12,1,14],[1,15,1,17],[1,18,1,20],[1,21,1,23]]}
[{"$f":"IF(Groupes!M1=\"\",\"\",\"Groupe 3\")","v":""},null,null,null,null,null,null,null,null,null,null,null,": Projet collectif"]
["Figure / élément 1",null,null,"Figure / élément 2",null,null,"Figure / élément 3",null,null,"Figure / élément 4",null,null,"Figure / élément 5",null,null,"Figure / élément 6",null,null,"Figure / élément 7",null,null,"Figure / élément 8"]
[]
["",null,null,"",null,null,"",null,null,"",null,null,"",null,null,"",null,null,"",null,null,""]
["Espace : Où ? Direction ?",null,null,"Espace : Où ? Direction ?",null,null,"Espace : Où ? Direction ?",null,null,"Espace : Où ? Direction ?",null,null,"Espace : Où ? Direction ?",null,null,"Espace : Où ? Direction ?",null,null,"Espace : Où ? Direction ?",null,null,"Espace : Où ? Direction ?"]
[]
[]
[]
[]
[null,"Juge ",null,null,"Juge ",null,null,"Juge ",null,null,"Juge ",null,null,"Juge ",null,null,"Juge ",null,null,"Juge ",null,null,"Juge "]
[]
["Figure / élément 9",null,null,"Figure / élément 10",null,null,"Figure / élément 11",null,null,"Figure / élément 12",null,null,"Figure / élément 13",null,null,"Figure / élément 14",null,null,"Figure / élément 15",null,null,"Figure / élément 16"]
[]
["",null,null,"",null,null,"",null,null,"",null,null,"",null,null,"",null,null,"",null,null,""]
["Espace : Où ? Direction ?",null,null,"Espace : Où ? Direction ?",null,null,"Espace : Où ? Direction ?",null,null,"Espace : Où ? Direction ?",null,null,"Espace : Où ? Direction ?",null,null,"Espace : Où ? Direction ?",null,null,"Espace : Où ? Direction ?",null,null,"Espace : Où ? Direction ?"]
[]
[]
[]
[]
[null,"Juge ",null,null,"Juge ",null,null,"Juge ",null,null,"Juge ",null,null,"Juge ",null,null,"Juge ",null,null,"Juge ",null,null,"Juge "]

{"sheet":"G4","index":9,"n_rows":34,"n_cols":17,"rows_kept":34,"cut":false,"hidden":false,"merged":[[30,13,30,14],[30,15,30,16],[32,3,32,4],[32,5,32,6],[32,7,32,8],[32,9,32,10],[32,11,32,12],[32,13,32,14],[30,11,30,12],[30,1,33,2],[30,3,30,4],[30,5,30,6],[30,7,30,8],[30,9,30,10],[24,13,24,14],[24,15,24,16],[26,3,26,4],[26,5,26,6],[26,7,26,8],[26,9,26,10],[26,11,26,12],[26,13,26,14],[24,11,24,12],[24,1,27,2],[24,3,24,4],[24,5,24,6],[24,7,24,8],[24,9,24,10],[18,7,18,8],[18,9,18,10],[18,13,18,14],[18,15,18,16],[20,3,20,4],[20,5,20,6],[20,7,20,8],[20,9,20,10],[20,11,20,12],[20,13,20,14],[18,11,18,12],[12,9,12,10],[12,13,12,14],[12,15,12,16],[14,3,14,4],[14,5,14,6],[14,7,14,8],[14,9,14,10],[14,11,14,12],[14,13,14,14],[12,11,12,12],[6,9,6,10],[6,11,6,12],[6,13,6,14],[6,15,6,16],[8,3,8,4],[8,5,8,6],[8,7,8,8],[8,9,8,10],[8,11,8,12],[8,13,8,14],[0,11,0,12],[0,13,0,14],[0,15,0,16],[2,3,2,4],[2,5,2,6],[2,7,2,8],[2,9,2,10],[2,11,2,12],[2,13,2,14],[0,9,0,10],[0,0,33,0],[0,1,3,2],[0,3,0,4],[0,5,0,6],[0,7,0,8],[6,1,9,2],[6,3,6,4],[6,5,6,6],[6,7,6,8],[12,1,15,2],[12,3,12,4],[12,5,12,6],[12,7,12,8],[18,1,21,2],[18,3,18,4],[18,5,18,6]]}
["Groupe 4",{"$f":"IF(Groupes!A15=\"\",\"\",Groupes!A15&\" \"&Groupes!B15)","v":""},null,"Figure / élément 1",null,"Figure / élément 2",null,"Figure / élément 3",null,"Figure / élément 4",null,"Figure / élément 5",null,"Figure / élément 6",null,"Exigence validé ou non"]
[null,null,null,"D_St_EQ_","A4","D_St_PV_","A4","D_St_EQ_","A4",null,null,null,null,null,null,"Points execution",{"$f":"IF(AND(E4=\"\",G4=\"\",I4=\"\",K4=\"\",M4=\"\",O4=\"\"),\"\",(COUNTIF(D4:O4,\"A\")*0.4)+(COUNTIF(D4:O4,\"B\")*0.6)+(COUNTIF(D4:O4,\"C\")*0.8)+(COUNTIF(D4:O4,\"D\")))","v":1.2000000000000002}]
[null,null,null,{"$f":"IF(OR(D2=\"\",E2=\"\"),\"\",D2&\"\"&E2)","v":"D_St_EQ_A4"},null,{"$f":"IF(OR(F2=\"\",G2=\"\"),\"\",F2&\"\"&G2)","v":"D_St_PV_A4"},null,{"$f":"IF(OR(H2=\"\",I2=\"\"),\"\",H2&\"\"&I2)","v":"D_St_EQ_A4"},null,{"$f":"IF(OR(J2=\"\",K2=\"\"),\"\",J2&\"\"&K2)","v":""},null,{"$f":"IF(OR(L2=\"\",M2=\"\"),\"\",L2&\"\"&M2)","v":""},null,{"$f":"IF(OR(N2=\"\",O2=\"\"),\"\",N2&\"\"&O2)","v":""},null,"P /V présent",{"$f":"IF(AND(D4=\"\",F4=\"\",H4=\"\",J4=\"\",L4=\"\",N4=\"\"),\"\",AND(OR(D4=\"P\",F4=\"P\",H4=\"P\",J4=\"P\",L4=\"P\",N4=\"P\"),OR(D4=\"V\",F4=\"V\",H4=\"V\",J4=\"V\",L4=\"V\",N4=\"V\")))","v":false}]
[null,null,null,null,{"$f":"IF(D3=\"\",\"\",IFERROR(VLOOKUP(D3,Tableau_Images!$A$2:$D$231,2,0),\"?\"))","v":"A"},"V",{"$f":"IF(F3=\"\",\"\",IFERROR(VLOOKUP(F3,Tableau_Images!$A$2:$D$231,2,0),\"?\"))","v":"A"},null,{"$f":"IF(H3=\"\",\"\",IFERROR(VLOOKUP(H3,Tableau_Images!$A$2:$D$231,2,0),\"?\"))","v":"A"},null,{"$f":"IF(J3=\"\",\"\",IFERROR(VLOOKUP(J3,Tableau_Images!$A$2:$D$231,2,0),\"?\"))","v":""},null,{"$f":"IF(L3=\"\",\"\",IFERROR(VLOOKUP(L3,Tableau_Images!$A$2:$D$231,2,0),\"?\"))","v":""},null,{"$f":"IF(N3=\"\",\"\",IFERROR(VLOOKUP(N3,Tableau_Images!$A$2:$D$231,2,0),\"?\"))","v":""},"El Ind/El Syn Présent",{"$f":"IF(AND(D4=\"\",F4=\"\",H4=\"\",J4=\"\",L4=\"\",N4=\"\"),\"\",AND(OR(D4=\"El Ind\",F4=\"El Ind\",H4=\"El Ind\",J4=\"El Ind\",L4=\"El Ind\",N4=\"El Ind\"),OR(D4=\"El Syn\",F4=\"El Syn\",H4=\"El Syn\",J4=\"El Syn\",L4=\"El Syn\",N4=\"El Syn\")))","v":false}]
[]
[]
[null,{"$f":"IF(Groupes!A16=\"\",\"\",Groupes!A16&\" \"&Groupes!B16)","v":""},null,"Figure / élément 1",null,"Figure / élément 2",null,"Figure / élément 3",null,"Figure / élément 4",null,"Figure / élément 5",null,"Figure / élément 6",null,"Exigence Validé ou non"]
[null,null,null,null,null,null,null,null,null,null,null,null,null,null,null,"Points execution",{"$f":"IF(AND(E10=\"\",G10=\"\",I10=\"\",K10=\"\",M10=\"\",O10=\"\"),\"\",(COUNTIF(D10:O10,\"A\")*0.4)+(COUNTIF(D10:O10,\"B\")*0.6)+(COUNTIF(D10:O10,\"C\")*0.8)+(COUNTIF(D10:O10,\"D\")))","v":""}]
[null,null,null,{"$f":"IF(OR(D8=\"\",E8=\"\"),\"\",D8&\"\"&E8)","v":""},null,{"$f":"IF(OR(F8=\"\",G8=\"\"),\"\",F8&\"\"&G8)","v":""},null,{"$f":"IF(OR(H8=\"\",I8=\"\"),\"\",H8&\"\"&I8)","v":""},null,{"$f":"IF(OR(J8=\"\",K8=\"\"),\"\",J8&\"\"&K8)","v":""},null,{"$f":"IF(OR(L8=\"\",M8=\"\"),\"\",L8&\"\"&M8)","v":""},null,{"$f":"IF(OR(N8=\"\",O8=\"\"),\"\",N8&\"\"&O8)","v":""},null,"P /V présent",{"$f":"IF(AND(D10=\"\",F10=\"\",H10=\"\",J10=\"\",L10=\"\",N10=\"\"),\"\",AND(OR(D10=\"P\",F10=\"P\",H10=\"P\",J10=\"P\",L10=\"P\",N10=\"P\"),OR(D10=\"V\",F10=\"V\",H10=\"V\",J10=\"V\",L10=\"V\",N10=\"V\")))","v":""}]
[null,null,null,null,{"$f":"IF(D9=\"\",\"\",IFERROR(VLOOKUP(D9,Tableau_Images!$A$2:$D$231,2,0),\"?\"))","v":""},null,{"$f":"IF(F9=\"\",\"\",IFERROR(VLOOKUP(F9,Tableau_Images!$A$2:$D$231,2,0),\"?\"))","v":""},null,{"$f":"IF(H9=\"\",\"\",IFERROR(VLOOKUP(H9,Tableau_Images!$A$2:$D$231,2,0),\"?\"))","v":""},null,{"$f":"IF(J9=\"\",\"\",IFERROR(VLOOKUP(J9,Tableau_Images!$A$2:$D$231,2,0),\"?\"))","v":""},null,{"$f":"IF(L9=\"\",\"\",IFERROR(VLOOKUP(L9,Tableau_Images!$A$2:$D$231,2,0),\"?\"))","v":""},null,{"$f":"IF(N9=\"\",\"\",IFERROR(VLOOKUP(N9,Tableau_Images!$A$2:$D$231,2,0),\"?\"))","v":""},"El Ind/El Syn Présent",{"$f":"IF(AND(D10=\"\",F10=\"\",H10=\"\",J10=\"\",L10=\"\",N10=\"\"),\"\",AND(OR(D10=\"El Ind\",F10=\"El Ind\",H10=\"El Ind\",J10=\"El Ind\",L10=\"El Ind\",N10=\"El Ind\"),OR(D10=\"El Syn\",F10=\"El Syn\",H10=\"El Syn\",J10=\"El Syn\",L10=\"El Syn\",N10=\"El Syn\")))","v":""}]
[]
[]
[null,{"$f":"IF(Groupes!A17=\"\",\"\",Groupes!A17&\" \"&Groupes!B17)","v":""},null,"Figure / élément 1",null,"Figure / élément 2",null,"Figure / élément 3",null,"Figure / élément 4",null,"Figure / élément 5",null,"Figure / élément 6",null,"Exigence Validé ou non"]
[null,null,null,null,null,null,null,null,null,null,null,null,null,null,null,"Points execution",{"$f":"IF(AND(E16=\"\",G16=\"\",I16=\"\",K16=\"\",M16=\"\",O16=\"\"),\"\",(COUNTIF(D16:O16,\"A\")*0.4)+(COUNTIF(D16:O16,\"B\")*0.6)+(COUNTIF(D16:O16,\"C\")*0.8)+(COUNTIF(D16:O16,\"D\")))","v":""}]
[null,null,null,{"$f":"IF(OR(D14=\"\",E14=\"\"),\"\",D14&\"\"&E14)","v":""},null,{"$f":"IF(OR(F14=\"\",G14=\"\"),\"\",F14&\"\"&G14)","v":""},null,{"$f":"IF(OR(H14=\"\",I14=\"\"),\"\",H14&\"\"&I14)","v":""},null,{"$f":"IF(OR(J14=\"\",K14=\"\"),\"\",J14&\"\"&K14)","v":""},null,{"$f":"IF(OR(L14=\"\",M14=\"\"),\"\",L14&\"\"&M14)","v":""},null,{"$f":"IF(OR(N14=\"\",O14=\"\"),\"\",N14&\"\"&O14)","v":""},null,"P /V présent",{"$f":"IF(AND(D16=\"\",F16=\"\",H16=\"\",J16=\"\",L16=\"\",N16=\"\"),\"\",AND(OR(D16=\"P\",F16=\"P\",H16=\"P\",J16=\"P\",L16=\"P\",N16=\"P\"),OR(D16=\"V\",F16=\"V\",H16=\"V\",J16=\"V\",L16=\"V\",N16=\"V\")))","v":""}]
[null,null,null,null,{"$f":"IF(D15=\"\",\"\",IFERROR(VLOOKUP(D15,Tableau_Images!$A$2:$D$231,2,0),\"?\"))","v":""},null,{"$f":"IF(F15=\"\",\"\",IFERROR(VLOOKUP(F15,Tableau_Images!$A$2:$D$231,2,0),\"?\"))","v":""},null,{"$f":"IF(H15=\"\",\"\",IFERROR(VLOOKUP(H15,Tableau_Images!$A$2:$D$231,2,0),\"?\"))","v":""},null,{"$f":"IF(J15=\"\",\"\",IFERROR(VLOOKUP(J15,Tableau_Images!$A$2:$D$231,2,0),\"?\"))","v":""},null,{"$f":"IF(L15=\"\",\"\",IFERROR(VLOOKUP(L15,Tableau_Images!$A$2:$D$231,2,0),\"?\"))","v":""},null,{"$f":"IF(N15=\"\",\"\",IFERROR(VLOOKUP(N15,Tableau_Images!$A$2:$D$231,2,0),\"?\"))","v":""},"El Ind/El Syn Présent",{"$f":"IF(AND(D16=\"\",F16=\"\",H16=\"\",J16=\"\",L16=\"\",N16=\"\"),\"\",AND(OR(D16=\"El Ind\",F16=\"El Ind\",H16=\"El Ind\",J16=\"El Ind\",L16=\"El Ind\",N16=\"El Ind\"),OR(D16=\"El Syn\",F16=\"El Syn\",H16=\"El Syn\",J16=\"El Syn\",L16=\"El Syn\",N16=\"El Syn\")))","v":""}]
[]
[]
[null,{"$f":"IF(Groupes!A18=\"\",\"\",Groupes!A18&\" \"&Groupes!B18)","v":""},null,"Figure / élément 1",null,"Figure / élément 2",null,"Figure / élément 3",null,"Figure / élément 4",null,"Figure / élément 5",null,"Figure / élément 6",null,"Exigence Validé ou non"]
[null,null,null,null,null,null,null,null,null,null,null,null,null,null,null,"Points execution",{"$f":"IF(AND(E22=\"\",G22=\"\",I22=\"\",K22=\"\",M22=\"\",O22=\"\"),\"\",(COUNTIF(D22:O22,\"A\")*0.4)+(COUNTIF(D22:O22,\"B\")*0.6)+(COUNTIF(D22:O22,\"C\")*0.8)+(COUNTIF(D22:O22,\"D\")))","v":""}]
[null,null,null,{"$f":"IF(OR(D20=\"\",E20=\"\"),\"\",D20&\"\"&E20)","v":""},null,{"$f":"IF(OR(F20=\"\",G20=\"\"),\"\",F20&\"\"&G20)","v":""},null,{"$f":"IF(OR(H20=\"\",I20=\"\"),\"\",H20&\"\"&I20)","v":""},null,{"$f":"IF(OR(J20=\"\",K20=\"\"),\"\",J20&\"\"&K20)","v":""},null,{"$f":"IF(OR(L20=\"\",M20=\"\"),\"\",L20&\"\"&M20)","v":""},null,{"$f":"IF(OR(N20=\"\",O20=\"\"),\"\",N20&\"\"&O20)","v":""},null,"P /V présent",{"$f":"IF(AND(D22=\"\",F22=\"\",H22=\"\",J22=\"\",L22=\"\",N22=\"\"),\"\",AND(OR(D22=\"P\",F22=\"P\",H22=\"P\",J22=\"P\",L22=\"P\",N22=\"P\"),OR(D22=\"V\",F22=\"V\",H22=\"V\",J22=\"V\",L22=\"V\",N22=\"V\")))","v":""}]
[null,null,null,null,{"$f":"IF(D21=\"\",\"\",IFERROR(VLOOKUP(D21,Tableau_Images!$A$2:$D$231,2,0),\"?\"))","v":""},null,{"$f":"IF(F21=\"\",\"\",IFERROR(VLOOKUP(F21,Tableau_Images!$A$2:$D$231,2,0),\"?\"))","v":""},null,{"$f":"IF(H21=\"\",\"\",IFERROR(VLOOKUP(H21,Tableau_Images!$A$2:$D$231,2,0),\"?\"))","v":""},null,{"$f":"IF(J21=\"\",\"\",IFERROR(VLOOKUP(J21,Tableau_Images!$A$2:$D$231,2,0),\"?\"))","v":""},null,{"$f":"IF(L21=\"\",\"\",IFERROR(VLOOKUP(L21,Tableau_Images!$A$2:$D$231,2,0),\"?\"))","v":""},null,{"$f":"IF(N21=\"\",\"\",IFERROR(VLOOKUP(N21,Tableau_Images!$A$2:$D$231,2,0),\"?\"))","v":""},"El Ind/El Syn Présent",{"$f":"IF(AND(D22=\"\",F22=\"\",H22=\"\",J22=\"\",L22=\"\",N22=\"\"),\"\",AND(OR(D22=\"El Ind\",F22=\"El Ind\",H22=\"El Ind\",J22=\"El Ind\",L22=\"El Ind\",N22=\"El Ind\"),OR(D22=\"El Syn\",F22=\"El Syn\",H22=\"El Syn\",J22=\"El Syn\",L22=\"El Syn\",N22=\"El Syn\")))","v":""}]
[]
[]
[null,{"$f":"IF(Groupes!A19=\"\",\"\",Groupes!A19&\" \"&Groupes!B19)","v":""},null,"Figure / élément 1",null,"Figure / élément 2",null,"Figure / élément 3",null,"Figure / élément 4",null,"Figure / élément 5",null,"Figure / élément 6",null,"Exigence Validé ou non"]
[null,null,null,null,null,null,null,null,null,null,null,null,null,null,null,"Points execution",{"$f":"IF(AND(E28=\"\",G28=\"\",I28=\"\",K28=\"\",M28=\"\",O28=\"\"),\"\",(COUNTIF(D28:O28,\"A\")*0.4)+(COUNTIF(D28:O28,\"B\")*0.6)+(COUNTIF(D28:O28,\"C\")*0.8)+(COUNTIF(D28:O28,\"D\")))","v":""}]
[null,null,null,{"$f":"IF(OR(D26=\"\",E26=\"\"),\"\",D26&\"\"&E26)","v":""},null,{"$f":"IF(OR(F26=\"\",G26=\"\"),\"\",F26&\"\"&G26)","v":""},null,{"$f":"IF(OR(H26=\"\",I26=\"\"),\"\",H26&\"\"&I26)","v":""},null,{"$f":"IF(OR(J26=\"\",K26=\"\"),\"\",J26&\"\"&K26)","v":""},null,{"$f":"IF(OR(L26=\"\",M26=\"\"),\"\",L26&\"\"&M26)","v":""},null,{"$f":"IF(OR(N26=\"\",O26=\"\"),\"\",N26&\"\"&O26)","v":""},null,"P /V présent",{"$f":"IF(AND(D28=\"\",F28=\"\",H28=\"\",J28=\"\",L28=\"\",N28=\"\"),\"\",AND(OR(D28=\"P\",F28=\"P\",H28=\"P\",J28=\"P\",L28=\"P\",N28=\"P\"),OR(D28=\"V\",F28=\"V\",H28=\"V\",J28=\"V\",L28=\"V\",N28=\"V\")))","v":""}]
[null,null,null,null,{"$f":"IF(D27=\"\",\"\",IFERROR(VLOOKUP(D27,Tableau_Images!$A$2:$D$231,2,0),\"?\"))","v":""},null,{"$f":"IF(F27=\"\",\"\",IFERROR(VLOOKUP(F27,Tableau_Images!$A$2:$D$231,2,0),\"?\"))","v":""},null,{"$f":"IF(H27=\"\",\"\",IFERROR(VLOOKUP(H27,Tableau_Images!$A$2:$D$231,2,0),\"?\"))","v":""},null,{"$f":"IF(J27=\"\",\"\",IFERROR(VLOOKUP(J27,Tableau_Images!$A$2:$D$231,2,0),\"?\"))","v":""},null,{"$f":"IF(L27=\"\",\"\",IFERROR(VLOOKUP(L27,Tableau_Images!$A$2:$D$231,2,0),\"?\"))","v":""},null,{"$f":"IF(N27=\"\",\"\",IFERROR(VLOOKUP(N27,Tableau_Images!$A$2:$D$231,2,0),\"?\"))","v":""},"El Ind/El Syn Présent",{"$f":"IF(AND(D28=\"\",F28=\"\",H28=\"\",J28=\"\",L28=\"\",N28=\"\"),\"\",AND(OR(D28=\"El Ind\",F28=\"El Ind\",H28=\"El Ind\",J28=\"El Ind\",L28=\"El Ind\",N28=\"El Ind\"),OR(D28=\"El Syn\",F28=\"El Syn\",H28=\"El Syn\",J28=\"El Syn\",L28=\"El Syn\",N28=\"El Syn\")))","v":""}]
[]
[]
[null,{"$f":"IF(Groupes!A20=\"\",\"\",Groupes!A20&\" \"&Groupes!B20)","v":""},null,"Figure / élément 1",null,"Figure / élément 2",null,"Figure / élément 3",null,"Figure / élément 4",null,"Figure / élément 5",null,"Figure / élément 6",null,"Exigence Validé ou non"]
[null,null,null,null,null,null,null,null,null,null,null,null,null,null,null,"Points execution",{"$f":"IF(AND(E34=\"\",G34=\"\",I34=\"\",K34=\"\",M34=\"\",O34=\"\"),\"\",(COUNTIF(D34:O34,\"A\")*0.4)+(COUNTIF(D34:O34,\"B\")*0.6)+(COUNTIF(D34:O34,\"C\")*0.8)+(COUNTIF(D34:O34,\"D\")))","v":""}]
[null,null,null,{"$f":"IF(OR(D32=\"\",E32=\"\"),\"\",D32&\"\"&E32)","v":""},null,{"$f":"IF(OR(F32=\"\",G32=\"\"),\"\",F32&\"\"&G32)","v":""},null,{"$f":"IF(OR(H32=\"\",I32=\"\"),\"\",H32&\"\"&I32)","v":""},null,{"$f":"IF(OR(J32=\"\",K32=\"\"),\"\",J32&\"\"&K32)","v":""},null,{"$f":"IF(OR(L32=\"\",M32=\"\"),\"\",L32&\"\"&M32)","v":""},null,{"$f":"IF(OR(N32=\"\",O32=\"\"),\"\",N32&\"\"&O32)","v":""},null,"P /V présent",{"$f":"IF(AND(D34=\"\",F34=\"\",H34=\"\",J34=\"\",L34=\"\",N34=\"\"),\"\",AND(OR(D34=\"P\",F34=\"P\",H34=\"P\",J34=\"P\",L34=\"P\",N34=\"P\"),OR(D34=\"V\",F34=\"V\",H34=\"V\",J34=\"V\",L34=\"V\",N34=\"V\")))","v":""}]
[null,null,null,null,{"$f":"IF(D33=\"\",\"\",IFERROR(VLOOKUP(D33,Tableau_Images!$A$2:$D$231,2,0),\"?\"))","v":""},null,{"$f":"IF(F33=\"\",\"\",IFERROR(VLOOKUP(F33,Tableau_Images!$A$2:$D$231,2,0),\"?\"))","v":""},null,{"$f":"IF(H33=\"\",\"\",IFERROR(VLOOKUP(H33,Tableau_Images!$A$2:$D$231,2,0),\"?\"))","v":""},null,{"$f":"IF(J33=\"\",\"\",IFERROR(VLOOKUP(J33,Tableau_Images!$A$2:$D$231,2,0),\"?\"))","v":""},null,{"$f":"IF(L33=\"\",\"\",IFERROR(VLOOKUP(L33,Tableau_Images!$A$2:$D$231,2,0),\"?\"))","v":""},null,{"$f":"IF(N33=\"\",\"\",IFERROR(VLOOKUP(N33,Tableau_Images!$A$2:$D$231,2,0),\"?\"))","v":""},"El Ind/El Syn Présent",{"$f":"IF(AND(D34=\"\",F34=\"\",H34=\"\",J34=\"\",L34=\"\",N34=\"\"),\"\",AND(OR(D34=\"El Ind\",F34=\"El Ind\",H34=\"El Ind\",J34=\"El Ind\",L34=\"El Ind\",N34=\"El Ind\"),OR(D34=\"El Syn\",F34=\"El Syn\",H34=\"El Syn\",J34=\"El Syn\",L34=\"El Syn\",N34=\"El Syn\")))","v":""}]

{"sheet":"G4_C","index":10,"n_rows":20,"n_cols":23,"rows_kept":20,"cut":false,"hidden":true,"merged":[[15,17,18,17],[14,0,14,2],[14,3,14,5],[14,6,14,8],[14,9,14,11],[14,12,14,14],[14,15,14,17],[14,18,14,20],[14,21,14,23],[15,6,18,6],[15,7,18,7],[15,8,18,8],[15,9,18,9],[15,10,18,10],[15,11,18,11],[15,0,18,0],[15,1,18,1],[11,15,11,17],[15,2,18,2],[15,3,18,3],[15,4,18,4],[15,5,18,5],[15,18,18,18],[15,19,18,19],[15,20,18,20],[15,21,18,21],[13,0,13,2],[13,3,13,5],[13,6,13,8],[13,9,13,11],[13,12,13,14],[13,15,13,17],[13,18,13,20],[13,21,13,23],[15,22,18,22],[15,23,18,23],[15,12,18,12],[15,13,18,13],[15,14,18,14],[15,15,18,15],[15,16,18,16],[11,18,11,20],[11,21,11,23],[12,18,12,20],[12,21,12,23],[5,22,8,22],[5,23,8,23],[5,12,8,12],[5,13,8,13],[5,14,8,14],[5,15,8,15],[5,16,8,16],[5,17,8,17],[10,0,10,23],[12,0,12,2],[12,3,12,5],[12,6,12,8],[12,9,12,11],[12,12,12,14],[12,15,12,17],[11,0,11,2],[11,3,11,5],[11,6,11,8],[11,9,11,11],[11,12,11,14],[4,0,4,2],[4,3,4,5],[4,6,4,8],[4,9,4,11],[4,12,4,14],[4,15,4,17],[4,18,4,20],[4,21,4,23],[5,6,8,6],[5,7,8,7],[5,8,8,8],[5,9,8,9],[5,10,8,10],[5,11,8,11],[5,0,8,0],[5,1,8,1],[5,2,8,2],[5,3,8,3],[5,4,8,4],[5,5,8,5],[5,18,8,18],[5,19,8,19],[5,20,8,20],[5,21,8,21],[2,18,2,20],[2,21,2,23],[3,0,3,2],[3,3,3,5],[3,6,3,8],[3,9,3,11],[3,12,3,14],[3,15,3,17],[3,18,3,20],[3,21,3,23],[2,0,2,2],[2,3,2,5],[2,6,2,8],[2,9,2,11],[2,12,2,14],[2,15,2,17],[0,0,0,11],[0,12,0,23],[1,0,1,2],[1,3,1,5],[1,6,1,8],[1,9,1,11],[1,12,1,14],[1,15,1,17],[1,18,1,20],[1,21,1,23]]}
[{"$f":"IF(Groupes!C13=\"\",\"\",\"Groupe 4\")","v":""},null,null,null,null,null,null,null,null,null,null,null,": Projet collectif"]
["Figure / élément 1",null,null,"Figure / élément 2",null,null,"Figure / élément 3",null,null,"Figure / élément 4",null,null,"Figure / élément 5",null,null,"Figure / élément 6",null,null,"Figure / élément 7",null,null,"Figure / élément 8"]
[]
["",null,null,"",null,null,"",null,null,"",null,null,"",null,null,"",null,null,"",null,null,""]
["Espace : Où ? Direction ?",null,null,"Espace : Où ? Direction ?",null,null,"Espace : Où ? Direction ?",null,null,"Espace : Où ? Direction ?",null,null,"Espace : Où ? Direction ?",null,null,"Espace : Où ? Direction ?",null,null,"Espace : Où ? Direction ?",null,null,"Espace : Où ? Direction ?"]
[]
[]
[]
[]
[null,"Juge ",null,null,"Juge ",null,null,"Juge ",null,null,"Juge ",null,null,"Juge ",null,null,"Juge ",null,null,"Juge ",null,null,"Juge "]
[]
["Figure / élément 9",null,null,"Figure / élément 10",null,null,"Figure / élément 11",null,null,"Figure / élément 12",null,null,"Figure / élément 13",null,null,"Figure / élément 14",null,null,"Figure / élément 15",null,null,"Figure / élément 16"]
[]
["",null,null,"",null,null,"",null,null,"",null,null,"",null,null,"",null,null,"",null,null,""]
["Espace : Où ? Direction ?",null,null,"Espace : Où ? Direction ?",null,null,"Espace : Où ? Direction ?",null,null,"Espace : Où ? Direction ?",null,null,"Espace : Où ? Direction ?",null,null,"Espace : Où ? Direction ?",null,null,"Espace : Où ? Direction ?",null,null,"Espace : Où ? Direction ?"]
[]
[]
[]
[]
[null,"Juge ",null,null,"Juge ",null,null,"Juge ",null,null,"Juge ",null,null,"Juge ",null,null,"Juge ",null,null,"Juge ",null,null,"Juge "]

{"sheet":"G5","index":11,"n_rows":34,"n_cols":17,"rows_kept":34,"cut":false,"hidden":false,"merged":[[30,13,30,14],[30,15,30,16],[32,3,32,4],[32,5,32,6],[32,7,32,8],[32,9,32,10],[32,11,32,12],[32,13,32,14],[30,11,30,12],[30,1,33,2],[30,3,30,4],[30,5,30,6],[30,7,30,8],[30,9,30,10],[24,13,24,14],[24,15,24,16],[26,3,26,4],[26,5,26,6],[26,7,26,8],[26,9,26,10],[26,11,26,12],[26,13,26,14],[24,11,24,12],[24,1,27,2],[24,3,24,4],[24,5,24,6],[24,7,24,8],[24,9,24,10],[18,7,18,8],[18,9,18,10],[18,13,18,14],[18,15,18,16],[20,3,20,4],[20,5,20,6],[20,7,20,8],[20,9,20,10],[20,11,20,12],[20,13,20,14],[18,11,18,12],[12,9,12,10],[12,13,12,14],[12,15,12,16],[14,3,14,4],[14,5,14,6],[14,7,14,8],[14,9,14,10],[14,11,14,12],[14,13,14,14],[12,11,12,12],[6,9,6,10],[6,11,6,12],[6,13,6,14],[6,15,6,16],[8,3,8,4],[8,5,8,6],[8,7,8,8],[8,9,8,10],[8,11,8,12],[8,13,8,14],[0,11,0,12],[0,13,0,14],[0,15,0,16],[2,3,2,4],[2,5,2,6],[2,7,2,8],[2,9,2,10],[2,11,2,12],[2,13,2,14],[0,9,0,10],[0,0,33,0],[0,1,3,2],[0,3,0,4],[0,5,0,6],[0,7,0,8],[6,1,9,2],[6,3,6,4],[6,5,6,6],[6,7,6,8],[12,1,15,2],[12,3,12,4],[12,5,12,6],[12,7,12,8],[18,1,21,2],[18,3,18,4],[18,5,18,6]]}
["Groupe 5",{"$f":"IF(Groupes!F15=\"\",\"\",Groupes!F15&\" \"&Groupes!G16)","v":""},null,"Figure / élément 1",null,"Figure / élément 2",null,"Figure / élément 3",null,"Figure / élément 4",null,"Figure / élément 5",null,"Figure / élément 6",null,"Exigence validé ou non"]
[null,null,null,"D_St_ATR_","A2",null,null,null,null,null,null,null,null,null,null,"Points execution",{"$f":"IF(AND(E4=\"\",G4=\"\",I4=\"\",K4=\"\",M4=\"\",O4=\"\"),\"\",(COUNTIF(D4:O4,\"A\")*0.4)+(COUNTIF(D4:O4,\"B\")*0.6)+(COUNTIF(D4:O4,\"C\")*0.8)+(COUNTIF(D4:O4,\"D\")))","v":0.4}]
[null,null,null,{"$f":"IF(OR(D2=\"\",E2=\"\"),\"\",D2&\"\"&E2)","v":"D_St_ATR_A2"},null,{"$f":"IF(OR(F2=\"\",G2=\"\"),\"\",F2&\"\"&G2)","v":""},null,{"$f":"IF(OR(H2=\"\",I2=\"\"),\"\",H2&\"\"&I2)","v":""},null,{"$f":"IF(OR(J2=\"\",K2=\"\"),\"\",J2&\"\"&K2)","v":""},null,{"$f":"IF(OR(L2=\"\",M2=\"\"),\"\",L2&\"\"&M2)","v":""},null,{"$f":"IF(OR(N2=\"\",O2=\"\"),\"\",N2&\"\"&O2)","v":""},null,"P /V présent",{"$f":"IF(AND(D4=\"\",F4=\"\",H4=\"\",J4=\"\",L4=\"\",N4=\"\"),\"\",AND(OR(D4=\"P\",F4=\"P\",H4=\"P\",J4=\"P\",L4=\"P\",N4=\"P\"),OR(D4=\"V\",F4=\"V\",H4=\"V\",J4=\"V\",L4=\"V\",N4=\"V\")))","v":""}]
[null,null,null,null,{"$f":"IF(D3=\"\",\"\",IFERROR(VLOOKUP(D3,Tableau_Images!$A$2:$D$231,2,0),\"?\"))","v":"A"},null,{"$f":"IF(F3=\"\",\"\",IFERROR(VLOOKUP(F3,Tableau_Images!$A$2:$D$231,2,0),\"?\"))","v":""},null,{"$f":"IF(H3=\"\",\"\",IFERROR(VLOOKUP(H3,Tableau_Images!$A$2:$D$231,2,0),\"?\"))","v":""},null,{"$f":"IF(J3=\"\",\"\",IFERROR(VLOOKUP(J3,Tableau_Images!$A$2:$D$231,2,0),\"?\"))","v":""},null,{"$f":"IF(L3=\"\",\"\",IFERROR(VLOOKUP(L3,Tableau_Images!$A$2:$D$231,2,0),\"?\"))","v":""},null,{"$f":"IF(N3=\"\",\"\",IFERROR(VLOOKUP(N3,Tableau_Images!$A$2:$D$231,2,0),\"?\"))","v":""},"El Ind/El Syn Présent",{"$f":"IF(AND(D4=\"\",F4=\"\",H4=\"\",J4=\"\",L4=\"\",N4=\"\"),\"\",AND(OR(D4=\"El Ind\",F4=\"El Ind\",H4=\"El Ind\",J4=\"El Ind\",L4=\"El Ind\",N4=\"El Ind\"),OR(D4=\"El Syn\",F4=\"El Syn\",H4=\"El Syn\",J4=\"El Syn\",L4=\"El Syn\",N4=\"El Syn\")))","v":""}]
[]
[]
[null,{"$f":"IF(Groupes!F16=\"\",\"\",Groupes!F16&\" \"&Groupes!G16)","v":""},null,"Figure / élément 1",null,"Figure / élément 2",null,"Figure / élément 3",null,"Figure / élément 4",null,"Figure / élément 5",null,"Figure / élément 6",null,"Exigence Validé ou non"]
[null,null,null,null,null,null,null,null,null,null,null,null,null,null,null,"Points execution",{"$f":"IF(AND(E10=\"\",G10=\"\",I10=\"\",K10=\"\",M10=\"\",O10=\"\"),\"\",(COUNTIF(D10:O10,\"A\")*0.4)+(COUNTIF(D10:O10,\"B\")*0.6)+(COUNTIF(D10:O10,\"C\")*0.8)+(COUNTIF(D10:O10,\"D\")))","v":""}]
[null,null,null,{"$f":"IF(OR(D8=\"\",E8=\"\"),\"\",D8&\"\"&E8)","v":""},null,{"$f":"IF(OR(F8=\"\",G8=\"\"),\"\",F8&\"\"&G8)","v":""},null,{"$f":"IF(OR(H8=\"\",I8=\"\"),\"\",H8&\"\"&I8)","v":""},null,{"$f":"IF(OR(J8=\"\",K8=\"\"),\"\",J8&\"\"&K8)","v":""},null,{"$f":"IF(OR(L8=\"\",M8=\"\"),\"\",L8&\"\"&M8)","v":""},null,{"$f":"IF(OR(N8=\"\",O8=\"\"),\"\",N8&\"\"&O8)","v":""},null,"P /V présent",{"$f":"IF(AND(D10=\"\",F10=\"\",H10=\"\",J10=\"\",L10=\"\",N10=\"\"),\"\",AND(OR(D10=\"P\",F10=\"P\",H10=\"P\",J10=\"P\",L10=\"P\",N10=\"P\"),OR(D10=\"V\",F10=\"V\",H10=\"V\",J10=\"V\",L10=\"V\",N10=\"V\")))","v":""}]
[null,null,null,null,{"$f":"IF(D9=\"\",\"\",IFERROR(VLOOKUP(D9,Tableau_Images!$A$2:$D$231,2,0),\"?\"))","v":""},null,{"$f":"IF(F9=\"\",\"\",IFERROR(VLOOKUP(F9,Tableau_Images!$A$2:$D$231,2,0),\"?\"))","v":""},null,{"$f":"IF(H9=\"\",\"\",IFERROR(VLOOKUP(H9,Tableau_Images!$A$2:$D$231,2,0),\"?\"))","v":""},null,{"$f":"IF(J9=\"\",\"\",IFERROR(VLOOKUP(J9,Tableau_Images!$A$2:$D$231,2,0),\"?\"))","v":""},null,{"$f":"IF(L9=\"\",\"\",IFERROR(VLOOKUP(L9,Tableau_Images!$A$2:$D$231,2,0),\"?\"))","v":""},null,{"$f":"IF(N9=\"\",\"\",IFERROR(VLOOKUP(N9,Tableau_Images!$A$2:$D$231,2,0),\"?\"))","v":""},"El Ind/El Syn Présent",{"$f":"IF(AND(D10=\"\",F10=\"\",H10=\"\",J10=\"\",L10=\"\",N10=\"\"),\"\",AND(OR(D10=\"El Ind\",F10=\"El Ind\",H10=\"El Ind\",J10=\"El Ind\",L10=\"El Ind\",N10=\"El Ind\"),OR(D10=\"El Syn\",F10=\"El Syn\",H10=\"El Syn\",J10=\"El Syn\",L10=\"El Syn\",N10=\"El Syn\")))","v":""}]
[]
[]
[null,{"$f":"IF(Groupes!F17=\"\",\"\",Groupes!F17&\" \"&Groupes!G17)","v":""},null,"Figure / élément 1",null,"Figure / élément 2",null,"Figure / élément 3",null,"Figure / élément 4",null,"Figure / élément 5",null,"Figure / élément 6",null,"Exigence Validé ou non"]
[null,null,null,null,null,null,null,null,null,null,null,null,null,null,null,"Points execution",{"$f":"IF(AND(E16=\"\",G16=\"\",I16=\"\",K16=\"\",M16=\"\",O16=\"\"),\"\",(COUNTIF(D16:O16,\"A\")*0.4)+(COUNTIF(D16:O16,\"B\")*0.6)+(COUNTIF(D16:O16,\"C\")*0.8)+(COUNTIF(D16:O16,\"D\")))","v":""}]
[null,null,null,{"$f":"IF(OR(D14=\"\",E14=\"\"),\"\",D14&\"\"&E14)","v":""},null,{"$f":"IF(OR(F14=\"\",G14=\"\"),\"\",F14&\"\"&G14)","v":""},null,{"$f":"IF(OR(H14=\"\",I14=\"\"),\"\",H14&\"\"&I14)","v":""},null,{"$f":"IF(OR(J14=\"\",K14=\"\"),\"\",J14&\"\"&K14)","v":""},null,{"$f":"IF(OR(L14=\"\",M14=\"\"),\"\",L14&\"\"&M14)","v":""},null,{"$f":"IF(OR(N14=\"\",O14=\"\"),\"\",N14&\"\"&O14)","v":""},null,"P /V présent",{"$f":"IF(AND(D16=\"\",F16=\"\",H16=\"\",J16=\"\",L16=\"\",N16=\"\"),\"\",AND(OR(D16=\"P\",F16=\"P\",H16=\"P\",J16=\"P\",L16=\"P\",N16=\"P\"),OR(D16=\"V\",F16=\"V\",H16=\"V\",J16=\"V\",L16=\"V\",N16=\"V\")))","v":""}]
[null,null,null,null,{"$f":"IF(D15=\"\",\"\",IFERROR(VLOOKUP(D15,Tableau_Images!$A$2:$D$231,2,0),\"?\"))","v":""},null,{"$f":"IF(F15=\"\",\"\",IFERROR(VLOOKUP(F15,Tableau_Images!$A$2:$D$231,2,0),\"?\"))","v":""},null,{"$f":"IF(H15=\"\",\"\",IFERROR(VLOOKUP(H15,Tableau_Images!$A$2:$D$231,2,0),\"?\"))","v":""},null,{"$f":"IF(J15=\"\",\"\",IFERROR(VLOOKUP(J15,Tableau_Images!$A$2:$D$231,2,0),\"?\"))","v":""},null,{"$f":"IF(L15=\"\",\"\",IFERROR(VLOOKUP(L15,Tableau_Images!$A$2:$D$231,2,0),\"?\"))","v":""},null,{"$f":"IF(N15=\"\",\"\",IFERROR(VLOOKUP(N15,Tableau_Images!$A$2:$D$231,2,0),\"?\"))","v":""},"El Ind/El Syn Présent",{"$f":"IF(AND(D16=\"\",F16=\"\",H16=\"\",J16=\"\",L16=\"\",N16=\"\"),\"\",AND(OR(D16=\"El Ind\",F16=\"El Ind\",H16=\"El Ind\",J16=\"El Ind\",L16=\"El Ind\",N16=\"El Ind\"),OR(D16=\"El Syn\",F16=\"El Syn\",H16=\"El Syn\",J16=\"El Syn\",L16=\"El Syn\",N16=\"El Syn\")))","v":""}]
[]
[]
[null,{"$f":"IF(Groupes!F18=\"\",\"\",Groupes!F18&\" \"&Groupes!G18)","v":""},null,"Figure / élément 1",null,"Figure / élément 2",null,"Figure / élément 3",null,"Figure / élément 4",null,"Figure / élément 5",null,"Figure / élément 6",null,"Exigence Validé ou non"]
[null,null,null,null,null,null,null,null,null,null,null,null,null,null,null,"Points execution",{"$f":"IF(AND(E22=\"\",G22=\"\",I22=\"\",K22=\"\",M22=\"\",O22=\"\"),\"\",(COUNTIF(D22:O22,\"A\")*0.4)+(COUNTIF(D22:O22,\"B\")*0.6)+(COUNTIF(D22:O22,\"C\")*0.8)+(COUNTIF(D22:O22,\"D\")))","v":""}]
[null,null,null,{"$f":"IF(OR(D20=\"\",E20=\"\"),\"\",D20&\"\"&E20)","v":""},null,{"$f":"IF(OR(F20=\"\",G20=\"\"),\"\",F20&\"\"&G20)","v":""},null,{"$f":"IF(OR(H20=\"\",I20=\"\"),\"\",H20&\"\"&I20)","v":""},null,{"$f":"IF(OR(J20=\"\",K20=\"\"),\"\",J20&\"\"&K20)","v":""},null,{"$f":"IF(OR(L20=\"\",M20=\"\"),\"\",L20&\"\"&M20)","v":""},null,{"$f":"IF(OR(N20=\"\",O20=\"\"),\"\",N20&\"\"&O20)","v":""},null,"P /V présent",{"$f":"IF(AND(D22=\"\",F22=\"\",H22=\"\",J22=\"\",L22=\"\",N22=\"\"),\"\",AND(OR(D22=\"P\",F22=\"P\",H22=\"P\",J22=\"P\",L22=\"P\",N22=\"P\"),OR(D22=\"V\",F22=\"V\",H22=\"V\",J22=\"V\",L22=\"V\",N22=\"V\")))","v":""}]
[null,null,null,null,{"$f":"IF(D21=\"\",\"\",IFERROR(VLOOKUP(D21,Tableau_Images!$A$2:$D$231,2,0),\"?\"))","v":""},null,{"$f":"IF(F21=\"\",\"\",IFERROR(VLOOKUP(F21,Tableau_Images!$A$2:$D$231,2,0),\"?\"))","v":""},null,{"$f":"IF(H21=\"\",\"\",IFERROR(VLOOKUP(H21,Tableau_Images!$A$2:$D$231,2,0),\"?\"))","v":""},null,{"$f":"IF(J21=\"\",\"\",IFERROR(VLOOKUP(J21,Tableau_Images!$A$2:$D$231,2,0),\"?\"))","v":""},null,{"$f":"IF(L21=\"\",\"\",IFERROR(VLOOKUP(L21,Tableau_Images!$A$2:$D$231,2,0),\"?\"))","v":""},null,{"$f":"IF(N21=\"\",\"\",IFERROR(VLOOKUP(N21,Tableau_Images!$A$2:$D$231,2,0),\"?\"))","v":""},"El Ind/El Syn Présent",{"$f":"IF(AND(D22=\"\",F22=\"\",H22=\"\",J22=\"\",L22=\"\",N22=\"\"),\"\",AND(OR(D22=\"El Ind\",F22=\"El Ind\",H22=\"El Ind\",J22=\"El Ind\",L22=\"El Ind\",N22=\"El Ind\"),OR(D22=\"El Syn\",F22=\"El Syn\",H22=\"El Syn\",J22=\"El Syn\",L22=\"El Syn\",N22=\"El Syn\")))","v":""}]
[]
[]
[null,{"$f":"IF(Groupes!F19=\"\",\"\",Groupes!F19&\" \"&Groupes!G19)","v":""},null,"Figure / élément 1",null,"Figure / élément 2",null,"Figure / élément 3",null,"Figure / élément 4",null,"Figure / élément 5",null,"Figure / élément 6",null,"Exigence Validé ou non"]
[null,null,null,null,null,null,null,null,null,null,null,null,null,null,null,"Points execution",{"$f":"IF(AND(E28=\"\",G28=\"\",I28=\"\",K28=\"\",M28=\"\",O28=\"\"),\"\",(COUNTIF(D28:O28,\"A\")*0.4)+(COUNTIF(D28:O28,\"B\")*0.6)+(COUNTIF(D28:O28,\"C\")*0.8)+(COUNTIF(D28:O28,\"D\")))","v":""}]
[null,null,null,{"$f":"IF(OR(D26=\"\",E26=\"\"),\"\",D26&\"\"&E26)","v":""},null,{"$f":"IF(OR(F26=\"\",G26=\"\"),\"\",F26&\"\"&G26)","v":""},null,{"$f":"IF(OR(H26=\"\",I26=\"\"),\"\",H26&\"\"&I26)","v":""},null,{"$f":"IF(OR(J26=\"\",K26=\"\"),\"\",J26&\"\"&K26)","v":""},null,{"$f":"IF(OR(L26=\"\",M26=\"\"),\"\",L26&\"\"&M26)","v":""},null,{"$f":"IF(OR(N26=\"\",O26=\"\"),\"\",N26&\"\"&O26)","v":""},null,"P /V présent",{"$f":"IF(AND(D28=\"\",F28=\"\",H28=\"\",J28=\"\",L28=\"\",N28=\"\"),\"\",AND(OR(D28=\"P\",F28=\"P\",H28=\"P\",J28=\"P\",L28=\"P\",N28=\"P\"),OR(D28=\"V\",F28=\"V\",H28=\"V\",J28=\"V\",L28=\"V\",N28=\"V\")))","v":""}]
[null,null,null,null,{"$f":"IF(D27=\"\",\"\",IFERROR(VLOOKUP(D27,Tableau_Images!$A$2:$D$231,2,0),\"?\"))","v":""},null,{"$f":"IF(F27=\"\",\"\",IFERROR(VLOOKUP(F27,Tableau_Images!$A$2:$D$231,2,0),\"?\"))","v":""},null,{"$f":"IF(H27=\"\",\"\",IFERROR(VLOOKUP(H27,Tableau_Images!$A$2:$D$231,2,0),\"?\"))","v":""},null,{"$f":"IF(J27=\"\",\"\",IFERROR(VLOOKUP(J27,Tableau_Images!$A$2:$D$231,2,0),\"?\"))","v":""},null,{"$f":"IF(L27=\"\",\"\",IFERROR(VLOOKUP(L27,Tableau_Images!$A$2:$D$231,2,0),\"?\"))","v":""},null,{"$f":"IF(N27=\"\",\"\",IFERROR(VLOOKUP(N27,Tableau_Images!$A$2:$D$231,2,0),\"?\"))","v":""},"El Ind/El Syn Présent",{"$f":"IF(AND(D28=\"\",F28=\"\",H28=\"\",J28=\"\",L28=\"\",N28=\"\"),\"\",AND(OR(D28=\"El Ind\",F28=\"El Ind\",H28=\"El Ind\",J28=\"El Ind\",L28=\"El Ind\",N28=\"El Ind\"),OR(D28=\"El Syn\",F28=\"El Syn\",H28=\"El Syn\",J28=\"El Syn\",L28=\"El Syn\",N28=\"El Syn\")))","v":""}]
[]
[]
[null,{"$f":"IF(Groupes!F20=\"\",\"\",Groupes!F20&\" \"&Groupes!G20)","v":""},null,"Figure / élément 1",null,"Figure / élément 2",null,"Figure / élément 3",null,"Figure / élément 4",null,"Figure / élément 5",null,"Figure / élément 6",null,"Exigence Validé ou non"]
[null,null,null,null,null,null,null,null,null,null,null,null,null,null,null,"Points execution",{"$f":"IF(AND(E34=\"\",G34=\"\",I34=\"\",K34=\"\",M34=\"\",O34=\"\"),\"\",(COUNTIF(D34:O34,\"A\")*0.4)+(COUNTIF(D34:O34,\"B\")*0.6)+(COUNTIF(D34:O34,\"C\")*0.8)+(COUNTIF(D34:O34,\"D\")))","v":""}]
[null,null,null,{"$f":"IF(OR(D32=\"\",E32=\"\"),\"\",D32&\"\"&E32)","v":""},null,{"$f":"IF(OR(F32=\"\",G32=\"\"),\"\",F32&\"\"&G32)","v":""},null,{"$f":"IF(OR(H32=\"\",I32=\"\"),\"\",H32&\"\"&I32)","v":""},null,{"$f":"IF(OR(J32=\"\",K32=\"\"),\"\",J32&\"\"&K32)","v":""},null,{"$f":"IF(OR(L32=\"\",M32=\"\"),\"\",L32&\"\"&M32)","v":""},null,{"$f":"IF(OR(N32=\"\",O32=\"\"),\"\",N32&\"\"&O32)","v":""},null,"P /V présent",{"$f":"IF(AND(D34=\"\",F34=\"\",H34=\"\",J34=\"\",L34=\"\",N34=\"\"),\"\",AND(OR(D34=\"P\",F34=\"P\",H34=\"P\",J34=\"P\",L34=\"P\",N34=\"P\"),OR(D34=\"V\",F34=\"V\",H34=\"V\",J34=\"V\",L34=\"V\",N34=\"V\")))","v":""}]
[null,null,null,null,{"$f":"IF(D33=\"\",\"\",IFERROR(VLOOKUP(D33,Tableau_Images!$A$2:$D$231,2,0),\"?\"))","v":""},null,{"$f":"IF(F33=\"\",\"\",IFERROR(VLOOKUP(F33,Tableau_Images!$A$2:$D$231,2,0),\"?\"))","v":""},null,{"$f":"IF(H33=\"\",\"\",IFERROR(VLOOKUP(H33,Tableau_Images!$A$2:$D$231,2,0),\"?\"))","v":""},null,{"$f":"IF(J33=\"\",\"\",IFERROR(VLOOKUP(J33,Tableau_Images!$A$2:$D$231,2,0),\"?\"))","v":""},null,{"$f":"IF(L33=\"\",\"\",IFERROR(VLOOKUP(L33,Tableau_Images!$A$2:$D$231,2,0),\"?\"))","v":""},null,{"$f":"IF(N33=\"\",\"\",IFERROR(VLOOKUP(N33,Tableau_Images!$A$2:$D$231,2,0),\"?\"))","v":""},"El Ind/El Syn Présent",{"$f":"IF(AND(D34=\"\",F34=\"\",H34=\"\",J34=\"\",L34=\"\",N34=\"\"),\"\",AND(OR(D34=\"El Ind\",F34=\"El Ind\",H34=\"El Ind\",J34=\"El Ind\",L34=\"El Ind\",N34=\"El Ind\"),OR(D34=\"El Syn\",F34=\"El Syn\",H34=\"El Syn\",J34=\"El Syn\",L34=\"El Syn\",N34=\"El Syn\")))","v":""}]

{"sheet":"G5_C","index":12,"n_rows":20,"n_cols":23,"rows_kept":20,"cut":false,"hidden":true,"merged":[[15,17,18,17],[14,0,14,2],[14,3,14,5],[14,6,14,8],[14,9,14,11],[14,12,14,14],[14,15,14,17],[14,18,14,20],[14,21,14,23],[15,6,18,6],[15,7,18,7],[15,8,18,8],[15,9,18,9],[15,10,18,10],[15,11,18,11],[15,0,18,0],[15,1,18,1],[11,15,11,17],[15,2,18,2],[15,3,18,3],[15,4,18,4],[15,5,18,5],[15,18,18,18],[15,19,18,19],[15,20,18,20],[15,21,18,21],[13,0,13,2],[13,3,13,5],[13,6,13,8],[13,9,13,11],[13,12,13,14],[13,15,13,17],[13,18,13,20],[13,21,13,23],[15,22,18,22],[15,23,18,23],[15,12,18,12],[15,13,18,13],[15,14,18,14],[15,15,18,15],[15,16,18,16],[11,18,11,20],[11,21,11,23],[12,18,12,20],[12,21,12,23],[5,22,8,22],[5,23,8,23],[5,12,8,12],[5,13,8,13],[5,14,8,14],[5,15,8,15],[5,16,8,16],[5,17,8,17],[10,0,10,23],[12,0,12,2],[12,3,12,5],[12,6,12,8],[12,9,12,11],[12,12,12,14],[12,15,12,17],[11,0,11,2],[11,3,11,5],[11,6,11,8],[11,9,11,11],[11,12,11,14],[4,0,4,2],[4,3,4,5],[4,6,4,8],[4,9,4,11],[4,12,4,14],[4,15,4,17],[4,18,4,20],[4,21,4,23],[5,6,8,6],[5,7,8,7],[5,8,8,8],[5,9,8,9],[5,10,8,10],[5,11,8,11],[5,0,8,0],[5,1,8,1],[5,2,8,2],[5,3,8,3],[5,4,8,4],[5,5,8,5],[5,18,8,18],[5,19,8,19],[5,20,8,20],[5,21,8,21],[2,18,2,20],[2,21,2,23],[3,0,3,2],[3,3,3,5],[3,6,3,8],[3,9,3,11],[3,12,3,14],[3,15,3,17],[3,18,3,20],[3,21,3,23],[2,0,2,2],[2,3,2,5],[2,6,2,8],[2,9,2,11],[2,12,2,14],[2,15,2,17],[0,0,0,11],[0,12,0,23],[1,0,1,2],[1,3,1,5],[1,6,1,8],[1,9,1,11],[1,12,1,14],[1,15,1,17],[1,18,1,20],[1,21,1,23]]}
[{"$f":"IF(Groupes!H13=\"\",\"\",\"Groupe 5\")","v":""},null,null,null,null,null,null,null,null,null,null,null,": Projet collectif"]
["Figure / élément 1",null,null,"Figure / élément 2",null,null,"Figure / élément 3",null,null,"Figure / élément 4",null,null,"Figure / élément 5",null,null,"Figure / élément 6",null,null,"Figure / élément 7",null,null,"Figure / élément 8"]
[]
["",null,null,"",null,null,"",null,null,"",null,null,"",null,null,"",null,null,"",null,null,""]
["Espace : Où ? Direction ?",null,null,"Espace : Où ? Direction ?",null,null,"Espace : Où ? Direction ?",null,null,"Espace : Où ? Direction ?",null,null,"Espace : Où ? Direction ?",null,null,"Espace : Où ? Direction ?",null,null,"Espace : Où ? Direction ?",null,null,"Espace : Où ? Direction ?"]
[]
[]
[]
[]
[null,"Juge ",null,null,"Juge ",null,null,"Juge ",null,null,"Juge ",null,null,"Juge ",null,null,"Juge ",null,null,"Juge ",null,null,"Juge "]
[]
["Figure / élément 9",null,null,"Figure / élément 10",null,null,"Figure / élément 11",null,null,"Figure / élément 12",null,null,"Figure / élément 13",null,null,"Figure / élément 14",null,null,"Figure / élément 15",null,null,"Figure / élément 16"]
[]
["",null,null,"",null,null,"",null,null,"",null,null,"",null,null,"",null,null,"",null,null,""]
["Espace : Où ? Direction ?",null,null,"Espace : Où ? Direction ?",null,null,"Espace : Où ? Direction ?",null,null,"Espace : Où ? Direction ?",null,null,"Espace : Où ? Direction ?",null,null,"Espace : Où ? Direction ?",null,null,"Espace : Où ? Direction ?",null,null,"Espace : Où ? Direction ?"]
[]
[]
[]
[]
[null,"Juge ",null,null,"Juge ",null,null,"Juge ",null,null,"Juge ",null,null,"Juge ",null,null,"Juge ",null,null,"Juge ",null,null,"Juge "]

{"sheet":"G6","index":13,"n_rows":34,"n_cols":17,"rows_kept":34,"cut":false,"hidden":false,"merged":[[30,13,30,14],[30,15,30,16],[32,3,32,4],[32,5,32,6],[32,7,32,8],[32,9,32,10],[32,11,32,12],[32,13,32,14],[30,11,30,12],[30,1,33,2],[30,3,30,4],[30,5,30,6],[30,7,30,8],[30,9,30,10],[24,13,24,14],[24,15,24,16],[26,3,26,4],[26,5,26,6],[26,7,26,8],[26,9,26,10],[26,11,26,12],[26,13,26,14],[24,11,24,12],[24,1,27,2],[24,3,24,4],[24,5,24,6],[24,7,24,8],[24,9,24,10],[18,7,18,8],[18,9,18,10],[18,13,18,14],[18,15,18,16],[20,3,20,4],[20,5,20,6],[20,7,20,8],[20,9,20,10],[20,11,20,12],[20,13,20,14],[18,11,18,12],[12,9,12,10],[12,13,12,14],[12,15,12,16],[14,3,14,4],[14,5,14,6],[14,7,14,8],[14,9,14,10],[14,11,14,12],[14,13,14,14],[12,11,12,12],[6,9,6,10],[6,11,6,12],[6,13,6,14],[6,15,6,16],[8,3,8,4],[8,5,8,6],[8,7,8,8],[8,9,8,10],[8,11,8,12],[8,13,8,14],[0,11,0,12],[0,13,0,14],[0,15,0,16],[2,3,2,4],[2,5,2,6],[2,7,2,8],[2,9,2,10],[2,11,2,12],[2,13,2,14],[0,9,0,10],[0,0,33,0],[0,1,3,2],[0,3,0,4],[0,5,0,6],[0,7,0,8],[6,1,9,2],[6,3,6,4],[6,5,6,6],[6,7,6,8],[12,1,15,2],[12,3,12,4],[12,5,12,6],[12,7,12,8],[18,1,21,2],[18,3,18,4],[18,5,18,6]]}
["Groupe 6",{"$f":"IF(Groupes!K15=\"\",\"\",Groupes!K15&\" \"&Groupes!L15)","v":""},null,"Figure / élément 1",null,"Figure / élément 2",null,"Figure / élément 3",null,"Figure / élément 4",null,"Figure / élément 5",null,"Figure / élément 6",null,"Exigence validé ou non"]
[null,null,null,"D_St_EQ_","A1",null,null,null,null,null,null,null,null,null,null,"Points execution",{"$f":"IF(AND(E4=\"\",G4=\"\",I4=\"\",K4=\"\",M4=\"\",O4=\"\"),\"\",(COUNTIF(D4:O4,\"A\")*0.4)+(COUNTIF(D4:O4,\"B\")*0.6)+(COUNTIF(D4:O4,\"C\")*0.8)+(COUNTIF(D4:O4,\"D\")))","v":0.4}]
[null,null,null,{"$f":"IF(OR(D2=\"\",E2=\"\"),\"\",D2&\"\"&E2)","v":"D_St_EQ_A1"},null,{"$f":"IF(OR(F2=\"\",G2=\"\"),\"\",F2&\"\"&G2)","v":""},null,{"$f":"IF(OR(H2=\"\",I2=\"\"),\"\",H2&\"\"&I2)","v":""},null,{"$f":"IF(OR(J2=\"\",K2=\"\"),\"\",J2&\"\"&K2)","v":""},null,{"$f":"IF(OR(L2=\"\",M2=\"\"),\"\",L2&\"\"&M2)","v":""},null,{"$f":"IF(OR(N2=\"\",O2=\"\"),\"\",N2&\"\"&O2)","v":""},null,"P /V présent",{"$f":"IF(AND(D4=\"\",F4=\"\",H4=\"\",J4=\"\",L4=\"\",N4=\"\"),\"\",AND(OR(D4=\"P\",F4=\"P\",H4=\"P\",J4=\"P\",L4=\"P\",N4=\"P\"),OR(D4=\"V\",F4=\"V\",H4=\"V\",J4=\"V\",L4=\"V\",N4=\"V\")))","v":""}]
[null,null,null,null,{"$f":"IF(D3=\"\",\"\",IFERROR(VLOOKUP(D3,Tableau_Images!$A$2:$D$231,2,0),\"?\"))","v":"A"},null,{"$f":"IF(F3=\"\",\"\",IFERROR(VLOOKUP(F3,Tableau_Images!$A$2:$D$231,2,0),\"?\"))","v":""},null,{"$f":"IF(H3=\"\",\"\",IFERROR(VLOOKUP(H3,Tableau_Images!$A$2:$D$231,2,0),\"?\"))","v":""},null,{"$f":"IF(J3=\"\",\"\",IFERROR(VLOOKUP(J3,Tableau_Images!$A$2:$D$231,2,0),\"?\"))","v":""},null,{"$f":"IF(L3=\"\",\"\",IFERROR(VLOOKUP(L3,Tableau_Images!$A$2:$D$231,2,0),\"?\"))","v":""},null,{"$f":"IF(N3=\"\",\"\",IFERROR(VLOOKUP(N3,Tableau_Images!$A$2:$D$231,2,0),\"?\"))","v":""},"El Ind/El Syn Présent",{"$f":"IF(AND(D4=\"\",F4=\"\",H4=\"\",J4=\"\",L4=\"\",N4=\"\"),\"\",AND(OR(D4=\"El Ind\",F4=\"El Ind\",H4=\"El Ind\",J4=\"El Ind\",L4=\"El Ind\",N4=\"El Ind\"),OR(D4=\"El Syn\",F4=\"El Syn\",H4=\"El Syn\",J4=\"El Syn\",L4=\"El Syn\",N4=\"El Syn\")))","v":""}]
[]
[]
[null,{"$f":"IF(Groupes!K16=\"\",\"\",Groupes!K16&\" \"&Groupes!L16)","v":""},null,"Figure / élément 1",null,"Figure / élément 2",null,"Figure / élément 3",null,"Figure / élément 4",null,"Figure / élément 5",null,"Figure / élément 6",null,"Exigence Validé ou non"]
[null,null,null,null,null,null,null,null,null,null,null,null,null,null,null,"Points execution",{"$f":"IF(AND(E10=\"\",G10=\"\",I10=\"\",K10=\"\",M10=\"\",O10=\"\"),\"\",(COUNTIF(D10:O10,\"A\")*0.4)+(COUNTIF(D10:O10,\"B\")*0.6)+(COUNTIF(D10:O10,\"C\")*0.8)+(COUNTIF(D10:O10,\"D\")))","v":""}]
[null,null,null,{"$f":"IF(OR(D8=\"\",E8=\"\"),\"\",D8&\"\"&E8)","v":""},null,{"$f":"IF(OR(F8=\"\",G8=\"\"),\"\",F8&\"\"&G8)","v":""},null,{"$f":"IF(OR(H8=\"\",I8=\"\"),\"\",H8&\"\"&I8)","v":""},null,{"$f":"IF(OR(J8=\"\",K8=\"\"),\"\",J8&\"\"&K8)","v":""},null,{"$f":"IF(OR(L8=\"\",M8=\"\"),\"\",L8&\"\"&M8)","v":""},null,{"$f":"IF(OR(N8=\"\",O8=\"\"),\"\",N8&\"\"&O8)","v":""},null,"P /V présent",{"$f":"IF(AND(D10=\"\",F10=\"\",H10=\"\",J10=\"\",L10=\"\",N10=\"\"),\"\",AND(OR(D10=\"P\",F10=\"P\",H10=\"P\",J10=\"P\",L10=\"P\",N10=\"P\"),OR(D10=\"V\",F10=\"V\",H10=\"V\",J10=\"V\",L10=\"V\",N10=\"V\")))","v":""}]
[null,null,null,null,{"$f":"IF(D9=\"\",\"\",IFERROR(VLOOKUP(D9,Tableau_Images!$A$2:$D$231,2,0),\"?\"))","v":""},null,{"$f":"IF(F9=\"\",\"\",IFERROR(VLOOKUP(F9,Tableau_Images!$A$2:$D$231,2,0),\"?\"))","v":""},null,{"$f":"IF(H9=\"\",\"\",IFERROR(VLOOKUP(H9,Tableau_Images!$A$2:$D$231,2,0),\"?\"))","v":""},null,{"$f":"IF(J9=\"\",\"\",IFERROR(VLOOKUP(J9,Tableau_Images!$A$2:$D$231,2,0),\"?\"))","v":""},null,{"$f":"IF(L9=\"\",\"\",IFERROR(VLOOKUP(L9,Tableau_Images!$A$2:$D$231,2,0),\"?\"))","v":""},null,{"$f":"IF(N9=\"\",\"\",IFERROR(VLOOKUP(N9,Tableau_Images!$A$2:$D$231,2,0),\"?\"))","v":""},"El Ind/El Syn Présent",{"$f":"IF(AND(D10=\"\",F10=\"\",H10=\"\",J10=\"\",L10=\"\",N10=\"\"),\"\",AND(OR(D10=\"El Ind\",F10=\"El Ind\",H10=\"El Ind\",J10=\"El Ind\",L10=\"El Ind\",N10=\"El Ind\"),OR(D10=\"El Syn\",F10=\"El Syn\",H10=\"El Syn\",J10=\"El Syn\",L10=\"El Syn\",N10=\"El Syn\")))","v":""}]
[]
[]
[null,{"$f":"IF(Groupes!K17=\"\",\"\",Groupes!K17&\" \"&Groupes!L17)","v":""},null,"Figure / élément 1",null,"Figure / élément 2",null,"Figure / élément 3",null,"Figure / élément 4",null,"Figure / élément 5",null,"Figure / élément 6",null,"Exigence Validé ou non"]
[null,null,null,null,null,null,null,null,null,null,null,null,null,null,null,"Points execution",{"$f":"IF(AND(E16=\"\",G16=\"\",I16=\"\",K16=\"\",M16=\"\",O16=\"\"),\"\",(COUNTIF(D16:O16,\"A\")*0.4)+(COUNTIF(D16:O16,\"B\")*0.6)+(COUNTIF(D16:O16,\"C\")*0.8)+(COUNTIF(D16:O16,\"D\")))","v":""}]
[null,null,null,{"$f":"IF(OR(D14=\"\",E14=\"\"),\"\",D14&\"\"&E14)","v":""},null,{"$f":"IF(OR(F14=\"\",G14=\"\"),\"\",F14&\"\"&G14)","v":""},null,{"$f":"IF(OR(H14=\"\",I14=\"\"),\"\",H14&\"\"&I14)","v":""},null,{"$f":"IF(OR(J14=\"\",K14=\"\"),\"\",J14&\"\"&K14)","v":""},null,{"$f":"IF(OR(L14=\"\",M14=\"\"),\"\",L14&\"\"&M14)","v":""},null,{"$f":"IF(OR(N14=\"\",O14=\"\"),\"\",N14&\"\"&O14)","v":""},null,"P /V présent",{"$f":"IF(AND(D16=\"\",F16=\"\",H16=\"\",J16=\"\",L16=\"\",N16=\"\"),\"\",AND(OR(D16=\"P\",F16=\"P\",H16=\"P\",J16=\"P\",L16=\"P\",N16=\"P\"),OR(D16=\"V\",F16=\"V\",H16=\"V\",J16=\"V\",L16=\"V\",N16=\"V\")))","v":""}]
[null,null,null,null,{"$f":"IF(D15=\"\",\"\",IFERROR(VLOOKUP(D15,Tableau_Images!$A$2:$D$231,2,0),\"?\"))","v":""},null,{"$f":"IF(F15=\"\",\"\",IFERROR(VLOOKUP(F15,Tableau_Images!$A$2:$D$231,2,0),\"?\"))","v":""},null,{"$f":"IF(H15=\"\",\"\",IFERROR(VLOOKUP(H15,Tableau_Images!$A$2:$D$231,2,0),\"?\"))","v":""},null,{"$f":"IF(J15=\"\",\"\",IFERROR(VLOOKUP(J15,Tableau_Images!$A$2:$D$231,2,0),\"?\"))","v":""},null,{"$f":"IF(L15=\"\",\"\",IFERROR(VLOOKUP(L15,Tableau_Images!$A$2:$D$231,2,0),\"?\"))","v":""},null,{"$f":"IF(N15=\"\",\"\",IFERROR(VLOOKUP(N15,Tableau_Images!$A$2:$D$231,2,0),\"?\"))","v":""},"El Ind/El Syn Présent",{"$f":"IF(AND(D16=\"\",F16=\"\",H16=\"\",J16=\"\",L16=\"\",N16=\"\"),\"\",AND(OR(D16=\"El Ind\",F16=\"El Ind\",H16=\"El Ind\",J16=\"El Ind\",L16=\"El Ind\",N16=\"El Ind\"),OR(D16=\"El Syn\",F16=\"El Syn\",H16=\"El Syn\",J16=\"El Syn\",L16=\"El Syn\",N16=\"El Syn\")))","v":""}]
[]
[]
[null,{"$f":"IF(Groupes!K18=\"\",\"\",Groupes!K18&\" \"&Groupes!L18)","v":""},null,"Figure / élément 1",null,"Figure / élément 2",null,"Figure / élément 3",null,"Figure / élément 4",null,"Figure / élément 5",null,"Figure / élément 6",null,"Exigence Validé ou non"]
[null,null,null,null,null,null,null,null,null,null,null,null,null,null,null,"Points execution",{"$f":"IF(AND(E22=\"\",G22=\"\",I22=\"\",K22=\"\",M22=\"\",O22=\"\"),\"\",(COUNTIF(D22:O22,\"A\")*0.4)+(COUNTIF(D22:O22,\"B\")*0.6)+(COUNTIF(D22:O22,\"C\")*0.8)+(COUNTIF(D22:O22,\"D\")))","v":""}]
[null,null,null,{"$f":"IF(OR(D20=\"\",E20=\"\"),\"\",D20&\"\"&E20)","v":""},null,{"$f":"IF(OR(F20=\"\",G20=\"\"),\"\",F20&\"\"&G20)","v":""},null,{"$f":"IF(OR(H20=\"\",I20=\"\"),\"\",H20&\"\"&I20)","v":""},null,{"$f":"IF(OR(J20=\"\",K20=\"\"),\"\",J20&\"\"&K20)","v":""},null,{"$f":"IF(OR(L20=\"\",M20=\"\"),\"\",L20&\"\"&M20)","v":""},null,{"$f":"IF(OR(N20=\"\",O20=\"\"),\"\",N20&\"\"&O20)","v":""},null,"P /V présent",{"$f":"IF(AND(D22=\"\",F22=\"\",H22=\"\",J22=\"\",L22=\"\",N22=\"\"),\"\",AND(OR(D22=\"P\",F22=\"P\",H22=\"P\",J22=\"P\",L22=\"P\",N22=\"P\"),OR(D22=\"V\",F22=\"V\",H22=\"V\",J22=\"V\",L22=\"V\",N22=\"V\")))","v":""}]
[null,null,null,null,{"$f":"IF(D21=\"\",\"\",IFERROR(VLOOKUP(D21,Tableau_Images!$A$2:$D$231,2,0),\"?\"))","v":""},null,{"$f":"IF(F21=\"\",\"\",IFERROR(VLOOKUP(F21,Tableau_Images!$A$2:$D$231,2,0),\"?\"))","v":""},null,{"$f":"IF(H21=\"\",\"\",IFERROR(VLOOKUP(H21,Tableau_Images!$A$2:$D$231,2,0),\"?\"))","v":""},null,{"$f":"IF(J21=\"\",\"\",IFERROR(VLOOKUP(J21,Tableau_Images!$A$2:$D$231,2,0),\"?\"))","v":""},null,{"$f":"IF(L21=\"\",\"\",IFERROR(VLOOKUP(L21,Tableau_Images!$A$2:$D$231,2,0),\"?\"))","v":""},null,{"$f":"IF(N21=\"\",\"\",IFERROR(VLOOKUP(N21,Tableau_Images!$A$2:$D$231,2,0),\"?\"))","v":""},"El Ind/El Syn Présent",{"$f":"IF(AND(D22=\"\",F22=\"\",H22=\"\",J22=\"\",L22=\"\",N22=\"\"),\"\",AND(OR(D22=\"El Ind\",F22=\"El Ind\",H22=\"El Ind\",J22=\"El Ind\",L22=\"El Ind\",N22=\"El Ind\"),OR(D22=\"El Syn\",F22=\"El Syn\",H22=\"El Syn\",J22=\"El Syn\",L22=\"El Syn\",N22=\"El Syn\")))","v":""}]
[]
[]
[null,{"$f":"IF(Groupes!K19=\"\",\"\",Groupes!K19&\" \"&Groupes!L19)","v":""},null,"Figure / élément 1",null,"Figure / élément 2",null,"Figure / élément 3",null,"Figure / élément 4",null,"Figure / élément 5",null,"Figure / élément 6",null,"Exigence Validé ou non"]
[null,null,null,null,null,null,null,null,null,null,null,null,null,null,null,"Points execution",{"$f":"IF(AND(E28=\"\",G28=\"\",I28=\"\",K28=\"\",M28=\"\",O28=\"\"),\"\",(COUNTIF(D28:O28,\"A\")*0.4)+(COUNTIF(D28:O28,\"B\")*0.6)+(COUNTIF(D28:O28,\"C\")*0.8)+(COUNTIF(D28:O28,\"D\")))","v":""}]
[null,null,null,{"$f":"IF(OR(D26=\"\",E26=\"\"),\"\",D26&\"\"&E26)","v":""},null,{"$f":"IF(OR(F26=\"\",G26=\"\"),\"\",F26&\"\"&G26)","v":""},null,{"$f":"IF(OR(H26=\"\",I26=\"\"),\"\",H26&\"\"&I26)","v":""},null,{"$f":"IF(OR(J26=\"\",K26=\"\"),\"\",J26&\"\"&K26)","v":""},null,{"$f":"IF(OR(L26=\"\",M26=\"\"),\"\",L26&\"\"&M26)","v":""},null,{"$f":"IF(OR(N26=\"\",O26=\"\"),\"\",N26&\"\"&O26)","v":""},null,"P /V présent",{"$f":"IF(AND(D28=\"\",F28=\"\",H28=\"\",J28=\"\",L28=\"\",N28=\"\"),\"\",AND(OR(D28=\"P\",F28=\"P\",H28=\"P\",J28=\"P\",L28=\"P\",N28=\"P\"),OR(D28=\"V\",F28=\"V\",H28=\"V\",J28=\"V\",L28=\"V\",N28=\"V\")))","v":""}]
[null,null,null,null,{"$f":"IF(D27=\"\",\"\",IFERROR(VLOOKUP(D27,Tableau_Images!$A$2:$D$231,2,0),\"?\"))","v":""},null,{"$f":"IF(F27=\"\",\"\",IFERROR(VLOOKUP(F27,Tableau_Images!$A$2:$D$231,2,0),\"?\"))","v":""},null,{"$f":"IF(H27=\"\",\"\",IFERROR(VLOOKUP(H27,Tableau_Images!$A$2:$D$231,2,0),\"?\"))","v":""},null,{"$f":"IF(J27=\"\",\"\",IFERROR(VLOOKUP(J27,Tableau_Images!$A$2:$D$231,2,0),\"?\"))","v":""},null,{"$f":"IF(L27=\"\",\"\",IFERROR(VLOOKUP(L27,Tableau_Images!$A$2:$D$231,2,0),\"?\"))","v":""},null,{"$f":"IF(N27=\"\",\"\",IFERROR(VLOOKUP(N27,Tableau_Images!$A$2:$D$231,2,0),\"?\"))","v":""},"El Ind/El Syn Présent",{"$f":"IF(AND(D28=\"\",F28=\"\",H28=\"\",J28=\"\",L28=\"\",N28=\"\"),\"\",AND(OR(D28=\"El Ind\",F28=\"El Ind\",H28=\"El Ind\",J28=\"El Ind\",L28=\"El Ind\",N28=\"El Ind\"),OR(D28=\"El Syn\",F28=\"El Syn\",H28=\"El Syn\",J28=\"El Syn\",L28=\"El Syn\",N28=\"El Syn\")))","v":""}]
[]
[]
[null,{"$f":"IF(Groupes!K20=\"\",\"\",Groupes!K20&\" \"&Groupes!L20)","v":""},null,"Figure / élément 1",null,"Figure / élément 2",null,"Figure / élément 3",null,"Figure / élément 4",null,"Figure / élément 5",null,"Figure / élément 6",null,"Exigence Validé ou non"]
[null,null,null,null,null,null,null,null,null,null,null,null,null,null,null,"Points execution",{"$f":"IF(AND(E34=\"\",G34=\"\",I34=\"\",K34=\"\",M34=\"\",O34=\"\"),\"\",(COUNTIF(D34:O34,\"A\")*0.4)+(COUNTIF(D34:O34,\"B\")*0.6)+(COUNTIF(D34:O34,\"C\")*0.8)+(COUNTIF(D34:O34,\"D\")))","v":""}]
[null,null,null,{"$f":"IF(OR(D32=\"\",E32=\"\"),\"\",D32&\"\"&E32)","v":""},null,{"$f":"IF(OR(F32=\"\",G32=\"\"),\"\",F32&\"\"&G32)","v":""},null,{"$f":"IF(OR(H32=\"\",I32=\"\"),\"\",H32&\"\"&I32)","v":""},null,{"$f":"IF(OR(J32=\"\",K32=\"\"),\"\",J32&\"\"&K32)","v":""},null,{"$f":"IF(OR(L32=\"\",M32=\"\"),\"\",L32&\"\"&M32)","v":""},null,{"$f":"IF(OR(N32=\"\",O32=\"\"),\"\",N32&\"\"&O32)","v":""},null,"P /V présent",{"$f":"IF(AND(D34=\"\",F34=\"\",H34=\"\",J34=\"\",L34=\"\",N34=\"\"),\"\",AND(OR(D34=\"P\",F34=\"P\",H34=\"P\",J34=\"P\",L34=\"P\",N34=\"P\"),OR(D34=\"V\",F34=\"V\",H34=\"V\",J34=\"V\",L34=\"V\",N34=\"V\")))","v":""}]
[null,null,null,null,{"$f":"IF(D33=\"\",\"\",IFERROR(VLOOKUP(D33,Tableau_Images!$A$2:$D$231,2,0),\"?\"))","v":""},null,{"$f":"IF(F33=\"\",\"\",IFERROR(VLOOKUP(F33,Tableau_Images!$A$2:$D$231,2,0),\"?\"))","v":""},null,{"$f":"IF(H33=\"\",\"\",IFERROR(VLOOKUP(H33,Tableau_Images!$A$2:$D$231,2,0),\"?\"))","v":""},null,{"$f":"IF(J33=\"\",\"\",IFERROR(VLOOKUP(J33,Tableau_Images!$A$2:$D$231,2,0),\"?\"))","v":""},null,{"$f":"IF(L33=\"\",\"\",IFERROR(VLOOKUP(L33,Tableau_Images!$A$2:$D$231,2,0),\"?\"))","v":""},null,{"$f":"IF(N33=\"\",\"\",IFERROR(VLOOKUP(N33,Tableau_Images!$A$2:$D$231,2,0),\"?\"))","v":""},"El Ind/El Syn Présent",{"$f":"IF(AND(D34=\"\",F34=\"\",H34=\"\",J34=\"\",L34=\"\",N34=\"\"),\"\",AND(OR(D34=\"El Ind\",F34=\"El Ind\",H34=\"El Ind\",J34=\"El Ind\",L34=\"El Ind\",N34=\"El Ind\"),OR(D34=\"El Syn\",F34=\"El Syn\",H34=\"El Syn\",J34=\"El Syn\",L34=\"El Syn\",N34=\"El Syn\")))","v":""}]

{"sheet":"G6_C","index":14,"n_rows":20,"n_cols":23,"rows_kept":20,"cut":false,"hidden":true,"merged":[[15,17,18,17],[14,0,14,2],[14,3,14,5],[14,6,14,8],[14,9,14,11],[14,12,14,14],[14,15,14,17],[14,18,14,20],[14,21,14,23],[15,6,18,6],[15,7,18,7],[15,8,18,8],[15,9,18,9],[15,10,18,10],[15,11,18,11],[15,0,18,0],[15,1,18,1],[11,15,11,17],[15,2,18,2],[15,3,18,3],[15,4,18,4],[15,5,18,5],[15,18,18,18],[15,19,18,19],[15,20,18,20],[15,21,18,21],[13,0,13,2],[13,3,13,5],[13,6,13,8],[13,9,13,11],[13,12,13,14],[13,15,13,17],[13,18,13,20],[13,21,13,23],[15,22,18,22],[15,23,18,23],[15,12,18,12],[15,13,18,13],[15,14,18,14],[15,15,18,15],[15,16,18,16],[11,18,11,20],[11,21,11,23],[12,18,12,20],[12,21,12,23],[5,22,8,22],[5,23,8,23],[5,12,8,12],[5,13,8,13],[5,14,8,14],[5,15,8,15],[5,16,8,16],[5,17,8,17],[10,0,10,23],[12,0,12,2],[12,3,12,5],[12,6,12,8],[12,9,12,11],[12,12,12,14],[12,15,12,17],[11,0,11,2],[11,3,11,5],[11,6,11,8],[11,9,11,11],[11,12,11,14],[4,0,4,2],[4,3,4,5],[4,6,4,8],[4,9,4,11],[4,12,4,14],[4,15,4,17],[4,18,4,20],[4,21,4,23],[5,6,8,6],[5,7,8,7],[5,8,8,8],[5,9,8,9],[5,10,8,10],[5,11,8,11],[5,0,8,0],[5,1,8,1],[5,2,8,2],[5,3,8,3],[5,4,8,4],[5,5,8,5],[5,18,8,18],[5,19,8,19],[5,20,8,20],[5,21,8,21],[2,18,2,20],[2,21,2,23],[3,0,3,2],[3,3,3,5],[3,6,3,8],[3,9,3,11],[3,12,3,14],[3,15,3,17],[3,18,3,20],[3,21,3,23],[2,0,2,2],[2,3,2,5],[2,6,2,8],[2,9,2,11],[2,12,2,14],[2,15,2,17],[0,0,0,11],[0,12,0,23],[1,0,1,2],[1,3,1,5],[1,6,1,8],[1,9,1,11],[1,12,1,14],[1,15,1,17],[1,18,1,20],[1,21,1,23]]}
[{"$f":"IF(Groupes!M13=\"\",\"\",\"Groupe 6\")","v":""},null,null,null,null,null,null,null,null,null,null,null,": Projet collectif"]
["Figure / élément 1",null,null,"Figure / élément 2",null,null,"Figure / élément 3",null,null,"Figure / élément 4",null,null,"Figure / élément 5",null,null,"Figure / élément 6",null,null,"Figure / élément 7",null,null,"Figure / élément 8"]
[]
["",null,null,"",null,null,"",null,null,"",null,null,"",null,null,"",null,null,"",null,null,""]
["Espace : Où ? Direction ?",null,null,"Espace : Où ? Direction ?",null,null,"Espace : Où ? Direction ?",null,null,"Espace : Où ? Direction ?",null,null,"Espace : Où ? Direction ?",null,null,"Espace : Où ? Direction ?",null,null,"Espace : Où ? Direction ?",null,null,"Espace : Où ? Direction ?"]
[]
[]
[]
[]
[null,"Juge ",null,null,"Juge ",null,null,"Juge ",null,null,"Juge ",null,null,"Juge ",null,null,"Juge ",null,null,"Juge ",null,null,"Juge "]
[]
["Figure / élément 9",null,null,"Figure / élément 10",null,null,"Figure / élément 11",null,null,"Figure / élément 12",null,null,"Figure / élément 13",null,null,"Figure / élément 14",null,null,"Figure / élément 15",null,null,"Figure / élément 16"]
[]
["",null,null,"",null,null,"",null,null,"",null,null,"",null,null,"",null,null,"",null,null,""]
["Espace : Où ? Direction ?",null,null,"Espace : Où ? Direction ?",null,null,"Espace : Où ? Direction ?",null,null,"Espace : Où ? Direction ?",null,null,"Espace : Où ? Direction ?",null,null,"Espace : Où ? Direction ?",null,null,"Espace : Où ? Direction ?",null,null,"Espace : Où ? Direction ?"]
[]
[]
[]
[]
[null,"Juge ",null,null,"Juge ",null,null,"Juge ",null,null,"Juge ",null,null,"Juge ",null,null,"Juge ",null,null,"Juge ",null,null,"Juge "]

{"sheet":"G7","index":15,"n_rows":34,"n_cols":17,"rows_kept":34,"cut":false,"hidden":false,"merged":[[30,13,30,14],[30,15,30,16],[32,3,32,4],[32,5,32,6],[32,7,32,8],[32,9,32,10],[32,11,32,12],[32,13,32,14],[30,11,30,12],[30,1,33,2],[30,3,30,4],[30,5,30,6],[30,7,30,8],[30,9,30,10],[24,13,24,14],[24,15,24,16],[26,3,26,4],[26,5,26,6],[26,7,26,8],[26,9,26,10],[26,11,26,12],[26,13,26,14],[24,11,24,12],[24,1,27,2],[24,3,24,4],[24,5,24,6],[24,7,24,8],[24,9,24,10],[18,7,18,8],[18,9,18,10],[18,13,18,14],[18,15,18,16],[20,3,20,4],[20,5,20,6],[20,7,20,8],[20,9,20,10],[20,11,20,12],[20,13,20,14],[18,11,18,12],[12,9,12,10],[12,13,12,14],[12,15,12,16],[14,3,14,4],[14,5,14,6],[14,7,14,8],[14,9,14,10],[14,11,14,12],[14,13,14,14],[12,11,12,12],[6,9,6,10],[6,11,6,12],[6,13,6,14],[6,15,6,16],[8,3,8,4],[8,5,8,6],[8,7,8,8],[8,9,8,10],[8,11,8,12],[8,13,8,14],[0,11,0,12],[0,13,0,14],[0,15,0,16],[2,3,2,4],[2,5,2,6],[2,7,2,8],[2,9,2,10],[2,11,2,12],[2,13,2,14],[0,9,0,10],[0,0,33,0],[0,1,3,2],[0,3,0,4],[0,5,0,6],[0,7,0,8],[6,1,9,2],[6,3,6,4],[6,5,6,6],[6,7,6,8],[12,1,15,2],[12,3,12,4],[12,5,12,6],[12,7,12,8],[18,1,21,2],[18,3,18,4],[18,5,18,6]]}
["Groupe 7",{"$f":"IF(Groupes!A27=\"\",\"\",Groupes!A27&\" \"&Groupes!B27)","v":""},null,"Figure / élément 1",null,"Figure / élément 2",null,"Figure / élément 3",null,"Figure / élément 4",null,"Figure / élément 5",null,"Figure / élément 6",null,"Exigence validé ou non"]
[null,null,null,"D_St_EQ_","A4",null,null,null,null,null,null,null,null,null,null,"Points execution",{"$f":"IF(AND(E4=\"\",G4=\"\",I4=\"\",K4=\"\",M4=\"\",O4=\"\"),\"\",(COUNTIF(D4:O4,\"A\")*0.4)+(COUNTIF(D4:O4,\"B\")*0.6)+(COUNTIF(D4:O4,\"C\")*0.8)+(COUNTIF(D4:O4,\"D\")))","v":0.4}]
[null,null,null,{"$f":"IF(OR(D2=\"\",E2=\"\"),\"\",D2&\"\"&E2)","v":"D_St_EQ_A4"},null,{"$f":"IF(OR(F2=\"\",G2=\"\"),\"\",F2&\"\"&G2)","v":""},null,{"$f":"IF(OR(H2=\"\",I2=\"\"),\"\",H2&\"\"&I2)","v":""},null,{"$f":"IF(OR(J2=\"\",K2=\"\"),\"\",J2&\"\"&K2)","v":""},null,{"$f":"IF(OR(L2=\"\",M2=\"\"),\"\",L2&\"\"&M2)","v":""},null,{"$f":"IF(OR(N2=\"\",O2=\"\"),\"\",N2&\"\"&O2)","v":""},null,"P /V présent",{"$f":"IF(AND(D4=\"\",F4=\"\",H4=\"\",J4=\"\",L4=\"\",N4=\"\"),\"\",AND(OR(D4=\"P\",F4=\"P\",H4=\"P\",J4=\"P\",L4=\"P\",N4=\"P\"),OR(D4=\"V\",F4=\"V\",H4=\"V\",J4=\"V\",L4=\"V\",N4=\"V\")))","v":""}]
[null,null,null,null,{"$f":"IF(D3=\"\",\"\",IFERROR(VLOOKUP(D3,Tableau_Images!$A$2:$D$231,2,0),\"?\"))","v":"A"},null,{"$f":"IF(F3=\"\",\"\",IFERROR(VLOOKUP(F3,Tableau_Images!$A$2:$D$231,2,0),\"?\"))","v":""},null,{"$f":"IF(H3=\"\",\"\",IFERROR(VLOOKUP(H3,Tableau_Images!$A$2:$D$231,2,0),\"?\"))","v":""},null,{"$f":"IF(J3=\"\",\"\",IFERROR(VLOOKUP(J3,Tableau_Images!$A$2:$D$231,2,0),\"?\"))","v":""},null,{"$f":"IF(L3=\"\",\"\",IFERROR(VLOOKUP(L3,Tableau_Images!$A$2:$D$231,2,0),\"?\"))","v":""},null,{"$f":"IF(N3=\"\",\"\",IFERROR(VLOOKUP(N3,Tableau_Images!$A$2:$D$231,2,0),\"?\"))","v":""},"El Ind/El Syn Présent",{"$f":"IF(AND(D4=\"\",F4=\"\",H4=\"\",J4=\"\",L4=\"\",N4=\"\"),\"\",AND(OR(D4=\"El Ind\",F4=\"El Ind\",H4=\"El Ind\",J4=\"El Ind\",L4=\"El Ind\",N4=\"El Ind\"),OR(D4=\"El Syn\",F4=\"El Syn\",H4=\"El Syn\",J4=\"El Syn\",L4=\"El Syn\",N4=\"El Syn\")))","v":""}]
[]
[]
[null,{"$f":"IF(Groupes!A28=\"\",\"\",Groupes!A28&\" \"&Groupes!B28)","v":""},null,"Figure / élément 1",null,"Figure / élément 2",null,"Figure / élément 3",null,"Figure / élément 4",null,"Figure / élément 5",null,"Figure / élément 6",null,"Exigence Validé ou non"]
[null,null,null,null,null,null,null,null,null,null,null,null,null,null,null,"Points execution",{"$f":"IF(AND(E10=\"\",G10=\"\",I10=\"\",K10=\"\",M10=\"\",O10=\"\"),\"\",(COUNTIF(D10:O10,\"A\")*0.4)+(COUNTIF(D10:O10,\"B\")*0.6)+(COUNTIF(D10:O10,\"C\")*0.8)+(COUNTIF(D10:O10,\"D\")))","v":""}]
[null,null,null,{"$f":"IF(OR(D8=\"\",E8=\"\"),\"\",D8&\"\"&E8)","v":""},null,{"$f":"IF(OR(F8=\"\",G8=\"\"),\"\",F8&\"\"&G8)","v":""},null,{"$f":"IF(OR(H8=\"\",I8=\"\"),\"\",H8&\"\"&I8)","v":""},null,{"$f":"IF(OR(J8=\"\",K8=\"\"),\"\",J8&\"\"&K8)","v":""},null,{"$f":"IF(OR(L8=\"\",M8=\"\"),\"\",L8&\"\"&M8)","v":""},null,{"$f":"IF(OR(N8=\"\",O8=\"\"),\"\",N8&\"\"&O8)","v":""},null,"P /V présent",{"$f":"IF(AND(D10=\"\",F10=\"\",H10=\"\",J10=\"\",L10=\"\",N10=\"\"),\"\",AND(OR(D10=\"P\",F10=\"P\",H10=\"P\",J10=\"P\",L10=\"P\",N10=\"P\"),OR(D10=\"V\",F10=\"V\",H10=\"V\",J10=\"V\",L10=\"V\",N10=\"V\")))","v":""}]
[null,null,null,null,{"$f":"IF(D9=\"\",\"\",IFERROR(VLOOKUP(D9,Tableau_Images!$A$2:$D$231,2,0),\"?\"))","v":""},null,{"$f":"IF(F9=\"\",\"\",IFERROR(VLOOKUP(F9,Tableau_Images!$A$2:$D$231,2,0),\"?\"))","v":""},null,{"$f":"IF(H9=\"\",\"\",IFERROR(VLOOKUP(H9,Tableau_Images!$A$2:$D$231,2,0),\"?\"))","v":""},null,{"$f":"IF(J9=\"\",\"\",IFERROR(VLOOKUP(J9,Tableau_Images!$A$2:$D$231,2,0),\"?\"))","v":""},null,{"$f":"IF(L9=\"\",\"\",IFERROR(VLOOKUP(L9,Tableau_Images!$A$2:$D$231,2,0),\"?\"))","v":""},null,{"$f":"IF(N9=\"\",\"\",IFERROR(VLOOKUP(N9,Tableau_Images!$A$2:$D$231,2,0),\"?\"))","v":""},"El Ind/El Syn Présent",{"$f":"IF(AND(D10=\"\",F10=\"\",H10=\"\",J10=\"\",L10=\"\",N10=\"\"),\"\",AND(OR(D10=\"El Ind\",F10=\"El Ind\",H10=\"El Ind\",J10=\"El Ind\",L10=\"El Ind\",N10=\"El Ind\"),OR(D10=\"El Syn\",F10=\"El Syn\",H10=\"El Syn\",J10=\"El Syn\",L10=\"El Syn\",N10=\"El Syn\")))","v":""}]
[]
[]
[null,{"$f":"IF(Groupes!A29=\"\",\"\",Groupes!A29&\" \"&Groupes!B29)","v":""},null,"Figure / élément 1",null,"Figure / élément 2",null,"Figure / élément 3",null,"Figure / élément 4",null,"Figure / élément 5",null,"Figure / élément 6",null,"Exigence Validé ou non"]
[null,null,null,null,null,null,null,null,null,null,null,null,null,null,null,"Points execution",{"$f":"IF(AND(E16=\"\",G16=\"\",I16=\"\",K16=\"\",M16=\"\",O16=\"\"),\"\",(COUNTIF(D16:O16,\"A\")*0.4)+(COUNTIF(D16:O16,\"B\")*0.6)+(COUNTIF(D16:O16,\"C\")*0.8)+(COUNTIF(D16:O16,\"D\")))","v":""}]
[null,null,null,{"$f":"IF(OR(D14=\"\",E14=\"\"),\"\",D14&\"\"&E14)","v":""},null,{"$f":"IF(OR(F14=\"\",G14=\"\"),\"\",F14&\"\"&G14)","v":""},null,{"$f":"IF(OR(H14=\"\",I14=\"\"),\"\",H14&\"\"&I14)","v":""},null,{"$f":"IF(OR(J14=\"\",K14=\"\"),\"\",J14&\"\"&K14)","v":""},null,{"$f":"IF(OR(L14=\"\",M14=\"\"),\"\",L14&\"\"&M14)","v":""},null,{"$f":"IF(OR(N14=\"\",O14=\"\"),\"\",N14&\"\"&O14)","v":""},null,"P /V présent",{"$f":"IF(AND(D16=\"\",F16=\"\",H16=\"\",J16=\"\",L16=\"\",N16=\"\"),\"\",AND(OR(D16=\"P\",F16=\"P\",H16=\"P\",J16=\"P\",L16=\"P\",N16=\"P\"),OR(D16=\"V\",F16=\"V\",H16=\"V\",J16=\"V\",L16=\"V\",N16=\"V\")))","v":""}]
[null,null,null,null,{"$f":"IF(D15=\"\",\"\",IFERROR(VLOOKUP(D15,Tableau_Images!$A$2:$D$231,2,0),\"?\"))","v":""},null,{"$f":"IF(F15=\"\",\"\",IFERROR(VLOOKUP(F15,Tableau_Images!$A$2:$D$231,2,0),\"?\"))","v":""},null,{"$f":"IF(H15=\"\",\"\",IFERROR(VLOOKUP(H15,Tableau_Images!$A$2:$D$231,2,0),\"?\"))","v":""},null,{"$f":"IF(J15=\"\",\"\",IFERROR(VLOOKUP(J15,Tableau_Images!$A$2:$D$231,2,0),\"?\"))","v":""},null,{"$f":"IF(L15=\"\",\"\",IFERROR(VLOOKUP(L15,Tableau_Images!$A$2:$D$231,2,0),\"?\"))","v":""},null,{"$f":"IF(N15=\"\",\"\",IFERROR(VLOOKUP(N15,Tableau_Images!$A$2:$D$231,2,0),\"?\"))","v":""},"El Ind/El Syn Présent",{"$f":"IF(AND(D16=\"\",F16=\"\",H16=\"\",J16=\"\",L16=\"\",N16=\"\"),\"\",AND(OR(D16=\"El Ind\",F16=\"El Ind\",H16=\"El Ind\",J16=\"El Ind\",L16=\"El Ind\",N16=\"El Ind\"),OR(D16=\"El Syn\",F16=\"El Syn\",H16=\"El Syn\",J16=\"El Syn\",L16=\"El Syn\",N16=\"El Syn\")))","v":""}]
[]
[]
[null,{"$f":"IF(Groupes!A30=\"\",\"\",Groupes!A30&\" \"&Groupes!B30)","v":""},null,"Figure / élément 1",null,"Figure / élément 2",null,"Figure / élément 3",null,"Figure / élément 4",null,"Figure / élément 5",null,"Figure / élément 6",null,"Exigence Validé ou non"]
[null,null,null,null,null,null,null,null,null,null,null,null,null,null,null,"Points execution",{"$f":"IF(AND(E22=\"\",G22=\"\",I22=\"\",K22=\"\",M22=\"\",O22=\"\"),\"\",(COUNTIF(D22:O22,\"A\")*0.4)+(COUNTIF(D22:O22,\"B\")*0.6)+(COUNTIF(D22:O22,\"C\")*0.8)+(COUNTIF(D22:O22,\"D\")))","v":""}]
[null,null,null,{"$f":"IF(OR(D20=\"\",E20=\"\"),\"\",D20&\"\"&E20)","v":""},null,{"$f":"IF(OR(F20=\"\",G20=\"\"),\"\",F20&\"\"&G20)","v":""},null,{"$f":"IF(OR(H20=\"\",I20=\"\"),\"\",H20&\"\"&I20)","v":""},null,{"$f":"IF(OR(J20=\"\",K20=\"\"),\"\",J20&\"\"&K20)","v":""},null,{"$f":"IF(OR(L20=\"\",M20=\"\"),\"\",L20&\"\"&M20)","v":""},null,{"$f":"IF(OR(N20=\"\",O20=\"\"),\"\",N20&\"\"&O20)","v":""},null,"P /V présent",{"$f":"IF(AND(D22=\"\",F22=\"\",H22=\"\",J22=\"\",L22=\"\",N22=\"\"),\"\",AND(OR(D22=\"P\",F22=\"P\",H22=\"P\",J22=\"P\",L22=\"P\",N22=\"P\"),OR(D22=\"V\",F22=\"V\",H22=\"V\",J22=\"V\",L22=\"V\",N22=\"V\")))","v":""}]
[null,null,null,null,{"$f":"IF(D21=\"\",\"\",IFERROR(VLOOKUP(D21,Tableau_Images!$A$2:$D$231,2,0),\"?\"))","v":""},null,{"$f":"IF(F21=\"\",\"\",IFERROR(VLOOKUP(F21,Tableau_Images!$A$2:$D$231,2,0),\"?\"))","v":""},null,{"$f":"IF(H21=\"\",\"\",IFERROR(VLOOKUP(H21,Tableau_Images!$A$2:$D$231,2,0),\"?\"))","v":""},null,{"$f":"IF(J21=\"\",\"\",IFERROR(VLOOKUP(J21,Tableau_Images!$A$2:$D$231,2,0),\"?\"))","v":""},null,{"$f":"IF(L21=\"\",\"\",IFERROR(VLOOKUP(L21,Tableau_Images!$A$2:$D$231,2,0),\"?\"))","v":""},null,{"$f":"IF(N21=\"\",\"\",IFERROR(VLOOKUP(N21,Tableau_Images!$A$2:$D$231,2,0),\"?\"))","v":""},"El Ind/El Syn Présent",{"$f":"IF(AND(D22=\"\",F22=\"\",H22=\"\",J22=\"\",L22=\"\",N22=\"\"),\"\",AND(OR(D22=\"El Ind\",F22=\"El Ind\",H22=\"El Ind\",J22=\"El Ind\",L22=\"El Ind\",N22=\"El Ind\"),OR(D22=\"El Syn\",F22=\"El Syn\",H22=\"El Syn\",J22=\"El Syn\",L22=\"El Syn\",N22=\"El Syn\")))","v":""}]
[]
[]
[null,{"$f":"IF(Groupes!A31=\"\",\"\",Groupes!A31&\" \"&Groupes!B31)","v":""},null,"Figure / élément 1",null,"Figure / élément 2",null,"Figure / élément 3",null,"Figure / élément 4",null,"Figure / élément 5",null,"Figure / élément 6",null,"Exigence Validé ou non"]
[null,null,null,null,null,null,null,null,null,null,null,null,null,null,null,"Points execution",{"$f":"IF(AND(E28=\"\",G28=\"\",I28=\"\",K28=\"\",M28=\"\",O28=\"\"),\"\",(COUNTIF(D28:O28,\"A\")*0.4)+(COUNTIF(D28:O28,\"B\")*0.6)+(COUNTIF(D28:O28,\"C\")*0.8)+(COUNTIF(D28:O28,\"D\")))","v":""}]
[null,null,null,{"$f":"IF(OR(D26=\"\",E26=\"\"),\"\",D26&\"\"&E26)","v":""},null,{"$f":"IF(OR(F26=\"\",G26=\"\"),\"\",F26&\"\"&G26)","v":""},null,{"$f":"IF(OR(H26=\"\",I26=\"\"),\"\",H26&\"\"&I26)","v":""},null,{"$f":"IF(OR(J26=\"\",K26=\"\"),\"\",J26&\"\"&K26)","v":""},null,{"$f":"IF(OR(L26=\"\",M26=\"\"),\"\",L26&\"\"&M26)","v":""},null,{"$f":"IF(OR(N26=\"\",O26=\"\"),\"\",N26&\"\"&O26)","v":""},null,"P /V présent",{"$f":"IF(AND(D28=\"\",F28=\"\",H28=\"\",J28=\"\",L28=\"\",N28=\"\"),\"\",AND(OR(D28=\"P\",F28=\"P\",H28=\"P\",J28=\"P\",L28=\"P\",N28=\"P\"),OR(D28=\"V\",F28=\"V\",H28=\"V\",J28=\"V\",L28=\"V\",N28=\"V\")))","v":""}]
[null,null,null,null,{"$f":"IF(D27=\"\",\"\",IFERROR(VLOOKUP(D27,Tableau_Images!$A$2:$D$231,2,0),\"?\"))","v":""},null,{"$f":"IF(F27=\"\",\"\",IFERROR(VLOOKUP(F27,Tableau_Images!$A$2:$D$231,2,0),\"?\"))","v":""},null,{"$f":"IF(H27=\"\",\"\",IFERROR(VLOOKUP(H27,Tableau_Images!$A$2:$D$231,2,0),\"?\"))","v":""},null,{"$f":"IF(J27=\"\",\"\",IFERROR(VLOOKUP(J27,Tableau_Images!$A$2:$D$231,2,0),\"?\"))","v":""},null,{"$f":"IF(L27=\"\",\"\",IFERROR(VLOOKUP(L27,Tableau_Images!$A$2:$D$231,2,0),\"?\"))","v":""},null,{"$f":"IF(N27=\"\",\"\",IFERROR(VLOOKUP(N27,Tableau_Images!$A$2:$D$231,2,0),\"?\"))","v":""},"El Ind/El Syn Présent",{"$f":"IF(AND(D28=\"\",F28=\"\",H28=\"\",J28=\"\",L28=\"\",N28=\"\"),\"\",AND(OR(D28=\"El Ind\",F28=\"El Ind\",H28=\"El Ind\",J28=\"El Ind\",L28=\"El Ind\",N28=\"El Ind\"),OR(D28=\"El Syn\",F28=\"El Syn\",H28=\"El Syn\",J28=\"El Syn\",L28=\"El Syn\",N28=\"El Syn\")))","v":""}]
[]
[]
[null,{"$f":"IF(Groupes!A32=\"\",\"\",Groupes!A32&\" \"&Groupes!B32)","v":""},null,"Figure / élément 1",null,"Figure / élément 2",null,"Figure / élément 3",null,"Figure / élément 4",null,"Figure / élément 5",null,"Figure / élément 6",null,"Exigence Validé ou non"]
[null,null,null,null,null,null,null,null,null,null,null,null,null,null,null,"Points execution",{"$f":"IF(AND(E34=\"\",G34=\"\",I34=\"\",K34=\"\",M34=\"\",O34=\"\"),\"\",(COUNTIF(D34:O34,\"A\")*0.4)+(COUNTIF(D34:O34,\"B\")*0.6)+(COUNTIF(D34:O34,\"C\")*0.8)+(COUNTIF(D34:O34,\"D\")))","v":""}]
[null,null,null,{"$f":"IF(OR(D32=\"\",E32=\"\"),\"\",D32&\"\"&E32)","v":""},null,{"$f":"IF(OR(F32=\"\",G32=\"\"),\"\",F32&\"\"&G32)","v":""},null,{"$f":"IF(OR(H32=\"\",I32=\"\"),\"\",H32&\"\"&I32)","v":""},null,{"$f":"IF(OR(J32=\"\",K32=\"\"),\"\",J32&\"\"&K32)","v":""},null,{"$f":"IF(OR(L32=\"\",M32=\"\"),\"\",L32&\"\"&M32)","v":""},null,{"$f":"IF(OR(N32=\"\",O32=\"\"),\"\",N32&\"\"&O32)","v":""},null,"P /V présent",{"$f":"IF(AND(D34=\"\",F34=\"\",H34=\"\",J34=\"\",L34=\"\",N34=\"\"),\"\",AND(OR(D34=\"P\",F34=\"P\",H34=\"P\",J34=\"P\",L34=\"P\",N34=\"P\"),OR(D34=\"V\",F34=\"V\",H34=\"V\",J34=\"V\",L34=\"V\",N34=\"V\")))","v":""}]
[null,null,null,null,{"$f":"IF(D33=\"\",\"\",IFERROR(VLOOKUP(D33,Tableau_Images!$A$2:$D$231,2,0),\"?\"))","v":""},null,{"$f":"IF(F33=\"\",\"\",IFERROR(VLOOKUP(F33,Tableau_Images!$A$2:$D$231,2,0),\"?\"))","v":""},null,{"$f":"IF(H33=\"\",\"\",IFERROR(VLOOKUP(H33,Tableau_Images!$A$2:$D$231,2,0),\"?\"))","v":""},null,{"$f":"IF(J33=\"\",\"\",IFERROR(VLOOKUP(J33,Tableau_Images!$A$2:$D$231,2,0),\"?\"))","v":""},null,{"$f":"IF(L33=\"\",\"\",IFERROR(VLOOKUP(L33,Tableau_Images!$A$2:$D$231,2,0),\"?\"))","v":""},null,{"$f":"IF(N33=\"\",\"\",IFERROR(VLOOKUP(N33,Tableau_Images!$A$2:$D$231,2,0),\"?\"))","v":""},"El Ind/El Syn Présent",{"$f":"IF(AND(D34=\"\",F34=\"\",H34=\"\",J34=\"\",L34=\"\",N34=\"\"),\"\",AND(OR(D34=\"El Ind\",F34=\"El Ind\",H34=\"El Ind\",J34=\"El Ind\",L34=\"El Ind\",N34=\"El Ind\"),OR(D34=\"El Syn\",F34=\"El Syn\",H34=\"El Syn\",J34=\"El Syn\",L34=\"El Syn\",N34=\"El Syn\")))","v":""}]

{"sheet":"G7_C","index":16,"n_rows":20,"n_cols":23,"rows_kept":20,"cut":false,"hidden":true,"merged":[[15,17,18,17],[14,0,14,2],[14,3,14,5],[14,6,14,8],[14,9,14,11],[14,12,14,14],[14,15,14,17],[14,18,14,20],[14,21,14,23],[15,6,18,6],[15,7,18,7],[15,8,18,8],[15,9,18,9],[15,10,18,10],[15,11,18,11],[15,0,18,0],[15,1,18,1],[11,15,11,17],[15,2,18,2],[15,3,18,3],[15,4,18,4],[15,5,18,5],[15,18,18,18],[15,19,18,19],[15,20,18,20],[15,21,18,21],[13,0,13,2],[13,3,13,5],[13,6,13,8],[13,9,13,11],[13,12,13,14],[13,15,13,17],[13,18,13,20],[13,21,13,23],[15,22,18,22],[15,23,18,23],[15,12,18,12],[15,13,18,13],[15,14,18,14],[15,15,18,15],[15,16,18,16],[11,18,11,20],[11,21,11,23],[12,18,12,20],[12,21,12,23],[5,22,8,22],[5,23,8,23],[5,12,8,12],[5,13,8,13],[5,14,8,14],[5,15,8,15],[5,16,8,16],[5,17,8,17],[10,0,10,23],[12,0,12,2],[12,3,12,5],[12,6,12,8],[12,9,12,11],[12,12,12,14],[12,15,12,17],[11,0,11,2],[11,3,11,5],[11,6,11,8],[11,9,11,11],[11,12,11,14],[4,0,4,2],[4,3,4,5],[4,6,4,8],[4,9,4,11],[4,12,4,14],[4,15,4,17],[4,18,4,20],[4,21,4,23],[5,6,8,6],[5,7,8,7],[5,8,8,8],[5,9,8,9],[5,10,8,10],[5,11,8,11],[5,0,8,0],[5,1,8,1],[5,2,8,2],[5,3,8,3],[5,4,8,4],[5,5,8,5],[5,18,8,18],[5,19,8,19],[5,20,8,20],[5,21,8,21],[2,18,2,20],[2,21,2,23],[3,0,3,2],[3,3,3,5],[3,6,3,8],[3,9,3,11],[3,12,3,14],[3,15,3,17],[3,18,3,20],[3,21,3,23],[2,0,2,2],[2,3,2,5],[2,6,2,8],[2,9,2,11],[2,12,2,14],[2,15,2,17],[0,0,0,11],[0,12,0,23],[1,0,1,2],[1,3,1,5],[1,6,1,8],[1,9,1,11],[1,12,1,14],[1,15,1,17],[1,18,1,20],[1,21,1,23]]}
[{"$f":"IF(Groupes!C25=\"\",\"\",\"Groupe 7\")","v":""},null,null,null,null,null,null,null,null,null,null,null,": Projet collectif"]
["Figure / élément 1",null,null,"Figure / élément 2",null,null,"Figure / élément 3",null,null,"Figure / élément 4",null,null,"Figure / élément 5",null,null,"Figure / élément 6",null,null,"Figure / élément 7",null,null,"Figure / élément 8"]
[]
["",null,null,"",null,null,"",null,null,"",null,null,"",null,null,"",null,null,"",null,null,""]
["Espace : Où ? Direction ?",null,null,"Espace : Où ? Direction ?",null,null,"Espace : Où ? Direction ?",null,null,"Espace : Où ? Direction ?",null,null,"Espace : Où ? Direction ?",null,null,"Espace : Où ? Direction ?",null,null,"Espace : Où ? Direction ?",null,null,"Espace : Où ? Direction ?"]
[]
[]
[]
[]
[null,"Juge ",null,null,"Juge ",null,null,"Juge ",null,null,"Juge ",null,null,"Juge ",null,null,"Juge ",null,null,"Juge ",null,null,"Juge "]
[]
["Figure / élément 9",null,null,"Figure / élément 10",null,null,"Figure / élément 11",null,null,"Figure / élément 12",null,null,"Figure / élément 13",null,null,"Figure / élément 14",null,null,"Figure / élément 15",null,null,"Figure / élément 16"]
[]
["",null,null,"",null,null,"",null,null,"",null,null,"",null,null,"",null,null,"",null,null,""]
["Espace : Où ? Direction ?",null,null,"Espace : Où ? Direction ?",null,null,"Espace : Où ? Direction ?",null,null,"Espace : Où ? Direction ?",null,null,"Espace : Où ? Direction ?",null,null,"Espace : Où ? Direction ?",null,null,"Espace : Où ? Direction ?",null,null,"Espace : Où ? Direction ?"]
[]
[]
[]
[]
[null,"Juge ",null,null,"Juge ",null,null,"Juge ",null,null,"Juge ",null,null,"Juge ",null,null,"Juge ",null,null,"Juge ",null,null,"Juge "]

{"sheet":"G8","index":17,"n_rows":34,"n_cols":17,"rows_kept":34,"cut":false,"hidden":false,"merged":[[30,13,30,14],[30,15,30,16],[32,3,32,4],[32,5,32,6],[32,7,32,8],[32,9,32,10],[32,11,32,12],[32,13,32,14],[30,11,30,12],[30,1,33,2],[30,3,30,4],[30,5,30,6],[30,7,30,8],[30,9,30,10],[24,13,24,14],[24,15,24,16],[26,3,26,4],[26,5,26,6],[26,7,26,8],[26,9,26,10],[26,11,26,12],[26,13,26,14],[24,11,24,12],[24,1,27,2],[24,3,24,4],[24,5,24,6],[24,7,24,8],[24,9,24,10],[18,7,18,8],[18,9,18,10],[18,13,18,14],[18,15,18,16],[20,3,20,4],[20,5,20,6],[20,7,20,8],[20,9,20,10],[20,11,20,12],[20,13,20,14],[18,11,18,12],[12,9,12,10],[12,13,12,14],[12,15,12,16],[14,3,14,4],[14,5,14,6],[14,7,14,8],[14,9,14,10],[14,11,14,12],[14,13,14,14],[12,11,12,12],[6,9,6,10],[6,11,6,12],[6,13,6,14],[6,15,6,16],[8,3,8,4],[8,5,8,6],[8,7,8,8],[8,9,8,10],[8,11,8,12],[8,13,8,14],[0,11,0,12],[0,13,0,14],[0,15,0,16],[2,3,2,4],[2,5,2,6],[2,7,2,8],[2,9,2,10],[2,11,2,12],[2,13,2,14],[0,9,0,10],[0,0,33,0],[0,1,3,2],[0,3,0,4],[0,5,0,6],[0,7,0,8],[6,1,9,2],[6,3,6,4],[6,5,6,6],[6,7,6,8],[12,1,15,2],[12,3,12,4],[12,5,12,6],[12,7,12,8],[18,1,21,2],[18,3,18,4],[18,5,18,6]]}
["Groupe 8",{"$f":"IF(Groupes!F27=\"\",\"\",Groupes!F27&\" \"&Groupes!G27)","v":""},null,"Figure / élément 1",null,"Figure / élément 2",null,"Figure / élément 3",null,"Figure / élément 4",null,"Figure / élément 5",null,"Figure / élément 6",null,"Exigence validé ou non"]
[null,null,null,"D_St_PV_","A4",null,null,null,null,null,null,null,null,null,null,"Points execution",{"$f":"IF(AND(E4=\"\",G4=\"\",I4=\"\",K4=\"\",M4=\"\",O4=\"\"),\"\",(COUNTIF(D4:O4,\"A\")*0.4)+(COUNTIF(D4:O4,\"B\")*0.6)+(COUNTIF(D4:O4,\"C\")*0.8)+(COUNTIF(D4:O4,\"D\")))","v":0.4}]
[null,null,null,{"$f":"IF(OR(D2=\"\",E2=\"\"),\"\",D2&\"\"&E2)","v":"D_St_PV_A4"},null,{"$f":"IF(OR(F2=\"\",G2=\"\"),\"\",F2&\"\"&G2)","v":""},null,{"$f":"IF(OR(H2=\"\",I2=\"\"),\"\",H2&\"\"&I2)","v":""},null,{"$f":"IF(OR(J2=\"\",K2=\"\"),\"\",J2&\"\"&K2)","v":""},null,{"$f":"IF(OR(L2=\"\",M2=\"\"),\"\",L2&\"\"&M2)","v":""},null,{"$f":"IF(OR(N2=\"\",O2=\"\"),\"\",N2&\"\"&O2)","v":""},null,"P /V présent",{"$f":"IF(AND(D4=\"\",F4=\"\",H4=\"\",J4=\"\",L4=\"\",N4=\"\"),\"\",AND(OR(D4=\"P\",F4=\"P\",H4=\"P\",J4=\"P\",L4=\"P\",N4=\"P\"),OR(D4=\"V\",F4=\"V\",H4=\"V\",J4=\"V\",L4=\"V\",N4=\"V\")))","v":""}]
[null,null,null,null,{"$f":"IF(D3=\"\",\"\",IFERROR(VLOOKUP(D3,Tableau_Images!$A$2:$D$231,2,0),\"?\"))","v":"A"},null,{"$f":"IF(F3=\"\",\"\",IFERROR(VLOOKUP(F3,Tableau_Images!$A$2:$D$231,2,0),\"?\"))","v":""},null,{"$f":"IF(H3=\"\",\"\",IFERROR(VLOOKUP(H3,Tableau_Images!$A$2:$D$231,2,0),\"?\"))","v":""},null,{"$f":"IF(J3=\"\",\"\",IFERROR(VLOOKUP(J3,Tableau_Images!$A$2:$D$231,2,0),\"?\"))","v":""},null,{"$f":"IF(L3=\"\",\"\",IFERROR(VLOOKUP(L3,Tableau_Images!$A$2:$D$231,2,0),\"?\"))","v":""},null,{"$f":"IF(N3=\"\",\"\",IFERROR(VLOOKUP(N3,Tableau_Images!$A$2:$D$231,2,0),\"?\"))","v":""},"El Ind/El Syn Présent",{"$f":"IF(AND(D4=\"\",F4=\"\",H4=\"\",J4=\"\",L4=\"\",N4=\"\"),\"\",AND(OR(D4=\"El Ind\",F4=\"El Ind\",H4=\"El Ind\",J4=\"El Ind\",L4=\"El Ind\",N4=\"El Ind\"),OR(D4=\"El Syn\",F4=\"El Syn\",H4=\"El Syn\",J4=\"El Syn\",L4=\"El Syn\",N4=\"El Syn\")))","v":""}]
[]
[]
[null,{"$f":"IF(Groupes!F28=\"\",\"\",Groupes!F28&\" \"&Groupes!G28)","v":""},null,"Figure / élément 1",null,"Figure / élément 2",null,"Figure / élément 3",null,"Figure / élément 4",null,"Figure / élément 5",null,"Figure / élément 6",null,"Exigence Validé ou non"]
[null,null,null,null,null,null,null,null,null,null,null,null,null,null,null,"Points execution",{"$f":"IF(AND(E10=\"\",G10=\"\",I10=\"\",K10=\"\",M10=\"\",O10=\"\"),\"\",(COUNTIF(D10:O10,\"A\")*0.4)+(COUNTIF(D10:O10,\"B\")*0.6)+(COUNTIF(D10:O10,\"C\")*0.8)+(COUNTIF(D10:O10,\"D\")))","v":""}]
[null,null,null,{"$f":"IF(OR(D8=\"\",E8=\"\"),\"\",D8&\"\"&E8)","v":""},null,{"$f":"IF(OR(F8=\"\",G8=\"\"),\"\",F8&\"\"&G8)","v":""},null,{"$f":"IF(OR(H8=\"\",I8=\"\"),\"\",H8&\"\"&I8)","v":""},null,{"$f":"IF(OR(J8=\"\",K8=\"\"),\"\",J8&\"\"&K8)","v":""},null,{"$f":"IF(OR(L8=\"\",M8=\"\"),\"\",L8&\"\"&M8)","v":""},null,{"$f":"IF(OR(N8=\"\",O8=\"\"),\"\",N8&\"\"&O8)","v":""},null,"P /V présent",{"$f":"IF(AND(D10=\"\",F10=\"\",H10=\"\",J10=\"\",L10=\"\",N10=\"\"),\"\",AND(OR(D10=\"P\",F10=\"P\",H10=\"P\",J10=\"P\",L10=\"P\",N10=\"P\"),OR(D10=\"V\",F10=\"V\",H10=\"V\",J10=\"V\",L10=\"V\",N10=\"V\")))","v":""}]
[null,null,null,null,{"$f":"IF(D9=\"\",\"\",IFERROR(VLOOKUP(D9,Tableau_Images!$A$2:$D$231,2,0),\"?\"))","v":""},null,{"$f":"IF(F9=\"\",\"\",IFERROR(VLOOKUP(F9,Tableau_Images!$A$2:$D$231,2,0),\"?\"))","v":""},null,{"$f":"IF(H9=\"\",\"\",IFERROR(VLOOKUP(H9,Tableau_Images!$A$2:$D$231,2,0),\"?\"))","v":""},null,{"$f":"IF(J9=\"\",\"\",IFERROR(VLOOKUP(J9,Tableau_Images!$A$2:$D$231,2,0),\"?\"))","v":""},null,{"$f":"IF(L9=\"\",\"\",IFERROR(VLOOKUP(L9,Tableau_Images!$A$2:$D$231,2,0),\"?\"))","v":""},null,{"$f":"IF(N9=\"\",\"\",IFERROR(VLOOKUP(N9,Tableau_Images!$A$2:$D$231,2,0),\"?\"))","v":""},"El Ind/El Syn Présent",{"$f":"IF(AND(D10=\"\",F10=\"\",H10=\"\",J10=\"\",L10=\"\",N10=\"\"),\"\",AND(OR(D10=\"El Ind\",F10=\"El Ind\",H10=\"El Ind\",J10=\"El Ind\",L10=\"El Ind\",N10=\"El Ind\"),OR(D10=\"El Syn\",F10=\"El Syn\",H10=\"El Syn\",J10=\"El Syn\",L10=\"El Syn\",N10=\"El Syn\")))","v":""}]
[]
[]
[null,{"$f":"IF(Groupes!F29=\"\",\"\",Groupes!F29&\" \"&Groupes!G29)","v":""},null,"Figure / élément 1",null,"Figure / élément 2",null,"Figure / élément 3",null,"Figure / élément 4",null,"Figure / élément 5",null,"Figure / élément 6",null,"Exigence Validé ou non"]
[null,null,null,null,null,null,null,null,null,null,null,null,null,null,null,"Points execution",{"$f":"IF(AND(E16=\"\",G16=\"\",I16=\"\",K16=\"\",M16=\"\",O16=\"\"),\"\",(COUNTIF(D16:O16,\"A\")*0.4)+(COUNTIF(D16:O16,\"B\")*0.6)+(COUNTIF(D16:O16,\"C\")*0.8)+(COUNTIF(D16:O16,\"D\")))","v":""}]
[null,null,null,{"$f":"IF(OR(D14=\"\",E14=\"\"),\"\",D14&\"\"&E14)","v":""},null,{"$f":"IF(OR(F14=\"\",G14=\"\"),\"\",F14&\"\"&G14)","v":""},null,{"$f":"IF(OR(H14=\"\",I14=\"\"),\"\",H14&\"\"&I14)","v":""},null,{"$f":"IF(OR(J14=\"\",K14=\"\"),\"\",J14&\"\"&K14)","v":""},null,{"$f":"IF(OR(L14=\"\",M14=\"\"),\"\",L14&\"\"&M14)","v":""},null,{"$f":"IF(OR(N14=\"\",O14=\"\"),\"\",N14&\"\"&O14)","v":""},null,"P /V présent",{"$f":"IF(AND(D16=\"\",F16=\"\",H16=\"\",J16=\"\",L16=\"\",N16=\"\"),\"\",AND(OR(D16=\"P\",F16=\"P\",H16=\"P\",J16=\"P\",L16=\"P\",N16=\"P\"),OR(D16=\"V\",F16=\"V\",H16=\"V\",J16=\"V\",L16=\"V\",N16=\"V\")))","v":""}]
[null,null,null,null,{"$f":"IF(D15=\"\",\"\",IFERROR(VLOOKUP(D15,Tableau_Images!$A$2:$D$231,2,0),\"?\"))","v":""},null,{"$f":"IF(F15=\"\",\"\",IFERROR(VLOOKUP(F15,Tableau_Images!$A$2:$D$231,2,0),\"?\"))","v":""},null,{"$f":"IF(H15=\"\",\"\",IFERROR(VLOOKUP(H15,Tableau_Images!$A$2:$D$231,2,0),\"?\"))","v":""},null,{"$f":"IF(J15=\"\",\"\",IFERROR(VLOOKUP(J15,Tableau_Images!$A$2:$D$231,2,0),\"?\"))","v":""},null,{"$f":"IF(L15=\"\",\"\",IFERROR(VLOOKUP(L15,Tableau_Images!$A$2:$D$231,2,0),\"?\"))","v":""},null,{"$f":"IF(N15=\"\",\"\",IFERROR(VLOOKUP(N15,Tableau_Images!$A$2:$D$231,2,0),\"?\"))","v":""},"El Ind/El Syn Présent",{"$f":"IF(AND(D16=\"\",F16=\"\",H16=\"\",J16=\"\",L16=\"\",N16=\"\"),\"\",AND(OR(D16=\"El Ind\",F16=\"El Ind\",H16=\"El Ind\",J16=\"El Ind\",L16=\"El Ind\",N16=\"El Ind\"),OR(D16=\"El Syn\",F16=\"El Syn\",H16=\"El Syn\",J16=\"El Syn\",L16=\"El Syn\",N16=\"El Syn\")))","v":""}]
[]
[]
[null,{"$f":"IF(Groupes!F30=\"\",\"\",Groupes!F30&\" \"&Groupes!G30)","v":""},null,"Figure / élément 1",null,"Figure / élément 2",null,"Figure / élément 3",null,"Figure / élément 4",null,"Figure / élément 5",null,"Figure / élément 6",null,"Exigence Validé ou non"]
[null,null,null,null,null,null,null,null,null,null,null,null,null,null,null,"Points execution",{"$f":"IF(AND(E22=\"\",G22=\"\",I22=\"\",K22=\"\",M22=\"\",O22=\"\"),\"\",(COUNTIF(D22:O22,\"A\")*0.4)+(COUNTIF(D22:O22,\"B\")*0.6)+(COUNTIF(D22:O22,\"C\")*0.8)+(COUNTIF(D22:O22,\"D\")))","v":""}]
[null,null,null,{"$f":"IF(OR(D20=\"\",E20=\"\"),\"\",D20&\"\"&E20)","v":""},null,{"$f":"IF(OR(F20=\"\",G20=\"\"),\"\",F20&\"\"&G20)","v":""},null,{"$f":"IF(OR(H20=\"\",I20=\"\"),\"\",H20&\"\"&I20)","v":""},null,{"$f":"IF(OR(J20=\"\",K20=\"\"),\"\",J20&\"\"&K20)","v":""},null,{"$f":"IF(OR(L20=\"\",M20=\"\"),\"\",L20&\"\"&M20)","v":""},null,{"$f":"IF(OR(N20=\"\",O20=\"\"),\"\",N20&\"\"&O20)","v":""},null,"P /V présent",{"$f":"IF(AND(D22=\"\",F22=\"\",H22=\"\",J22=\"\",L22=\"\",N22=\"\"),\"\",AND(OR(D22=\"P\",F22=\"P\",H22=\"P\",J22=\"P\",L22=\"P\",N22=\"P\"),OR(D22=\"V\",F22=\"V\",H22=\"V\",J22=\"V\",L22=\"V\",N22=\"V\")))","v":""}]
[null,null,null,null,{"$f":"IF(D21=\"\",\"\",IFERROR(VLOOKUP(D21,Tableau_Images!$A$2:$D$231,2,0),\"?\"))","v":""},null,{"$f":"IF(F21=\"\",\"\",IFERROR(VLOOKUP(F21,Tableau_Images!$A$2:$D$231,2,0),\"?\"))","v":""},null,{"$f":"IF(H21=\"\",\"\",IFERROR(VLOOKUP(H21,Tableau_Images!$A$2:$D$231,2,0),\"?\"))","v":""},null,{"$f":"IF(J21=\"\",\"\",IFERROR(VLOOKUP(J21,Tableau_Images!$A$2:$D$231,2,0),\"?\"))","v":""},null,{"$f":"IF(L21=\"\",\"\",IFERROR(VLOOKUP(L21,Tableau_Images!$A$2:$D$231,2,0),\"?\"))","v":""},null,{"$f":"IF(N21=\"\",\"\",IFERROR(VLOOKUP(N21,Tableau_Images!$A$2:$D$231,2,0),\"?\"))","v":""},"El Ind/El Syn Présent",{"$f":"IF(AND(D22=\"\",F22=\"\",H22=\"\",J22=\"\",L22=\"\",N22=\"\"),\"\",AND(OR(D22=\"El Ind\",F22=\"El Ind\",H22=\"El Ind\",J22=\"El Ind\",L22=\"El Ind\",N22=\"El Ind\"),OR(D22=\"El Syn\",F22=\"El Syn\",H22=\"El Syn\",J22=\"El Syn\",L22=\"El Syn\",N22=\"El Syn\")))","v":""}]
[]
[]
[null,{"$f":"IF(Groupes!F31=\"\",\"\",Groupes!F31&\" \"&Groupes!G31)","v":""},null,"Figure / élément 1",null,"Figure / élément 2",null,"Figure / élément 3",null,"Figure / élément 4",null,"Figure / élément 5",null,"Figure / élément 6",null,"Exigence Validé ou non"]
[null,null,null,null,null,null,null,null,null,null,null,null,null,null,null,"Points execution",{"$f":"IF(AND(E28=\"\",G28=\"\",I28=\"\",K28=\"\",M28=\"\",O28=\"\"),\"\",(COUNTIF(D28:O28,\"A\")*0.4)+(COUNTIF(D28:O28,\"B\")*0.6)+(COUNTIF(D28:O28,\"C\")*0.8)+(COUNTIF(D28:O28,\"D\")))","v":""}]
[null,null,null,{"$f":"IF(OR(D26=\"\",E26=\"\"),\"\",D26&\"\"&E26)","v":""},null,{"$f":"IF(OR(F26=\"\",G26=\"\"),\"\",F26&\"\"&G26)","v":""},null,{"$f":"IF(OR(H26=\"\",I26=\"\"),\"\",H26&\"\"&I26)","v":""},null,{"$f":"IF(OR(J26=\"\",K26=\"\"),\"\",J26&\"\"&K26)","v":""},null,{"$f":"IF(OR(L26=\"\",M26=\"\"),\"\",L26&\"\"&M26)","v":""},null,{"$f":"IF(OR(N26=\"\",O26=\"\"),\"\",N26&\"\"&O26)","v":""},null,"P /V présent",{"$f":"IF(AND(D28=\"\",F28=\"\",H28=\"\",J28=\"\",L28=\"\",N28=\"\"),\"\",AND(OR(D28=\"P\",F28=\"P\",H28=\"P\",J28=\"P\",L28=\"P\",N28=\"P\"),OR(D28=\"V\",F28=\"V\",H28=\"V\",J28=\"V\",L28=\"V\",N28=\"V\")))","v":""}]
[null,null,null,null,{"$f":"IF(D27=\"\",\"\",IFERROR(VLOOKUP(D27,Tableau_Images!$A$2:$D$231,2,0),\"?\"))","v":""},null,{"$f":"IF(F27=\"\",\"\",IFERROR(VLOOKUP(F27,Tableau_Images!$A$2:$D$231,2,0),\"?\"))","v":""},null,{"$f":"IF(H27=\"\",\"\",IFERROR(VLOOKUP(H27,Tableau_Images!$A$2:$D$231,2,0),\"?\"))","v":""},null,{"$f":"IF(J27=\"\",\"\",IFERROR(VLOOKUP(J27,Tableau_Images!$A$2:$D$231,2,0),\"?\"))","v":""},null,{"$f":"IF(L27=\"\",\"\",IFERROR(VLOOKUP(L27,Tableau_Images!$A$2:$D$231,2,0),\"?\"))","v":""},null,{"$f":"IF(N27=\"\",\"\",IFERROR(VLOOKUP(N27,Tableau_Images!$A$2:$D$231,2,0),\"?\"))","v":""},"El Ind/El Syn Présent",{"$f":"IF(AND(D28=\"\",F28=\"\",H28=\"\",J28=\"\",L28=\"\",N28=\"\"),\"\",AND(OR(D28=\"El Ind\",F28=\"El Ind\",H28=\"El Ind\",J28=\"El Ind\",L28=\"El Ind\",N28=\"El Ind\"),OR(D28=\"El Syn\",F28=\"El Syn\",H28=\"El Syn\",J28=\"El Syn\",L28=\"El Syn\",N28=\"El Syn\")))","v":""}]
[]
[]
[null,{"$f":"IF(Groupes!F32=\"\",\"\",Groupes!F32&\" \"&Groupes!G32)","v":""},null,"Figure / élément 1",null,"Figure / élément 2",null,"Figure / élément 3",null,"Figure / élément 4",null,"Figure / élément 5",null,"Figure / élément 6",null,"Exigence Validé ou non"]
[null,null,null,null,null,null,null,null,null,null,null,null,null,null,null,"Points execution",{"$f":"IF(AND(E34=\"\",G34=\"\",I34=\"\",K34=\"\",M34=\"\",O34=\"\"),\"\",(COUNTIF(D34:O34,\"A\")*0.4)+(COUNTIF(D34:O34,\"B\")*0.6)+(COUNTIF(D34:O34,\"C\")*0.8)+(COUNTIF(D34:O34,\"D\")))","v":""}]
[null,null,null,{"$f":"IF(OR(D32=\"\",E32=\"\"),\"\",D32&\"\"&E32)","v":""},null,{"$f":"IF(OR(F32=\"\",G32=\"\"),\"\",F32&\"\"&G32)","v":""},null,{"$f":"IF(OR(H32=\"\",I32=\"\"),\"\",H32&\"\"&I32)","v":""},null,{"$f":"IF(OR(J32=\"\",K32=\"\"),\"\",J32&\"\"&K32)","v":""},null,{"$f":"IF(OR(L32=\"\",M32=\"\"),\"\",L32&\"\"&M32)","v":""},null,{"$f":"IF(OR(N32=\"\",O32=\"\"),\"\",N32&\"\"&O32)","v":""},null,"P /V présent",{"$f":"IF(AND(D34=\"\",F34=\"\",H34=\"\",J34=\"\",L34=\"\",N34=\"\"),\"\",AND(OR(D34=\"P\",F34=\"P\",H34=\"P\",J34=\"P\",L34=\"P\",N34=\"P\"),OR(D34=\"V\",F34=\"V\",H34=\"V\",J34=\"V\",L34=\"V\",N34=\"V\")))","v":""}]
[null,null,null,null,{"$f":"IF(D33=\"\",\"\",IFERROR(VLOOKUP(D33,Tableau_Images!$A$2:$D$231,2,0),\"?\"))","v":""},null,{"$f":"IF(F33=\"\",\"\",IFERROR(VLOOKUP(F33,Tableau_Images!$A$2:$D$231,2,0),\"?\"))","v":""},null,{"$f":"IF(H33=\"\",\"\",IFERROR(VLOOKUP(H33,Tableau_Images!$A$2:$D$231,2,0),\"?\"))","v":""},null,{"$f":"IF(J33=\"\",\"\",IFERROR(VLOOKUP(J33,Tableau_Images!$A$2:$D$231,2,0),\"?\"))","v":""},null,{"$f":"IF(L33=\"\",\"\",IFERROR(VLOOKUP(L33,Tableau_Images!$A$2:$D$231,2,0),\"?\"))","v":""},null,{"$f":"IF(N33=\"\",\"\",IFERROR(VLOOKUP(N33,Tableau_Images!$A$2:$D$231,2,0),\"?\"))","v":""},"El Ind/El Syn Présent",{"$f":"IF(AND(D34=\"\",F34=\"\",H34=\"\",J34=\"\",L34=\"\",N34=\"\"),\"\",AND(OR(D34=\"El Ind\",F34=\"El Ind\",H34=\"El Ind\",J34=\"El Ind\",L34=\"El Ind\",N34=\"El Ind\"),OR(D34=\"El Syn\",F34=\"El Syn\",H34=\"El Syn\",J34=\"El Syn\",L34=\"El Syn\",N34=\"El Syn\")))","v":""}]

{"sheet":"G8_C","index":18,"n_rows":20,"n_cols":23,"rows_kept":20,"cut":false,"hidden":true,"merged":[[15,17,18,17],[14,0,14,2],[14,3,14,5],[14,6,14,8],[14,9,14,11],[14,12,14,14],[14,15,14,17],[14,18,14,20],[14,21,14,23],[15,6,18,6],[15,7,18,7],[15,8,18,8],[15,9,18,9],[15,10,18,10],[15,11,18,11],[15,0,18,0],[15,1,18,1],[11,15,11,17],[15,2,18,2],[15,3,18,3],[15,4,18,4],[15,5,18,5],[15,18,18,18],[15,19,18,19],[15,20,18,20],[15,21,18,21],[13,0,13,2],[13,3,13,5],[13,6,13,8],[13,9,13,11],[13,12,13,14],[13,15,13,17],[13,18,13,20],[13,21,13,23],[15,22,18,22],[15,23,18,23],[15,12,18,12],[15,13,18,13],[15,14,18,14],[15,15,18,15],[15,16,18,16],[11,18,11,20],[11,21,11,23],[12,18,12,20],[12,21,12,23],[5,22,8,22],[5,23,8,23],[5,12,8,12],[5,13,8,13],[5,14,8,14],[5,15,8,15],[5,16,8,16],[5,17,8,17],[10,0,10,23],[12,0,12,2],[12,3,12,5],[12,6,12,8],[12,9,12,11],[12,12,12,14],[12,15,12,17],[11,0,11,2],[11,3,11,5],[11,6,11,8],[11,9,11,11],[11,12,11,14],[4,0,4,2],[4,3,4,5],[4,6,4,8],[4,9,4,11],[4,12,4,14],[4,15,4,17],[4,18,4,20],[4,21,4,23],[5,6,8,6],[5,7,8,7],[5,8,8,8],[5,9,8,9],[5,10,8,10],[5,11,8,11],[5,0,8,0],[5,1,8,1],[5,2,8,2],[5,3,8,3],[5,4,8,4],[5,5,8,5],[5,18,8,18],[5,19,8,19],[5,20,8,20],[5,21,8,21],[2,18,2,20],[2,21,2,23],[3,0,3,2],[3,3,3,5],[3,6,3,8],[3,9,3,11],[3,12,3,14],[3,15,3,17],[3,18,3,20],[3,21,3,23],[2,0,2,2],[2,3,2,5],[2,6,2,8],[2,9,2,11],[2,12,2,14],[2,15,2,17],[0,0,0,11],[0,12,0,23],[1,0,1,2],[1,3,1,5],[1,6,1,8],[1,9,1,11],[1,12,1,14],[1,15,1,17],[1,18,1,20],[1,21,1,23]]}
[{"$f":"IF(Groupes!H25=\"\",\"\",\"Groupe 8\")","v":""},null,null,null,null,null,null,null,null,null,null,null,": Projet collectif"]
["Figure / élément 1",null,null,"Figure / élément 2",null,null,"Figure / élément 3",null,null,"Figure / élément 4",null,null,"Figure / élément 5",null,null,"Figure / élément 6",null,null,"Figure / élément 7",null,null,"Figure / élément 8"]
[]
["",null,null,"",null,null,"",null,null,"",null,null,"",null,null,"",null,null,"",null,null,""]
["Espace : Où ? Direction ?",null,null,"Espace : Où ? Direction ?",null,null,"Espace : Où ? Direction ?",null,null,"Espace : Où ? Direction ?",null,null,"Espace : Où ? Direction ?",null,null,"Espace : Où ? Direction ?",null,null,"Espace : Où ? Direction ?",null,null,"Espace : Où ? Direction ?"]
[]
[]
[]
[]
[null,"Juge ",null,null,"Juge ",null,null,"Juge ",null,null,"Juge ",null,null,"Juge ",null,null,"Juge ",null,null,"Juge ",null,null,"Juge "]
[]
["Figure / élément 9",null,null,"Figure / élément 10",null,null,"Figure / élément 11",null,null,"Figure / élément 12",null,null,"Figure / élément 13",null,null,"Figure / élément 14",null,null,"Figure / élément 15",null,null,"Figure / élément 16"]
[]
["",null,null,"",null,null,"",null,null,"",null,null,"",null,null,"",null,null,"",null,null,""]
["Espace : Où ? Direction ?",null,null,"Espace : Où ? Direction ?",null,null,"Espace : Où ? Direction ?",null,null,"Espace : Où ? Direction ?",null,null,"Espace : Où ? Direction ?",null,null,"Espace : Où ? Direction ?",null,null,"Espace : Où ? Direction ?",null,null,"Espace : Où ? Direction ?"]
[]
[]
[]
[]
[null,"Juge ",null,null,"Juge ",null,null,"Juge ",null,null,"Juge ",null,null,"Juge ",null,null,"Juge ",null,null,"Juge ",null,null,"Juge "]

{"sheet":"G9","index":19,"n_rows":34,"n_cols":17,"rows_kept":34,"cut":false,"hidden":false,"merged":[[30,13,30,14],[30,15,30,16],[32,3,32,4],[32,5,32,6],[32,7,32,8],[32,9,32,10],[32,11,32,12],[32,13,32,14],[30,11,30,12],[30,1,33,2],[30,3,30,4],[30,5,30,6],[30,7,30,8],[30,9,30,10],[24,13,24,14],[24,15,24,16],[26,3,26,4],[26,5,26,6],[26,7,26,8],[26,9,26,10],[26,11,26,12],[26,13,26,14],[24,11,24,12],[24,1,27,2],[24,3,24,4],[24,5,24,6],[24,7,24,8],[24,9,24,10],[18,7,18,8],[18,9,18,10],[18,13,18,14],[18,15,18,16],[20,3,20,4],[20,5,20,6],[20,7,20,8],[20,9,20,10],[20,11,20,12],[20,13,20,14],[18,11,18,12],[12,9,12,10],[12,13,12,14],[12,15,12,16],[14,3,14,4],[14,5,14,6],[14,7,14,8],[14,9,14,10],[14,11,14,12],[14,13,14,14],[12,11,12,12],[6,9,6,10],[6,11,6,12],[6,13,6,14],[6,15,6,16],[8,3,8,4],[8,5,8,6],[8,7,8,8],[8,9,8,10],[8,11,8,12],[8,13,8,14],[0,11,0,12],[0,13,0,14],[0,15,0,16],[2,3,2,4],[2,5,2,6],[2,7,2,8],[2,9,2,10],[2,11,2,12],[2,13,2,14],[0,9,0,10],[0,0,33,0],[0,1,3,2],[0,3,0,4],[0,5,0,6],[0,7,0,8],[6,1,9,2],[6,3,6,4],[6,5,6,6],[6,7,6,8],[12,1,15,2],[12,3,12,4],[12,5,12,6],[12,7,12,8],[18,1,21,2],[18,3,18,4],[18,5,18,6]]}
["Groupe 9",{"$f":"IF(Groupes!K27=\"\",\"\",Groupes!K27&\" \"&Groupes!L27)","v":""},null,"Figure / élément 1",null,"Figure / élément 2",null,"Figure / élément 3",null,"Figure / élément 4",null,"Figure / élément 5",null,"Figure / élément 6",null,"Exigence validé ou non"]
[null,null,null,"D_St_ATR_","A4",null,null,null,null,null,null,null,null,null,null,"Points execution",{"$f":"IF(AND(E4=\"\",G4=\"\",I4=\"\",K4=\"\",M4=\"\",O4=\"\"),\"\",(COUNTIF(D4:O4,\"A\")*0.4)+(COUNTIF(D4:O4,\"B\")*0.6)+(COUNTIF(D4:O4,\"C\")*0.8)+(COUNTIF(D4:O4,\"D\")))","v":0.4}]
[null,null,null,{"$f":"IF(OR(D2=\"\",E2=\"\"),\"\",D2&\"\"&E2)","v":"D_St_ATR_A4"},null,{"$f":"IF(OR(F2=\"\",G2=\"\"),\"\",F2&\"\"&G2)","v":""},null,{"$f":"IF(OR(H2=\"\",I2=\"\"),\"\",H2&\"\"&I2)","v":""},null,{"$f":"IF(OR(J2=\"\",K2=\"\"),\"\",J2&\"\"&K2)","v":""},null,{"$f":"IF(OR(L2=\"\",M2=\"\"),\"\",L2&\"\"&M2)","v":""},null,{"$f":"IF(OR(N2=\"\",O2=\"\"),\"\",N2&\"\"&O2)","v":""},null,"P /V présent",{"$f":"IF(AND(D4=\"\",F4=\"\",H4=\"\",J4=\"\",L4=\"\",N4=\"\"),\"\",AND(OR(D4=\"P\",F4=\"P\",H4=\"P\",J4=\"P\",L4=\"P\",N4=\"P\"),OR(D4=\"V\",F4=\"V\",H4=\"V\",J4=\"V\",L4=\"V\",N4=\"V\")))","v":""}]
[null,null,null,null,{"$f":"IF(D3=\"\",\"\",IFERROR(VLOOKUP(D3,Tableau_Images!$A$2:$D$231,2,0),\"?\"))","v":"A"},null,{"$f":"IF(F3=\"\",\"\",IFERROR(VLOOKUP(F3,Tableau_Images!$A$2:$D$231,2,0),\"?\"))","v":""},null,{"$f":"IF(H3=\"\",\"\",IFERROR(VLOOKUP(H3,Tableau_Images!$A$2:$D$231,2,0),\"?\"))","v":""},null,{"$f":"IF(J3=\"\",\"\",IFERROR(VLOOKUP(J3,Tableau_Images!$A$2:$D$231,2,0),\"?\"))","v":""},null,{"$f":"IF(L3=\"\",\"\",IFERROR(VLOOKUP(L3,Tableau_Images!$A$2:$D$231,2,0),\"?\"))","v":""},null,{"$f":"IF(N3=\"\",\"\",IFERROR(VLOOKUP(N3,Tableau_Images!$A$2:$D$231,2,0),\"?\"))","v":""},"El Ind/El Syn Présent",{"$f":"IF(AND(D4=\"\",F4=\"\",H4=\"\",J4=\"\",L4=\"\",N4=\"\"),\"\",AND(OR(D4=\"El Ind\",F4=\"El Ind\",H4=\"El Ind\",J4=\"El Ind\",L4=\"El Ind\",N4=\"El Ind\"),OR(D4=\"El Syn\",F4=\"El Syn\",H4=\"El Syn\",J4=\"El Syn\",L4=\"El Syn\",N4=\"El Syn\")))","v":""}]
[]
[]
[null,{"$f":"IF(Groupes!K28=\"\",\"\",Groupes!K28&\" \"&Groupes!L28)","v":""},null,"Figure / élément 1",null,"Figure / élément 2",null,"Figure / élément 3",null,"Figure / élément 4",null,"Figure / élément 5",null,"Figure / élément 6",null,"Exigence Validé ou non"]
[null,null,null,null,null,null,null,null,null,null,null,null,null,null,null,"Points execution",{"$f":"IF(AND(E10=\"\",G10=\"\",I10=\"\",K10=\"\",M10=\"\",O10=\"\"),\"\",(COUNTIF(D10:O10,\"A\")*0.4)+(COUNTIF(D10:O10,\"B\")*0.6)+(COUNTIF(D10:O10,\"C\")*0.8)+(COUNTIF(D10:O10,\"D\")))","v":""}]
[null,null,null,{"$f":"IF(OR(D8=\"\",E8=\"\"),\"\",D8&\"\"&E8)","v":""},null,{"$f":"IF(OR(F8=\"\",G8=\"\"),\"\",F8&\"\"&G8)","v":""},null,{"$f":"IF(OR(H8=\"\",I8=\"\"),\"\",H8&\"\"&I8)","v":""},null,{"$f":"IF(OR(J8=\"\",K8=\"\"),\"\",J8&\"\"&K8)","v":""},null,{"$f":"IF(OR(L8=\"\",M8=\"\"),\"\",L8&\"\"&M8)","v":""},null,{"$f":"IF(OR(N8=\"\",O8=\"\"),\"\",N8&\"\"&O8)","v":""},null,"P /V présent",{"$f":"IF(AND(D10=\"\",F10=\"\",H10=\"\",J10=\"\",L10=\"\",N10=\"\"),\"\",AND(OR(D10=\"P\",F10=\"P\",H10=\"P\",J10=\"P\",L10=\"P\",N10=\"P\"),OR(D10=\"V\",F10=\"V\",H10=\"V\",J10=\"V\",L10=\"V\",N10=\"V\")))","v":""}]
[null,null,null,null,{"$f":"IF(D9=\"\",\"\",IFERROR(VLOOKUP(D9,Tableau_Images!$A$2:$D$231,2,0),\"?\"))","v":""},null,{"$f":"IF(F9=\"\",\"\",IFERROR(VLOOKUP(F9,Tableau_Images!$A$2:$D$231,2,0),\"?\"))","v":""},null,{"$f":"IF(H9=\"\",\"\",IFERROR(VLOOKUP(H9,Tableau_Images!$A$2:$D$231,2,0),\"?\"))","v":""},null,{"$f":"IF(J9=\"\",\"\",IFERROR(VLOOKUP(J9,Tableau_Images!$A$2:$D$231,2,0),\"?\"))","v":""},null,{"$f":"IF(L9=\"\",\"\",IFERROR(VLOOKUP(L9,Tableau_Images!$A$2:$D$231,2,0),\"?\"))","v":""},null,{"$f":"IF(N9=\"\",\"\",IFERROR(VLOOKUP(N9,Tableau_Images!$A$2:$D$231,2,0),\"?\"))","v":""},"El Ind/El Syn Présent",{"$f":"IF(AND(D10=\"\",F10=\"\",H10=\"\",J10=\"\",L10=\"\",N10=\"\"),\"\",AND(OR(D10=\"El Ind\",F10=\"El Ind\",H10=\"El Ind\",J10=\"El Ind\",L10=\"El Ind\",N10=\"El Ind\"),OR(D10=\"El Syn\",F10=\"El Syn\",H10=\"El Syn\",J10=\"El Syn\",L10=\"El Syn\",N10=\"El Syn\")))","v":""}]
[]
[]
[null,{"$f":"IF(Groupes!K29=\"\",\"\",Groupes!K29&\" \"&Groupes!L29)","v":""},null,"Figure / élément 1",null,"Figure / élément 2",null,"Figure / élément 3",null,"Figure / élément 4",null,"Figure / élément 5",null,"Figure / élément 6",null,"Exigence Validé ou non"]
[null,null,null,null,null,null,null,null,null,null,null,null,null,null,null,"Points execution",{"$f":"IF(AND(E16=\"\",G16=\"\",I16=\"\",K16=\"\",M16=\"\",O16=\"\"),\"\",(COUNTIF(D16:O16,\"A\")*0.4)+(COUNTIF(D16:O16,\"B\")*0.6)+(COUNTIF(D16:O16,\"C\")*0.8)+(COUNTIF(D16:O16,\"D\")))","v":""}]
[null,null,null,{"$f":"IF(OR(D14=\"\",E14=\"\"),\"\",D14&\"\"&E14)","v":""},null,{"$f":"IF(OR(F14=\"\",G14=\"\"),\"\",F14&\"\"&G14)","v":""},null,{"$f":"IF(OR(H14=\"\",I14=\"\"),\"\",H14&\"\"&I14)","v":""},null,{"$f":"IF(OR(J14=\"\",K14=\"\"),\"\",J14&\"\"&K14)","v":""},null,{"$f":"IF(OR(L14=\"\",M14=\"\"),\"\",L14&\"\"&M14)","v":""},null,{"$f":"IF(OR(N14=\"\",O14=\"\"),\"\",N14&\"\"&O14)","v":""},null,"P /V présent",{"$f":"IF(AND(D16=\"\",F16=\"\",H16=\"\",J16=\"\",L16=\"\",N16=\"\"),\"\",AND(OR(D16=\"P\",F16=\"P\",H16=\"P\",J16=\"P\",L16=\"P\",N16=\"P\"),OR(D16=\"V\",F16=\"V\",H16=\"V\",J16=\"V\",L16=\"V\",N16=\"V\")))","v":""}]
[null,null,null,null,{"$f":"IF(D15=\"\",\"\",IFERROR(VLOOKUP(D15,Tableau_Images!$A$2:$D$231,2,0),\"?\"))","v":""},null,{"$f":"IF(F15=\"\",\"\",IFERROR(VLOOKUP(F15,Tableau_Images!$A$2:$D$231,2,0),\"?\"))","v":""},null,{"$f":"IF(H15=\"\",\"\",IFERROR(VLOOKUP(H15,Tableau_Images!$A$2:$D$231,2,0),\"?\"))","v":""},null,{"$f":"IF(J15=\"\",\"\",IFERROR(VLOOKUP(J15,Tableau_Images!$A$2:$D$231,2,0),\"?\"))","v":""},null,{"$f":"IF(L15=\"\",\"\",IFERROR(VLOOKUP(L15,Tableau_Images!$A$2:$D$231,2,0),\"?\"))","v":""},null,{"$f":"IF(N15=\"\",\"\",IFERROR(VLOOKUP(N15,Tableau_Images!$A$2:$D$231,2,0),\"?\"))","v":""},"El Ind/El Syn Présent",{"$f":"IF(AND(D16=\"\",F16=\"\",H16=\"\",J16=\"\",L16=\"\",N16=\"\"),\"\",AND(OR(D16=\"El Ind\",F16=\"El Ind\",H16=\"El Ind\",J16=\"El Ind\",L16=\"El Ind\",N16=\"El Ind\"),OR(D16=\"El Syn\",F16=\"El Syn\",H16=\"El Syn\",J16=\"El Syn\",L16=\"El Syn\",N16=\"El Syn\")))","v":""}]
[]
[]
[null,{"$f":"IF(Groupes!K30=\"\",\"\",Groupes!K30&\" \"&Groupes!L30)","v":""},null,"Figure / élément 1",null,"Figure / élément 2",null,"Figure / élément 3",null,"Figure / élément 4",null,"Figure / élément 5",null,"Figure / élément 6",null,"Exigence Validé ou non"]
[null,null,null,null,null,null,null,null,null,null,null,null,null,null,null,"Points execution",{"$f":"IF(AND(E22=\"\",G22=\"\",I22=\"\",K22=\"\",M22=\"\",O22=\"\"),\"\",(COUNTIF(D22:O22,\"A\")*0.4)+(COUNTIF(D22:O22,\"B\")*0.6)+(COUNTIF(D22:O22,\"C\")*0.8)+(COUNTIF(D22:O22,\"D\")))","v":""}]
[null,null,null,{"$f":"IF(OR(D20=\"\",E20=\"\"),\"\",D20&\"\"&E20)","v":""},null,{"$f":"IF(OR(F20=\"\",G20=\"\"),\"\",F20&\"\"&G20)","v":""},null,{"$f":"IF(OR(H20=\"\",I20=\"\"),\"\",H20&\"\"&I20)","v":""},null,{"$f":"IF(OR(J20=\"\",K20=\"\"),\"\",J20&\"\"&K20)","v":""},null,{"$f":"IF(OR(L20=\"\",M20=\"\"),\"\",L20&\"\"&M20)","v":""},null,{"$f":"IF(OR(N20=\"\",O20=\"\"),\"\",N20&\"\"&O20)","v":""},null,"P /V présent",{"$f":"IF(AND(D22=\"\",F22=\"\",H22=\"\",J22=\"\",L22=\"\",N22=\"\"),\"\",AND(OR(D22=\"P\",F22=\"P\",H22=\"P\",J22=\"P\",L22=\"P\",N22=\"P\"),OR(D22=\"V\",F22=\"V\",H22=\"V\",J22=\"V\",L22=\"V\",N22=\"V\")))","v":""}]
[null,null,null,null,{"$f":"IF(D21=\"\",\"\",IFERROR(VLOOKUP(D21,Tableau_Images!$A$2:$D$231,2,0),\"?\"))","v":""},null,{"$f":"IF(F21=\"\",\"\",IFERROR(VLOOKUP(F21,Tableau_Images!$A$2:$D$231,2,0),\"?\"))","v":""},null,{"$f":"IF(H21=\"\",\"\",IFERROR(VLOOKUP(H21,Tableau_Images!$A$2:$D$231,2,0),\"?\"))","v":""},null,{"$f":"IF(J21=\"\",\"\",IFERROR(VLOOKUP(J21,Tableau_Images!$A$2:$D$231,2,0),\"?\"))","v":""},null,{"$f":"IF(L21=\"\",\"\",IFERROR(VLOOKUP(L21,Tableau_Images!$A$2:$D$231,2,0),\"?\"))","v":""},null,{"$f":"IF(N21=\"\",\"\",IFERROR(VLOOKUP(N21,Tableau_Images!$A$2:$D$231,2,0),\"?\"))","v":""},"El Ind/El Syn Présent",{"$f":"IF(AND(D22=\"\",F22=\"\",H22=\"\",J22=\"\",L22=\"\",N22=\"\"),\"\",AND(OR(D22=\"El Ind\",F22=\"El Ind\",H22=\"El Ind\",J22=\"El Ind\",L22=\"El Ind\",N22=\"El Ind\"),OR(D22=\"El Syn\",F22=\"El Syn\",H22=\"El Syn\",J22=\"El Syn\",L22=\"El Syn\",N22=\"El Syn\")))","v":""}]
[]
[]
[null,{"$f":"IF(Groupes!K31=\"\",\"\",Groupes!K31&\" \"&Groupes!L31)","v":""},null,"Figure / élément 1",null,"Figure / élément 2",null,"Figure / élément 3",null,"Figure / élément 4",null,"Figure / élément 5",null,"Figure / élément 6",null,"Exigence Validé ou non"]
[null,null,null,null,null,null,null,null,null,null,null,null,null,null,null,"Points execution",{"$f":"IF(AND(E28=\"\",G28=\"\",I28=\"\",K28=\"\",M28=\"\",O28=\"\"),\"\",(COUNTIF(D28:O28,\"A\")*0.4)+(COUNTIF(D28:O28,\"B\")*0.6)+(COUNTIF(D28:O28,\"C\")*0.8)+(COUNTIF(D28:O28,\"D\")))","v":""}]
[null,null,null,{"$f":"IF(OR(D26=\"\",E26=\"\"),\"\",D26&\"\"&E26)","v":""},null,{"$f":"IF(OR(F26=\"\",G26=\"\"),\"\",F26&\"\"&G26)","v":""},null,{"$f":"IF(OR(H26=\"\",I26=\"\"),\"\",H26&\"\"&I26)","v":""},null,{"$f":"IF(OR(J26=\"\",K26=\"\"),\"\",J26&\"\"&K26)","v":""},null,{"$f":"IF(OR(L26=\"\",M26=\"\"),\"\",L26&\"\"&M26)","v":""},null,{"$f":"IF(OR(N26=\"\",O26=\"\"),\"\",N26&\"\"&O26)","v":""},null,"P /V présent",{"$f":"IF(AND(D28=\"\",F28=\"\",H28=\"\",J28=\"\",L28=\"\",N28=\"\"),\"\",AND(OR(D28=\"P\",F28=\"P\",H28=\"P\",J28=\"P\",L28=\"P\",N28=\"P\"),OR(D28=\"V\",F28=\"V\",H28=\"V\",J28=\"V\",L28=\"V\",N28=\"V\")))","v":""}]
[null,null,null,null,{"$f":"IF(D27=\"\",\"\",IFERROR(VLOOKUP(D27,Tableau_Images!$A$2:$D$231,2,0),\"?\"))","v":""},null,{"$f":"IF(F27=\"\",\"\",IFERROR(VLOOKUP(F27,Tableau_Images!$A$2:$D$231,2,0),\"?\"))","v":""},null,{"$f":"IF(H27=\"\",\"\",IFERROR(VLOOKUP(H27,Tableau_Images!$A$2:$D$231,2,0),\"?\"))","v":""},null,{"$f":"IF(J27=\"\",\"\",IFERROR(VLOOKUP(J27,Tableau_Images!$A$2:$D$231,2,0),\"?\"))","v":""},null,{"$f":"IF(L27=\"\",\"\",IFERROR(VLOOKUP(L27,Tableau_Images!$A$2:$D$231,2,0),\"?\"))","v":""},null,{"$f":"IF(N27=\"\",\"\",IFERROR(VLOOKUP(N27,Tableau_Images!$A$2:$D$231,2,0),\"?\"))","v":""},"El Ind/El Syn Présent",{"$f":"IF(AND(D28=\"\",F28=\"\",H28=\"\",J28=\"\",L28=\"\",N28=\"\"),\"\",AND(OR(D28=\"El Ind\",F28=\"El Ind\",H28=\"El Ind\",J28=\"El Ind\",L28=\"El Ind\",N28=\"El Ind\"),OR(D28=\"El Syn\",F28=\"El Syn\",H28=\"El Syn\",J28=\"El Syn\",L28=\"El Syn\",N28=\"El Syn\")))","v":""}]
[]
[]
[null,{"$f":"IF(Groupes!K32=\"\",\"\",Groupes!K32&\" \"&Groupes!L32)","v":""},null,"Figure / élément 1",null,"Figure / élément 2",null,"Figure / élément 3",null,"Figure / élément 4",null,"Figure / élément 5",null,"Figure / élément 6",null,"Exigence Validé ou non"]
[null,null,null,null,null,null,null,null,null,null,null,null,null,null,null,"Points execution",{"$f":"IF(AND(E34=\"\",G34=\"\",I34=\"\",K34=\"\",M34=\"\",O34=\"\"),\"\",(COUNTIF(D34:O34,\"A\")*0.4)+(COUNTIF(D34:O34,\"B\")*0.6)+(COUNTIF(D34:O34,\"C\")*0.8)+(COUNTIF(D34:O34,\"D\")))","v":""}]
[null,null,null,{"$f":"IF(OR(D32=\"\",E32=\"\"),\"\",D32&\"\"&E32)","v":""},null,{"$f":"IF(OR(F32=\"\",G32=\"\"),\"\",F32&\"\"&G32)","v":""},null,{"$f":"IF(OR(H32=\"\",I32=\"\"),\"\",H32&\"\"&I32)","v":""},null,{"$f":"IF(OR(J32=\"\",K32=\"\"),\"\",J32&\"\"&K32)","v":""},null,{"$f":"IF(OR(L32=\"\",M32=\"\"),\"\",L32&\"\"&M32)","v":""},null,{"$f":"IF(OR(N32=\"\",O32=\"\"),\"\",N32&\"\"&O32)","v":""},null,"P /V présent",{"$f":"IF(AND(D34=\"\",F34=\"\",H34=\"\",J34=\"\",L34=\"\",N34=\"\"),\"\",AND(OR(D34=\"P\",F34=\"P\",H34=\"P\",J34=\"P\",L34=\"P\",N34=\"P\"),OR(D34=\"V\",F34=\"V\",H34=\"V\",J34=\"V\",L34=\"V\",N34=\"V\")))","v":""}]
[null,null,null,null,{"$f":"IF(D33=\"\",\"\",IFERROR(VLOOKUP(D33,Tableau_Images!$A$2:$D$231,2,0),\"?\"))","v":""},null,{"$f":"IF(F33=\"\",\"\",IFERROR(VLOOKUP(F33,Tableau_Images!$A$2:$D$231,2,0),\"?\"))","v":""},null,{"$f":"IF(H33=\"\",\"\",IFERROR(VLOOKUP(H33,Tableau_Images!$A$2:$D$231,2,0),\"?\"))","v":""},null,{"$f":"IF(J33=\"\",\"\",IFERROR(VLOOKUP(J33,Tableau_Images!$A$2:$D$231,2,0),\"?\"))","v":""},null,{"$f":"IF(L33=\"\",\"\",IFERROR(VLOOKUP(L33,Tableau_Images!$A$2:$D$231,2,0),\"?\"))","v":""},null,{"$f":"IF(N33=\"\",\"\",IFERROR(VLOOKUP(N33,Tableau_Images!$A$2:$D$231,2,0),\"?\"))","v":""},"El Ind/El Syn Présent",{"$f":"IF(AND(D34=\"\",F34=\"\",H34=\"\",J34=\"\",L34=\"\",N34=\"\"),\"\",AND(OR(D34=\"El Ind\",F34=\"El Ind\",H34=\"El Ind\",J34=\"El Ind\",L34=\"El Ind\",N34=\"El Ind\"),OR(D34=\"El Syn\",F34=\"El Syn\",H34=\"El Syn\",J34=\"El Syn\",L34=\"El Syn\",N34=\"El Syn\")))","v":""}]

{"sheet":"G9_C","index":20,"n_rows":20,"n_cols":23,"rows_kept":20,"cut":false,"hidden":true,"merged":[[15,17,18,17],[14,0,14,2],[14,3,14,5],[14,6,14,8],[14,9,14,11],[14,12,14,14],[14,15,14,17],[14,18,14,20],[14,21,14,23],[15,6,18,6],[15,7,18,7],[15,8,18,8],[15,9,18,9],[15,10,18,10],[15,11,18,11],[15,0,18,0],[15,1,18,1],[11,15,11,17],[15,2,18,2],[15,3,18,3],[15,4,18,4],[15,5,18,5],[15,18,18,18],[15,19,18,19],[15,20,18,20],[15,21,18,21],[13,0,13,2],[13,3,13,5],[13,6,13,8],[13,9,13,11],[13,12,13,14],[13,15,13,17],[13,18,13,20],[13,21,13,23],[15,22,18,22],[15,23,18,23],[15,12,18,12],[15,13,18,13],[15,14,18,14],[15,15,18,15],[15,16,18,16],[11,18,11,20],[11,21,11,23],[12,18,12,20],[12,21,12,23],[5,22,8,22],[5,23,8,23],[5,12,8,12],[5,13,8,13],[5,14,8,14],[5,15,8,15],[5,16,8,16],[5,17,8,17],[10,0,10,23],[12,0,12,2],[12,3,12,5],[12,6,12,8],[12,9,12,11],[12,12,12,14],[12,15,12,17],[11,0,11,2],[11,3,11,5],[11,6,11,8],[11,9,11,11],[11,12,11,14],[4,0,4,2],[4,3,4,5],[4,6,4,8],[4,9,4,11],[4,12,4,14],[4,15,4,17],[4,18,4,20],[4,21,4,23],[5,6,8,6],[5,7,8,7],[5,8,8,8],[5,9,8,9],[5,10,8,10],[5,11,8,11],[5,0,8,0],[5,1,8,1],[5,2,8,2],[5,3,8,3],[5,4,8,4],[5,5,8,5],[5,18,8,18],[5,19,8,19],[5,20,8,20],[5,21,8,21],[2,18,2,20],[2,21,2,23],[3,0,3,2],[3,3,3,5],[3,6,3,8],[3,9,3,11],[3,12,3,14],[3,15,3,17],[3,18,3,20],[3,21,3,23],[2,0,2,2],[2,3,2,5],[2,6,2,8],[2,9,2,11],[2,12,2,14],[2,15,2,17],[0,0,0,11],[0,12,0,23],[1,0,1,2],[1,3,1,5],[1,6,1,8],[1,9,1,11],[1,12,1,14],[1,15,1,17],[1,18,1,20],[1,21,1,23]]}
[{"$f":"IF(Groupes!M25=\"\",\"\",\"Groupe 9\")","v":""},null,null,null,null,null,null,null,null,null,null,null,": Projet collectif"]
["Figure / élément 1",null,null,"Figure / élément 2",null,null,"Figure / élément 3",null,null,"Figure / élément 4",null,null,"Figure / élément 5",null,null,"Figure / élément 6",null,null,"Figure / élément 7",null,null,"Figure / élément 8"]
[]
["",null,null,"",null,null,"",null,null,"",null,null,"",null,null,"",null,null,"",null,null,""]
["Espace : Où ? Direction ?",null,null,"Espace : Où ? Direction ?",null,null,"Espace : Où ? Direction ?",null,null,"Espace : Où ? Direction ?",null,null,"Espace : Où ? Direction ?",null,null,"Espace : Où ? Direction ?",null,null,"Espace : Où ? Direction ?",null,null,"Espace : Où ? Direction ?"]
[]
[]
[]
[]
[null,"Juge ",null,null,"Juge ",null,null,"Juge ",null,null,"Juge ",null,null,"Juge ",null,null,"Juge ",null,null,"Juge ",null,null,"Juge "]
[]
["Figure / élément 9",null,null,"Figure / élément 10",null,null,"Figure / élément 11",null,null,"Figure / élément 12",null,null,"Figure / élément 13",null,null,"Figure / élément 14",null,null,"Figure / élément 15",null,null,"Figure / élément 16"]
[]
["",null,null,"",null,null,"",null,null,"",null,null,"",null,null,"",null,null,"",null,null,""]
["Espace : Où ? Direction ?",null,null,"Espace : Où ? Direction ?",null,null,"Espace : Où ? Direction ?",null,null,"Espace : Où ? Direction ?",null,null,"Espace : Où ? Direction ?",null,null,"Espace : Où ? Direction ?",null,null,"Espace : Où ? Direction ?",null,null,"Espace : Où ? Direction ?"]
[]
[]
[]
[]
[null,"Juge ",null,null,"Juge ",null,null,"Juge ",null,null,"Juge ",null,null,"Juge ",null,null,"Juge ",null,null,"Juge ",null,null,"Juge "]

{"sheet":"Projets_Individuels","index":21,"n_rows":47,"n_cols":35,"rows_kept":47,"cut":false,"hidden":false,"merged":[[0,0,0,4],[0,5,0,10],[0,11,0,30],[0,31,0,34],[46,22,47,30],[46,31,47,34],[25,24,25,31],[38,32,38,34],[25,32,25,34],[44,32,44,34],[44,27,44,31],[41,13,41,14],[34,18,34,34],[35,16,35,17],[32,9,32,13],[32,16,32,20],[32,23,32,27],[27,30,28,34],[29,30,29,34],[30,30,30,34],[31,30,31,34],[32,14,32,15],[32,21,32,22],[32,28,32,29],[35,25,35,34],[35,18,35,24],[30,9,30,13],[30,14,30,15],[41,5,41,6],[40,15,40,34],[30,23,30,27],[30,28,30,29],[31,23,31,27],[31,28,31,29],[30,21,30,22],[38,18,38,31],[36,25,36,34],[37,25,37,34],[40,0,43,4],[43,5,43,14],[43,15,43,24],[43,25,43,34],[40,5,40,14],[42,5,42,14],[42,15,42,24],[42,25,42,34],[41,24,41,25],[41,33,41,34],[41,15,41,16],[34,0,37,4],[34,5,35,9],[36,5,36,9],[37,5,37,9],[34,10,34,17],[36,10,36,17],[37,10,37,17],[31,9,31,13],[31,14,31,15],[31,16,31,20],[27,0,31,4],[27,5,28,8],[29,5,29,8],[30,5,30,8],[31,5,31,8],[27,9,28,15],[27,16,28,22],[36,18,36,24],[37,18,37,24],[30,16,30,20],[31,21,31,22],[35,10,35,11],[35,12,35,15],[29,23,29,27],[19,25,19,26],[29,28,29,29],[29,21,29,22],[29,9,29,13],[29,14,29,15],[20,5,20,9],[21,5,21,9],[22,5,22,9],[23,5,23,9],[24,5,24,9],[20,10,20,16],[21,10,21,16],[22,10,22,16],[27,23,28,29],[23,10,23,16],[22,26,22,34],[29,16,29,20],[12,19,12,22],[18,0,24,4],[18,5,19,9],[24,10,24,16],[11,19,11,34],[13,19,13,22],[20,26,20,34],[21,26,21,34],[18,10,18,16],[19,13,19,16],[19,10,19,12],[19,17,19,18],[12,15,12,18],[13,11,16,18],[16,32,16,33],[23,26,23,34],[24,26,24,34],[20,17,20,25],[21,17,21,25],[22,17,22,25],[23,17,23,25],[24,17,24,25],[18,17,18,34],[19,33,19,34],[16,19,16,23],[16,27,16,31],[6,27,10,34],[4,11,4,12],[4,13,4,18],[12,11,12,14],[3,28,3,31],[3,32,3,34],[3,16,3,20],[14,19,14,22],[3,21,3,27],[4,19,4,20],[4,21,4,26],[4,27,4,28],[4,29,4,34],[5,11,5,14],[5,15,5,18],[11,13,11,18],[5,27,5,30],[3,3,3,15],[5,31,5,34],[6,19,10,26],[12,23,12,27],[12,28,12,34],[16,24,16,26],[15,19,15,34],[5,19,5,22],[5,23,5,26],[1,32,1,34],[3,0,3,2],[4,0,16,2],[4,3,4,4],[4,5,4,10],[5,3,5,6],[5,7,5,10],[6,3,10,10],[11,3,11,4],[6,11,10,18],[11,5,11,10],[12,3,12,6],[12,7,12,10],[13,3,16,10],[11,11,11,12],[1,29,1,31],[1,27,1,28],[1,22,1,26],[1,0,1,8],[1,9,1,21]]}
["Lycée",null,null,null,null,{"$f":"CELL(\"contenu\",'Mode emploi'!O1:P1)","v":"Colbert"},null,null,null,null,null," -- Acrosport fiche individuelle --            CCF BAC Session ",null,null,null,null,null,null,null,null,null,null,null,null,null,null,null,null,null,null,null,{"$f":"'Mode emploi'!O2","v":2019}]
["Nom - Prénom du candidat :",null,null,null,null,null,null,null,null,"Bredier Nicolas",null,null,null,null,null,null,null,null,null,null,null,null,{"$f":"IF(J2=\"\",\"\",VLOOKUP(J2,Tableau_Eleves,2,0))","v":"Groupe 1"},null,null,null,null,null,null,"Classe :",null,null,{"$f":"IF(J2=\"\",\"\",VLOOKUP(J2,Tableau_Eleves,3,0))","v":"TS"}]
[]
["Thème :",null,null,null,null,null,null,null,null,null,null,null,null,null,null,null,"Musique:",null,null,null,null,null,null,null,null,null,null,null,"Durée :"]
["Difficulté \n\nsur 6 pts",null,null,1,null,{"$f":"IF(J2=\"\",\"\",VLOOKUP(J2,Tableau_Eleves,4,0))","v":"D_St_EQ_B1"},null,null,null,null,null,2,null,{"$f":"IF(J2=\"\",\"\",VLOOKUP(J2,Tableau_Eleves,7,0))","v":"D_St_ATR_C4"},null,null,null,null,null,3,null,{"$f":"IF(J2=\"\",\"\",VLOOKUP(J2,Tableau_Eleves,10,0))","v":"T_St_EQ_B6"},null,null,null,null,null,4,null,{"$f":"IF(J2=\"\",\"\",VLOOKUP(J2,Tableau_Eleves,13,0))","v":"D_Dy_B2"}]
[null,null,null,{"$f":"IF(F5=\"\",\"\",VLOOKUP(J2,Tableau_Eleves,5,0))","v":""},null,null,null,{"$f":"IF(F5=\"\",\"\",VLOOKUP(J2,Tableau_Eleves,6,0))","v":"B"},null,null,null,{"$f":"IF(N5=\"\",\"\",VLOOKUP(J2,Tableau_Eleves,8,0))","v":"P"},null,null,null,{"$f":"IF(N5=\"\",\"\",VLOOKUP(J2,Tableau_Eleves,9,0))","v":"C"},null,null,null,{"$f":"IF(V5=\"\",\"\",VLOOKUP(J2,Tableau_Eleves,11,0))","v":"P"},null,null,null,{"$f":"IF(V5=\"\",\"\",VLOOKUP(J2,Tableau_Eleves,12,0))","v":"B"},null,null,null,{"$f":"IF(AD5=\"\",\"\",VLOOKUP(J2,Tableau_Eleves,14,0))","v":"V"},null,null,null,{"$f":"IF(AD5=\"\",\"\",VLOOKUP(J2,Tableau_Eleves,15,0))","v":"B"}]
[]
[]
[]
[]
[]
[null,null,null,5,null,{"$f":"IF(J2=\"\",\"\",VLOOKUP(J2,Tableau_Eleves,16,0))","v":"El_Ag_B3"},null,null,null,null,null,6,null,{"$f":"IF(J2=\"\",\"\",VLOOKUP(J2,Tableau_Eleves,19,0))","v":"El_Ag_B1"},null,null,null,null,null,"Barème"]
[null,null,null,{"$f":"IF(F12=\"\",\"\",VLOOKUP(J2,Tableau_Eleves,17,0))","v":"El Ind"},null,null,null,{"$f":"IF(F12=\"\",\"\",VLOOKUP(J2,Tableau_Eleves,18,0))","v":"B"},null,null,null,{"$f":"IF(N12=\"\",\"\",VLOOKUP(J2,Tableau_Eleves,20,0))","v":"El Syn"},null,null,null,{"$f":"IF(N12=\"\",\"\",VLOOKUP(J2,Tableau_Eleves,21,0))","v":"B"},null,null,null,"Niveau",null,null,null,"< 4",null,null,null,null,"> 4"]
[null,null,null,null,null,null,null,null,null,null,null,null,null,null,null,null,null,null,null,"Points",null,null,null,2.2000000000000002,2.4,2.6,2.8,3,3.2,3.4,3.6,3.8,4,4.2,4.4000000000000004]
[null,null,null,null,null,null,null,null,null,null,null,null,null,null,null,null,null,null,null,"Notes",null,null,null,0.5,1,1.5,2,2.5,3,3.5,4,4.5,5,5.5,6]
[null,null,null,null,null,null,null,null,null,null,null,null,null,null,null,null,null,null,null,"Valeurs des difficultés\nA = 0,4    --    B = 0,6    --    C = 0,8    --    D = 1 "]
[null,null,null,null,null,null,null,null,null,null,null,null,null,null,null,null,null,null,null,"Total points :",null,null,null,null,{"$f":"IF(J2=\"\",\"\",VLOOKUP(J2,Tableau_Eleves,22,0))","v":3.8},null,null,"Note difficulté :",null,null,null,null,{"$f":"IF(Y17=\"\",\"\",IF(Y17<2.2,0,IF(Y17>4.4,6,HLOOKUP(Y17,X14:AI15,2))))","v":4.5},null,"/6"]
[]
["Composition  \nsur 3 pts\n\nNote \ncollective",null,null,null,null,"Items à \névaluer",null,null,null,null,"Niveau < 4",null,null,null,null,null,null,"Niveau 4"]
[null,null,null,null,null,null,null,null,null,null,0,null,null,0.5,null,null,null,1,null,null,null,null,null,null,null,2,null,null,null,null,null,null,null,3]
[null,null,null,null,null,"Scénario",null,null,null,null,"Sommaire",null,null,null,null,null,null,"Présenté clairement",null,null,null,null,null,null,null,null,"Lisible et utilisable pour les juges"]
[null,null,null,null,null,"Espace",null,null,null,null,"Exploité aux 2 tiers",null,null,null,null,null,null,"Exploité dans son ensemble",null,null,null,null,null,null,null,null,"De façon originale (dissymétrie, aérien plus présent)"]
[null,null,null,null,null,"Déplacement",null,null,null,null,"Exclusivement gymniques",null,null,null,null,null,null,"Variés et rythmés (gymniques et/ou chorégraphiques",null,null,null,null,null,null,null,null,"Originaux"]
[null,null,null,null,null,"Musiques",null,null,null,null,"Peu exploité",null,null,null,null,null,null,"Synchronisation avec le monde sonore",null,null,null,null,null,null,null,null,"Joue avec l’univers musical"]
[null,null,null,null,null,"Liaisons",null,null,null,null,"Peu variées",null,null,null,null,null,null,"Variées",null,null,null,null,null,null,null,null,"Originales"]
[null,null,null,null,null,null,null,null,null,null,null,null,null,null,null,null,null,null,null,null,null,null,null,null,"Notes composition  :",null,null,null,null,null,null,null,"/3"]
[]
["Execution\nsur 6 pts\n\nSi tout bien réalisé",null,null,null,null,"Valeurs des fautes",null,null,null,"Figures statiques",null,null,null,null,null,null,"Figures dynamiques",null,null,null,null,null,null,"Eléments",null,null,null,null,null,null,"Chutes\nMoins 1 pts"]
[]
[null,null,null,null,null,"Moins 0,5",null,null,null,"Tenue",null,null,null,null,null,null,"Amplitude",null,null,null,null,null,null,"Technique"]
[null,null,null,null,null,"Moins 0,3",null,null,null,"Alignements\nTremblements",null,null,null,null,null,null,"Réception",null,null,null,null,null,null,"Décalage\n/partenaire",null,null,null,null,null,null,"Exigences\nManquantes\nMoins 0,5"]
[null,null,null,null,null,"Moins 0,2",null,null,null,"Correction",null,null,null,null,null,null,"Correction",null,null,null,null,null,null,"Correction"]
[null,null,null,null,null,null,null,null,null,"Total",null,null,null,null,null,null,"Total",null,null,null,null,null,null,"Total"]
[]
["Montage\nDémontage\nsur 2 pts",null,null,null,null,"Items à \névaluer",null,null,null,null,"Niveau < 4",null,null,null,null,null,null,null,"Niveau 4"]
[null,null,null,null,null,null,null,null,null,null,0,null,null,null,null,null,0.5,null,1,null,null,null,null,null,null,2]
[null,null,null,null,null,"Mouvements",null,null,null,null,"Hésitants",null,null,null,null,null,null,null,"Fluides",null,null,null,null,null,null,"Conduits, contrôlés et rythmés"]
[null,null,null,null,null,"Receptions",null,null,null,null,"Lourdes au sol",null,null,null,null,null,null,null,"Légères",null,null,null,null,null,null,"Le porteur devient pareur"]
[null,null,null,null,null,null,null,null,null,null,null,null,null,null,null,null,null,null,"Notes executions + montage démontage :",null,null,null,null,null,null,null,null,null,null,null,null,null,"/8"]
[]
["Rôles de juges\nsur 3 pts",null,null,null,null,"Niveau < 4",null,null,null,null,null,null,null,null,null,"Niveau 4"]
[null,null,null,null,null,0,null,null,null,null,null,null,null,1,null,1,null,null,null,null,null,null,null,null,2,null,null,null,null,null,null,null,null,3]
[null,null,null,null,null,"Jugement partiel",null,null,null,null,null,null,null,null,null,"Jugement global",null,null,null,null,null,null,null,null,null,"Jugement explicatif"]
[null,null,null,null,null,"Situe le niveau de composition ou d’exécution du groupe mais a des difficultés à apprécier les 2.  ",null,null,null,null,null,null,null,null,null,"Capable de situer la prestation du groupe dans un niveau. Justifie de manière globale.",null,null,null,null,null,null,null,null,null,"Situe la prestation du groupe dans un niveau et est capable de justifier et expliquer son jugement précisément."]
[null,null,null,null,null,null,null,null,null,null,null,null,null,null,null,null,null,null,null,null,null,null,null,null,null,null,null,"Note juge :",null,null,null,null,"/3"]
[]
[null,null,null,null,null,null,null,null,null,null,null,null,null,null,null,null,null,null,null,null,null,null,"Note du BAC :",null,null,null,null,null,null,null,null,"/20"]

{"sheet":"Projets_Collectifs","index":22,"n_rows":32,"n_cols":29,"rows_kept":32,"cut":false,"hidden":false,"merged":[[0,21,0,23],[0,8,0,20],[0,3,0,7],[0,0,0,2],[14,24,14,27],[14,28,14,31],[30,0,30,3],[30,4,30,7],[30,8,30,11],[30,12,30,15],[30,16,30,19],[30,20,30,23],[30,24,30,27],[30,28,30,31],[17,4,17,7],[17,8,17,11],[17,12,17,15],[17,16,17,19],[17,20,17,23],[18,0,18,3],[18,4,18,7],[18,8,18,11],[18,12,18,15],[18,16,18,19],[13,24,13,27],[13,28,13,31],[29,0,29,3],[29,4,29,7],[29,8,29,11],[29,12,29,15],[29,16,29,19],[29,20,29,23],[29,24,29,27],[29,28,29,31],[14,0,14,3],[14,4,14,7],[14,8,14,11],[14,12,14,15],[14,16,14,19],[13,0,13,3],[13,4,13,7],[13,8,13,11],[13,12,13,15],[13,16,13,19],[15,20,15,23],[15,24,15,27],[15,28,15,31],[14,20,14,23],[31,0,31,3],[31,4,31,7],[31,8,31,11],[31,12,31,15],[31,16,31,19],[31,20,31,23],[31,24,31,27],[31,28,31,31],[15,0,15,3],[15,4,15,7],[15,8,15,11],[15,12,15,15],[15,16,15,19],[18,28,18,31],[19,28,19,31],[20,28,23,31],[17,24,17,27],[20,0,23,3],[19,0,19,3],[19,20,19,23],[24,0,28,3],[18,20,18,23],[18,24,18,27],[17,0,17,3],[2,28,2,31],[3,28,3,31],[4,28,7,31],[8,28,12,31],[17,28,17,31],[24,4,28,7],[24,8,28,11],[24,12,28,15],[24,16,28,19],[24,28,28,31],[24,24,28,27],[24,20,28,23],[19,24,19,27],[20,4,23,7],[20,8,23,11],[20,12,23,15],[20,16,23,19],[20,20,23,23],[20,24,23,27],[19,4,19,7],[19,8,19,11],[19,12,19,15],[19,16,19,19],[13,20,13,23],[8,8,12,11],[8,12,12,15],[8,16,12,19],[8,20,12,23],[3,12,3,15],[3,16,3,19],[3,20,3,23],[3,24,3,27],[4,4,7,7],[4,8,7,11],[4,12,7,15],[4,16,7,19],[4,20,7,23],[4,24,7,27],[8,24,12,27],[0,24,0,25],[0,28,0,31],[1,4,1,7],[1,8,1,11],[1,12,1,15],[1,16,1,19],[1,28,1,31],[8,0,12,3],[2,4,2,7],[2,8,2,11],[0,26,0,27],[1,0,1,3],[1,20,1,23],[1,24,1,27],[2,0,2,3],[3,0,3,3],[4,0,7,3],[2,12,2,15],[2,16,2,19],[2,20,2,23],[2,24,2,27],[3,4,3,7],[3,8,3,11],[8,4,12,7]]}
["Lycée",null,null,{"$f":"CELL(\"contenu\",'Mode emploi'!O1:P1)","v":"Colbert"},null,null,null,null,"-- Acrosport fiche projet collectif --    CCF BAC Session",null,null,null,null,null,null,null,null,null,null,null,null,{"$f":"'Mode emploi'!O2","v":2019},null,null,"Classe : ",null,{"$f":"VLOOKUP(AC1,Nom_Classes,2)","v":"TL / TS"},null,"Groupe 1"]
["Figure/élément 1",null,null,null,"Figure/élément 2",null,null,null,"Figure/élément 3",null,null,null,"Figure/élément 4",null,null,null,"Figure/élément 5",null,null,null,"Figure/élément 6",null,null,null,"Figure/élément 7",null,null,null,"Figure/élément 8"]
[{"$f":"IF($AC$1=\"\",\"\",VLOOKUP($AC$1,Tableau_Collectif,2,0))","v":"D_St_EQ_+"},null,null,null,{"$f":"IF($AC$1=\"\",\"\",VLOOKUP($AC$1,Tableau_Collectif,4,0))","v":"D_St_ATR_C4"},null,null,null,{"$f":"IF($AC$1=\"\",\"\",VLOOKUP($AC$1,Tableau_Collectif,6,0))","v":"D_St_EQ_B4"},null,null,null,{"$f":"IF($AC$1=\"\",\"\",VLOOKUP($AC$1,Tableau_Collectif,8,0))","v":"El_Ag_B3"},null,null,null,{"$f":"IF($AC$1=\"\",\"\",VLOOKUP($AC$1,Tableau_Collectif,10,0))","v":"T_St_EQ_B6"},null,null,null,{"$f":"IF($AC$1=\"\",\"\",VLOOKUP($AC$1,Tableau_Collectif,12,0))","v":"T_St_EQ_B6"},null,null,null,{"$f":"IF($AC$1=\"\",\"\",VLOOKUP($AC$1,Tableau_Collectif,14,0))","v":"El_M_A2"},null,null,null,{"$f":"IF($AC$1=\"\",\"\",VLOOKUP($AC$1,Tableau_Collectif,16,0))","v":"El_M_A2"}]
[{"$f":"IF($AC$1=\"\",\"\",VLOOKUP($AC$1,Tableau_Collectif,3,0))","v":"Dynamique"},null,null,null,{"$f":"IF($AC$1=\"\",\"\",VLOOKUP($AC$1,Tableau_Collectif,5,0))","v":"Elément Indiv"},null,null,null,{"$f":"IF($AC$1=\"\",\"\",VLOOKUP($AC$1,Tableau_Collectif,7,0))","v":"Elément Indiv"},null,null,null,{"$f":"IF($AC$1=\"\",\"\",VLOOKUP($AC$1,Tableau_Collectif,9,0))","v":"Elément Indiv"},null,null,null,{"$f":"IF($AC$1=\"\",\"\",VLOOKUP($AC$1,Tableau_Collectif,11,0))","v":"Dynamique"},null,null,null,{"$f":"IF($AC$1=\"\",\"\",VLOOKUP($AC$1,Tableau_Collectif,13,0))","v":"Elément Indiv"},null,null,null,{"$f":"IF($AC$1=\"\",\"\",VLOOKUP($AC$1,Tableau_Collectif,15,0))","v":"Elément Indiv"},null,null,null,{"$f":"IF($AC$1=\"\",\"\",VLOOKUP($AC$1,Tableau_Collectif,17,0))","v":"Elément Indiv"}]
[]
[]
[]
[]
[]
[]
[]
[]
[]
[{"$f":"IF(A4=\"Statique\",\"Tenue - 0,5\",IF(A4=\"Dynamique\",\"Amplitude -0,5\",IF(OR(A4=\"Elément Indiv\",A4=\"Elément Synchro\"),\"Technique -0,5\",\"\")))","v":"Amplitude -0,5"},null,null,null,{"$f":"IF(E4=\"Statique\",\"Tenue - 0,5\",IF(E4=\"Dynamique\",\"Amplitude -0,5\",IF(OR(E4=\"Elément Indiv\",E4=\"Elément Synchro\"),\"Technique -0,5\",\"\")))","v":"Technique -0,5"},null,null,null,{"$f":"IF(I4=\"Statique\",\"Tenue - 0,5\",IF(I4=\"Dynamique\",\"Amplitude -0,5\",IF(OR(I4=\"Elément Indiv\",I4=\"Elément Synchro\"),\"Technique -0,5\",\"\")))","v":"Technique -0,5"},null,null,null,{"$f":"IF(M4=\"Statique\",\"Tenue - 0,5\",IF(M4=\"Dynamique\",\"Amplitude -0,5\",IF(OR(M4=\"Elément Indiv\",M4=\"Elément Synchro\"),\"Technique -0,5\",\"\")))","v":"Technique -0,5"},null,null,null,{"$f":"IF(Q4=\"Statique\",\"Tenue - 0,5\",IF(Q4=\"Dynamique\",\"Amplitude -0,5\",IF(OR(Q4=\"Elément Indiv\",Q4=\"Elément Synchro\"),\"Technique -0,5\",\"\")))","v":"Amplitude -0,5"},null,null,null,{"$f":"IF(U4=\"Statique\",\"Tenue - 0,5\",IF(U4=\"Dynamique\",\"Amplitude -0,5\",IF(OR(U4=\"Elément Indiv\",U4=\"Elément Synchro\"),\"Technique -0,5\",\"\")))","v":"Technique -0,5"},null,null,null,{"$f":"IF(Y4=\"Statique\",\"Tenue - 0,5\",IF(Y4=\"Dynamique\",\"Amplitude -0,5\",IF(OR(Y4=\"Elément Indiv\",Y4=\"Elément Synchro\"),\"Technique -0,5\",\"\")))","v":"Technique -0,5"},null,null,null,{"$f":"IF(AC4=\"Statique\",\"Tenue - 0,5\",IF(AC4=\"Dynamique\",\"Amplitude -0,5\",IF(OR(AC4=\"Elément Indiv\",AC4=\"Elément Synchro\"),\"Technique -0,5\",\"\")))","v":"Technique -0,5"}]
[{"$f":"IF(A4=\"Statique\",\"Allign/Trembl - 0,3\",IF(A4=\"Dynamique\",\"Reception -0,3\",IF(OR(A4=\"Elément Indiv\",A4=\"Elément Synchro\"),\"Decal part -0,3\",\"\")))","v":"Reception -0,3"},null,null,null,{"$f":"IF(E4=\"Statique\",\"Allign/Trembl - 0,3\",IF(E4=\"Dynamique\",\"Reception -0,3\",IF(OR(E4=\"Elément Indiv\",E4=\"Elément Synchro\"),\"Decal part -0,3\",\"\")))","v":"Decal part -0,3"},null,null,null,{"$f":"IF(I4=\"Statique\",\"Allign/Trembl - 0,3\",IF(I4=\"Dynamique\",\"Reception -0,3\",IF(OR(I4=\"Elément Indiv\",I4=\"Elément Synchro\"),\"Decal part -0,3\",\"\")))","v":"Decal part -0,3"},null,null,null,{"$f":"IF(M4=\"Statique\",\"Allign/Trembl - 0,3\",IF(M4=\"Dynamique\",\"Reception -0,3\",IF(OR(M4=\"Elément Indiv\",M4=\"Elément Synchro\"),\"Decal part -0,3\",\"\")))","v":"Decal part -0,3"},null,null,null,{"$f":"IF(Q4=\"Statique\",\"Allign/Trembl - 0,3\",IF(Q4=\"Dynamique\",\"Reception -0,3\",IF(OR(Q4=\"Elément Indiv\",Q4=\"Elément Synchro\"),\"Decal part -0,3\",\"\")))","v":"Reception -0,3"},null,null,null,{"$f":"IF(U4=\"Statique\",\"Allign/Trembl - 0,3\",IF(U4=\"Dynamique\",\"Reception -0,3\",IF(OR(U4=\"Elément Indiv\",U4=\"Elément Synchro\"),\"Decal part -0,3\",\"\")))","v":"Decal part -0,3"},null,null,null,{"$f":"IF(Y4=\"Statique\",\"Allign/Trembl - 0,3\",IF(Y4=\"Dynamique\",\"Reception -0,3\",IF(OR(Y4=\"Elément Indiv\",Y4=\"Elément Synchro\"),\"Decal part -0,3\",\"\")))","v":"Decal part -0,3"},null,null,null,{"$f":"IF(AC4=\"Statique\",\"Allign/Trembl - 0,3\",IF(AC4=\"Dynamique\",\"Reception -0,3\",IF(OR(AC4=\"Elément Indiv\",AC4=\"Elément Synchro\"),\"Decal part -0,3\",\"\")))","v":"Decal part -0,3"}]
[{"$f":"IF(A4=\"\",\"\",\"Correction -0,2\")","v":"Correction -0,2"},null,null,null,{"$f":"IF(E4=\"\",\"\",\"Correction -0,2\")","v":"Correction -0,2"},null,null,null,{"$f":"IF(I4=\"\",\"\",\"Correction -0,2\")","v":"Correction -0,2"},null,null,null,{"$f":"IF(M4=\"\",\"\",\"Correction -0,2\")","v":"Correction -0,2"},null,null,null,{"$f":"IF(Q4=\"\",\"\",\"Correction -0,2\")","v":"Correction -0,2"},null,null,null,{"$f":"IF(U4=\"\",\"\",\"Correction -0,2\")","v":"Correction -0,2"},null,null,null,{"$f":"IF(Y4=\"\",\"\",\"Correction -0,2\")","v":"Correction -0,2"},null,null,null,{"$f":"IF(AC4=\"\",\"\",\"Correction -0,2\")","v":"Correction -0,2"}]
[]
["Figure/élément 9",null,null,null,"Figure/élément 10",null,null,null,"Figure/élément 11",null,null,null,"Figure/élément 12",null,null,null,"Figure/élément 13",null,null,null,"Figure/élément 14",null,null,null,"Figure/élément 15",null,null,null,"Figure/élément 16"]
[{"$f":"IF($AC$1=\"\",\"\",VLOOKUP($AC$1,Tableau_Collectif,18,0))","v":""},null,null,null,{"$f":"IF($AC$1=\"\",\"\",VLOOKUP($AC$1,Tableau_Collectif,20,0))","v":"D_Dy_B2"},null,null,null,{"$f":"IF($AC$1=\"\",\"\",VLOOKUP($AC$1,Tableau_Collectif,22,0))","v":"T_Dy_D6"},null,null,null,{"$f":"IF($AC$1=\"\",\"\",VLOOKUP($AC$1,Tableau_Collectif,24,0))","v":"D_St_ATR_C4"},null,null,null,{"$f":"IF($AC$1=\"\",\"\",VLOOKUP($AC$1,Tableau_Collectif,26,0))","v":"El_M_A2"},null,null,null,{"$f":"IF($AC$1=\"\",\"\",VLOOKUP($AC$1,Tableau_Collectif,28,0))","v":""},null,null,null,{"$f":"IF($AC$1=\"\",\"\",VLOOKUP($AC$1,Tableau_Collectif,30,0))","v":""},null,null,null,{"$f":"IF($AC$1=\"\",\"\",VLOOKUP($AC$1,Tableau_Collectif,32,0))","v":""}]
[{"$f":"IF($AC$1=\"\",\"\",VLOOKUP($AC$1,Tableau_Collectif,19,0))","v":""},null,null,null,{"$f":"IF($AC$1=\"\",\"\",VLOOKUP($AC$1,Tableau_Collectif,21,0))","v":"Dynamique"},null,null,null,{"$f":"IF($AC$1=\"\",\"\",VLOOKUP($AC$1,Tableau_Collectif,23,0))","v":"Statique"},null,null,null,{"$f":"IF($AC$1=\"\",\"\",VLOOKUP($AC$1,Tableau_Collectif,25,0))","v":"Statique"},null,null,null,{"$f":"IF($AC$1=\"\",\"\",VLOOKUP($AC$1,Tableau_Collectif,27,0))","v":"Elément Synchro"},null,null,null,{"$f":"IF($AC$1=\"\",\"\",VLOOKUP($AC$1,Tableau_Collectif,29,0))","v":""},null,null,null,{"$f":"IF($AC$1=\"\",\"\",VLOOKUP($AC$1,Tableau_Collectif,31,0))","v":""},null,null,null,{"$f":"IF($AC$1=\"\",\"\",VLOOKUP($AC$1,Tableau_Collectif,33,0))","v":""}]
[]
[]
[]
[]
[]
[]
[]
[]
[]
[{"$f":"IF(A20=\"Statique\",\"Tenue - 0,5\",IF(A20=\"Dynamique\",\"Amplitude -0,5\",IF(OR(A20=\"Elément Indiv\",A20=\"Elément Synchro\"),\"Technique -0,5\",\"\")))","v":""},null,null,null,{"$f":"IF(E20=\"Statique\",\"Tenue - 0,5\",IF(E20=\"Dynamique\",\"Amplitude -0,5\",IF(OR(E20=\"Elément Indiv\",E20=\"Elément Synchro\"),\"Technique -0,5\",\"\")))","v":"Amplitude -0,5"},null,null,null,{"$f":"IF(I20=\"Statique\",\"Tenue - 0,5\",IF(I20=\"Dynamique\",\"Amplitude -0,5\",IF(OR(I20=\"Elément Indiv\",I20=\"Elément Synchro\"),\"Technique -0,5\",\"\")))","v":"Tenue - 0,5"},null,null,null,{"$f":"IF(M20=\"Statique\",\"Tenue - 0,5\",IF(M20=\"Dynamique\",\"Amplitude -0,5\",IF(OR(M20=\"Elément Indiv\",M20=\"Elément Synchro\"),\"Technique -0,5\",\"\")))","v":"Tenue - 0,5"},null,null,null,{"$f":"IF(Q20=\"Statique\",\"Tenue - 0,5\",IF(Q20=\"Dynamique\",\"Amplitude -0,5\",IF(OR(Q20=\"Elément Indiv\",Q20=\"Elément Synchro\"),\"Technique -0,5\",\"\")))","v":"Technique -0,5"},null,null,null,{"$f":"IF(U20=\"Statique\",\"Tenue - 0,5\",IF(U20=\"Dynamique\",\"Amplitude -0,5\",IF(OR(U20=\"Elément Indiv\",U20=\"Elément Synchro\"),\"Technique -0,5\",\"\")))","v":""},null,null,null,{"$f":"IF(Y20=\"Statique\",\"Tenue - 0,5\",IF(Y20=\"Dynamique\",\"Amplitude -0,5\",IF(OR(Y20=\"Elément Indiv\",Y20=\"Elément Synchro\"),\"Technique -0,5\",\"\")))","v":""},null,null,null,{"$f":"IF(AC20=\"Statique\",\"Tenue - 0,5\",IF(AC20=\"Dynamique\",\"Amplitude -0,5\",IF(OR(AC20=\"Elément Indiv\",AC20=\"Elément Synchro\"),\"Technique -0,5\",\"\")))","v":""}]
[{"$f":"IF(A20=\"Statique\",\"Allign/Trembl - 0,3\",IF(A20=\"Dynamique\",\"Reception -0,3\",IF(OR(A20=\"Elément Indiv\",A20=\"Elément Synchro\"),\"Decal part -0,3\",\"\")))","v":""},null,null,null,{"$f":"IF(E20=\"Statique\",\"Allign/Trembl - 0,3\",IF(E20=\"Dynamique\",\"Reception -0,3\",IF(OR(E20=\"Elément Indiv\",E20=\"Elément Synchro\"),\"Decal part -0,3\",\"\")))","v":"Reception -0,3"},null,null,null,{"$f":"IF(I20=\"Statique\",\"Allign/Trembl - 0,3\",IF(I20=\"Dynamique\",\"Reception -0,3\",IF(OR(I20=\"Elément Indiv\",I20=\"Elément Synchro\"),\"Decal part -0,3\",\"\")))","v":"Allign/Trembl - 0,3"},null,null,null,{"$f":"IF(M20=\"Statique\",\"Allign/Trembl - 0,3\",IF(M20=\"Dynamique\",\"Reception -0,3\",IF(OR(M20=\"Elément Indiv\",M20=\"Elément Synchro\"),\"Decal part -0,3\",\"\")))","v":"Allign/Trembl - 0,3"},null,null,null,{"$f":"IF(Q20=\"Statique\",\"Allign/Trembl - 0,3\",IF(Q20=\"Dynamique\",\"Reception -0,3\",IF(OR(Q20=\"Elément Indiv\",Q20=\"Elément Synchro\"),\"Decal part -0,3\",\"\")))","v":"Decal part -0,3"},null,null,null,{"$f":"IF(U20=\"Statique\",\"Allign/Trembl - 0,3\",IF(U20=\"Dynamique\",\"Reception -0,3\",IF(OR(U20=\"Elément Indiv\",U20=\"Elément Synchro\"),\"Decal part -0,3\",\"\")))","v":""},null,null,null,{"$f":"IF(Y20=\"Statique\",\"Allign/Trembl - 0,3\",IF(Y20=\"Dynamique\",\"Reception -0,3\",IF(OR(Y20=\"Elément Indiv\",Y20=\"Elément Synchro\"),\"Decal part -0,3\",\"\")))","v":""},null,null,null,{"$f":"IF(AC20=\"Statique\",\"Allign/Trembl - 0,3\",IF(AC20=\"Dynamique\",\"Reception -0,3\",IF(OR(AC20=\"Elément Indiv\",AC20=\"Elément Synchro\"),\"Decal part -0,3\",\"\")))","v":""}]
[{"$f":"IF(A20=\"\",\"\",\"Correction -0,2\")","v":""},null,null,null,{"$f":"IF(E20=\"\",\"\",\"Correction -0,2\")","v":"Correction -0,2"},null,null,null,{"$f":"IF(I20=\"\",\"\",\"Correction -0,2\")","v":"Correction -0,2"},null,null,null,{"$f":"IF(M20=\"\",\"\",\"Correction -0,2\")","v":"Correction -0,2"},null,null,null,{"$f":"IF(Q20=\"\",\"\",\"Correction -0,2\")","v":"Correction -0,2"},null,null,null,{"$f":"IF(U20=\"\",\"\",\"Correction -0,2\")","v":""},null,null,null,{"$f":"IF(Y20=\"\",\"\",\"Correction -0,2\")","v":""},null,null,null,{"$f":"IF(AC20=\"\",\"\",\"Correction -0,2\")","v":""}]

{"sheet":"Fiches_Juges","index":23,"n_rows":29,"n_cols":23,"rows_kept":29,"cut":false,"hidden":false,"merged":[[0,8,0,18],[0,19,0,23],[0,0,0,3],[11,12,11,15],[11,16,11,19],[5,20,10,23],[11,0,11,3],[5,8,10,11],[5,12,10,15],[5,16,10,19],[11,20,11,23],[11,8,11,11],[4,1,4,3],[4,5,4,7],[4,9,4,11],[4,21,4,23],[12,4,12,7],[13,4,13,7],[12,16,12,19],[12,20,12,23],[13,8,13,11],[13,12,13,15],[13,16,13,19],[13,20,13,23],[12,8,12,11],[12,12,12,15],[4,17,4,19],[4,13,4,15],[1,10,1,11],[1,6,1,9],[3,21,3,23],[1,22,1,23],[1,18,1,21],[1,12,1,17],[3,1,3,3],[3,5,3,7],[3,9,3,11],[3,13,3,15],[3,17,3,19],[0,4,0,7],[16,0,17,3],[18,0,19,3],[22,0,25,3],[28,0,31,3],[15,0,15,3],[21,0,21,3],[27,0,27,3],[15,4,15,6],[15,7,15,9],[1,0,1,5],[12,0,12,3],[13,0,13,3],[11,4,11,7],[5,0,10,3],[5,4,10,7],[15,10,15,12],[15,13,19,23],[21,13,25,23],[16,4,17,6],[16,7,17,9],[16,10,17,12],[18,4,19,6],[18,7,19,9],[18,10,19,12],[27,13,31,23],[21,4,21,6],[21,7,21,9],[21,10,21,12],[27,4,27,6],[27,7,27,9],[27,10,27,12],[22,4,25,6],[22,7,25,9],[22,10,25,12],[28,4,31,6],[28,7,31,9],[28,10,31,12]]}
["Lycée",null,null,null,{"$f":"CELL(\"contenu\",'Mode emploi'!O1:P1)","v":"Colbert"},null,null,null,"      -- Acrosport fiche individuelle --                 CCF BAC Session",null,null,null,null,null,null,null,null,null,null,{"$f":"'Mode emploi'!O2","v":2019}]
["Nom - prénom candidat juge :",null,null,null,null,null,null,null,null,null,"Groupe",null,"Nom prénom candidat observé :",null,null,null,null,null,"Coubertin Pierre",null,null,null,{"$f":"IF(S2=\"\",\"\",VLOOKUP(S2,Tableau_Eleves,2,0))","v":"Groupe 2"}]
[]
[1,{"$f":"IF(S2=\"\",\"\",VLOOKUP(S2,Tableau_Eleves,4,0))","v":"D_Dy_B1"},null,null,2,{"$f":"IF(S2=\"\",\"\",VLOOKUP(S2,Tableau_Eleves,7,0))","v":"T_St_PV_B3"},null,null,3,{"$f":"IF(S2=\"\",\"\",VLOOKUP(S2,Tableau_Eleves,10,0))","v":"El_Sou_B2"},null,null,4,{"$f":"IF(S2=\"\",\"\",VLOOKUP(S2,Tableau_Eleves,13,0))","v":"D_Dy_B3"},null,null,5,{"$f":"IF(S2=\"\",\"\",VLOOKUP(S2,Tableau_Eleves,16,0))","v":"T_St_EQ_B2"},null,null,6,{"$f":"IF(S2=\"\",\"\",VLOOKUP(S2,Tableau_Eleves,19,0))","v":"El_Ag_C2"}]
[{"$f":"IF(B4=\"\",\"\",VLOOKUP(S2,Tableau_Eleves,5,0))","v":"P"},{"$f":"IF(B4=\"\",\"\",IF(ISNUMBER(SEARCH(\"St\",B4)),\"Statique\",IF(ISNUMBER(SEARCH(\"Dy\",B4)),\"Dynamique\",IF(A5=\"El Ind\",\"Elément Indiv\",IF(A5=\"El Syn\",\"Elément Synchro\")))))","v":"Dynamique"},null,null,{"$f":"IF(F4=\"\",\"\",VLOOKUP(S2,Tableau_Eleves,8,0))","v":"V"},{"$f":"IF(F4=\"\",\"\",IF(ISNUMBER(SEARCH(\"St\",F4)),\"Statique\",IF(ISNUMBER(SEARCH(\"Dy\",F4)),\"Dynamique\",IF(E5=\"El Ind\",\"Elément Indiv\",IF(E5=\"El Syn\",\"Elément Synchro\")))))","v":"Statique"},null,null,{"$f":"IF(J4=\"\",\"\",VLOOKUP(S2,Tableau_Eleves,11,0))","v":"El Ind"},{"$f":"IF(J4=\"\",\"\",IF(ISNUMBER(SEARCH(\"St\",J4)),\"Statique\",IF(ISNUMBER(SEARCH(\"Dy\",J4)),\"Dynamique\",IF(I5=\"El Ind\",\"Elément Indiv\",IF(I5=\"El Syn\",\"Elément Synchro\")))))","v":"Elément Indiv"},null,null,{"$f":"IF(N4=\"\",\"\",VLOOKUP(S2,Tableau_Eleves,14,0))","v":"V"},{"$f":"IF(N4=\"\",\"\",IF(ISNUMBER(SEARCH(\"St\",N4)),\"Statique\",IF(ISNUMBER(SEARCH(\"Dy\",N4)),\"Dynamique\",IF(M5=\"El Ind\",\"Elément Indiv\",IF(M5=\"El Syn\",\"Elément Synchro\")))))","v":"Dynamique"},null,null,{"$f":"IF(R4=\"\",\"\",VLOOKUP(S2,Tableau_Eleves,17,0))","v":"V"},{"$f":"IF(R4=\"\",\"\",IF(ISNUMBER(SEARCH(\"St\",R4)),\"Statique\",IF(ISNUMBER(SEARCH(\"Dy\",R4)),\"Dynamique\",IF(Q5=\"El Ind\",\"Elément Indiv\",IF(Q5=\"El Syn\",\"Elément Synchro\")))))","v":"Statique"},null,null,{"$f":"IF(V4=\"\",\"\",VLOOKUP(S2,Tableau_Eleves,20,0))","v":"El Ind"},{"$f":"IF(V4=\"\",\"\",IF(ISNUMBER(SEARCH(\"St\",V4)),\"Statique\",IF(ISNUMBER(SEARCH(\"Dy\",V4)),\"Dynamique\",IF(U5=\"El Ind\",\"Elément Indiv\",IF(U5=\"El Syn\",\"Elément Synchro\")))))","v":"Elément Indiv"}]
[]
[]
[]
[]
[]
[]
[{"$f":"IF(B5=\"Statique\",\"Tenue - 0,5\",IF(B5=\"Dynamique\",\"Amplitude -0,5\",IF(OR(B5=\"Elément Indiv\",B5=\"Elément Synchro\"),\"Technique -0,5\",\"\")))","v":"Amplitude -0,5"},null,null,null,{"$f":"IF(F5=\"Statique\",\"Tenue - 0,5\",IF(F5=\"Dynamique\",\"Amplitude -0,5\",IF(OR(F5=\"Elément Indiv\",F5=\"Elément Synchro\"),\"Technique -0,5\",\"\")))","v":"Tenue - 0,5"},null,null,null,{"$f":"IF(J5=\"Statique\",\"Tenue - 0,5\",IF(J5=\"Dynamique\",\"Amplitude -0,5\",IF(OR(J5=\"Elément Indiv\",J5=\"Elément Synchro\"),\"Technique -0,5\",\"\")))","v":"Technique -0,5"},null,null,null,{"$f":"IF(N5=\"Statique\",\"Tenue - 0,5\",IF(N5=\"Dynamique\",\"Amplitude -0,5\",IF(OR(N5=\"Elément Indiv\",N5=\"Elément Synchro\"),\"Technique -0,5\",\"\")))","v":"Amplitude -0,5"},null,null,null,{"$f":"IF(R5=\"Statique\",\"Tenue - 0,5\",IF(R5=\"Dynamique\",\"Amplitude -0,5\",IF(OR(R5=\"Elément Indiv\",R5=\"Elément Synchro\"),\"Technique -0,5\",\"\")))","v":"Tenue - 0,5"},null,null,null,{"$f":"IF(V5=\"Statique\",\"Tenue - 0,5\",IF(V5=\"Dynamique\",\"Amplitude -0,5\",IF(OR(V5=\"Elément Indiv\",V5=\"Elément Synchro\"),\"Technique -0,5\",\"\")))","v":"Technique -0,5"}]
[{"$f":"IF(B5=\"Statique\",\"Allign/Trembl - 0,3\",IF(B5=\"Dynamique\",\"Reception -0,3\",IF(OR(B5=\"Elément Indiv\",B5=\"Elément Synchro\"),\"Decal part -0,3\",\"\")))","v":"Reception -0,3"},null,null,null,{"$f":"IF(F5=\"Statique\",\"Allign/Trembl - 0,3\",IF(F5=\"Dynamique\",\"Reception -0,3\",IF(OR(F5=\"Elément Indiv\",F5=\"Elément Synchro\"),\"Decal part -0,3\",\"\")))","v":"Allign/Trembl - 0,3"},null,null,null,{"$f":"IF(J5=\"Statique\",\"Allign/Trembl - 0,3\",IF(J5=\"Dynamique\",\"Reception -0,3\",IF(OR(J5=\"Elément Indiv\",J5=\"Elément Synchro\"),\"Decal part -0,3\",\"\")))","v":"Decal part -0,3"},null,null,null,{"$f":"IF(N5=\"Statique\",\"Allign/Trembl - 0,3\",IF(N5=\"Dynamique\",\"Reception -0,3\",IF(OR(N5=\"Elément Indiv\",N5=\"Elément Synchro\"),\"Decal part -0,3\",\"\")))","v":"Reception -0,3"},null,null,null,{"$f":"IF(R5=\"Statique\",\"Allign/Trembl - 0,3\",IF(R5=\"Dynamique\",\"Reception -0,3\",IF(OR(R5=\"Elément Indiv\",R5=\"Elément Synchro\"),\"Decal part -0,3\",\"\")))","v":"Allign/Trembl - 0,3"},null,null,null,{"$f":"IF(V5=\"Statique\",\"Allign/Trembl - 0,3\",IF(V5=\"Dynamique\",\"Reception -0,3\",IF(OR(V5=\"Elément Indiv\",V5=\"Elément Synchro\"),\"Decal part -0,3\",\"\")))","v":"Decal part -0,3"}]
[{"$f":"IF(A4=\"\",\"\",\"Correction -0,2\")","v":"Correction -0,2"},null,null,null,{"$f":"IF(E4=\"\",\"\",\"Correction -0,2\")","v":"Correction -0,2"},null,null,null,{"$f":"IF(I4=\"\",\"\",\"Correction -0,2\")","v":"Correction -0,2"},null,null,null,{"$f":"IF(M4=\"\",\"\",\"Correction -0,2\")","v":"Correction -0,2"},null,null,null,{"$f":"IF(Q4=\"\",\"\",\"Correction -0,2\")","v":"Correction -0,2"},null,null,null,{"$f":"IF(U4=\"\",\"\",\"Correction -0,2\")","v":"Correction -0,2"}]
[]
["Niveau de prestation",null,null,null,"Niveau 1",null,null,"Niveau 2",null,null,"Niveau 3",null,null,"Justifications :"]
["Orientation",null,null,null,"Dos au jury",null,null,"Figure ou élément caché du jury",null,null,"Toujours visible par rapport jury"]
[]
["Occupation de l'espace",null,null,null,"50% utilisé",null,null,"100% utilisé",null,null,"100% et équilibré"]
[]
[]
["Niveau de prestation",null,null,null,"Niveau 1",null,null,"Niveau 2",null,null,"Niveau 3",null,null,"Justifications :"]
["Fluidité et rythme",null,null,null,"Hésitation \net arrêt",null,null,"Fluide \nmais lent",null,null,"Rythmé et coordonné"]
[]
[]
[]
[]
["Niveau de prestation",null,null,null,"Niveau 1",null,null,"Niveau 2",null,null,"Niveau 3",null,null,"Justifications :"]
["Support sonore",null,null,null,"Simple fond musical, aucun lien à l'enchainement",null,null,"Musique en liens à l'enchainement mais décalage de rythme",null,null,"Musique acompagne pleinement l'enchainement"]

{"sheet":"Referentiel","index":24,"n_rows":0,"n_cols":0,"rows_kept":0,"cut":false,"hidden":false,"merged":[]}

{"sheet":"Tableau_Images","index":25,"n_rows":231,"n_cols":4,"rows_kept":231,"cut":false,"hidden":true,"merged":[]}
["Référence UNSS","Difficulté","Images","Référence cellules images"]
[{"$f":"\"\"","v":""},null,null,{"$f":"\"Tableau_Images!\"&CELL(\"adresse\",C2)","v":"Tableau_Images!$C$2"}]
[{"$f":"Tableau_Pyr!$B$2&\"\"&Tableau_Pyr!B4","v":"D_St_PV_A1"},"A",null,{"$f":"\"Tableau_Images!\"&CELL(\"adresse\",C3)","v":"Tableau_Images!$C$3"}]
[{"$f":"Tableau_Pyr!$B$2&\"\"&Tableau_Pyr!B5","v":"D_St_PV_A2"},"A",null,{"$f":"\"Tableau_Images!\"&CELL(\"adresse\",C4)","v":"Tableau_Images!$C$4"}]
[{"$f":"Tableau_Pyr!$B$2&\"\"&Tableau_Pyr!B6","v":"D_St_PV_A4"},"A",null,{"$f":"\"Tableau_Images!\"&CELL(\"adresse\",C5)","v":"Tableau_Images!$C$5"}]
[{"$f":"Tableau_Pyr!$B$2&\"\"&Tableau_Pyr!B7","v":"D_St_PV_A5"},"A",null,"Tableau_Images!$C$6"]
[{"$f":"Tableau_Pyr!$B$2&\"\"&Tableau_Pyr!B8","v":"D_St_PV_B1"},"B",null,"Tableau_Images!$C$7"]
[{"$f":"Tableau_Pyr!$B$2&\"\"&Tableau_Pyr!B9","v":"D_St_PV_B2"},"B",null,"Tableau_Images!$C$8"]
[{"$f":"Tableau_Pyr!$B$2&\"\"&Tableau_Pyr!B10","v":"D_St_PV_B3"},"B",null,"Tableau_Images!$C$9"]
[{"$f":"Tableau_Pyr!$B$2&\"\"&Tableau_Pyr!B11","v":"D_St_PV_B4"},"B",null,"Tableau_Images!$C$10"]
[{"$f":"Tableau_Pyr!$B$2&\"\"&Tableau_Pyr!B12","v":"D_St_PV_B5"},"B",null,"Tableau_Images!$C$11"]
[{"$f":"Tableau_Pyr!$B$2&\"\"&Tableau_Pyr!B13","v":"D_St_PV_C1"},"C",null,"Tableau_Images!$C$12"]
[{"$f":"Tableau_Pyr!$B$2&\"\"&Tableau_Pyr!B14","v":"D_St_PV_C3"},"C",null,"Tableau_Images!$C$13"]
[{"$f":"Tableau_Pyr!$B$2&\"\"&Tableau_Pyr!B15","v":"D_St_PV_C4"},"C",null,"Tableau_Images!$C$14"]
[{"$f":"Tableau_Pyr!$B$2&\"\"&Tableau_Pyr!B16","v":"D_St_PV_C5"},"C",null,"Tableau_Images!$C$15"]
[{"$f":"Tableau_Pyr!$B$2&\"\"&Tableau_Pyr!B17","v":"D_St_PV_C6"},"C",null,"Tableau_Images!$C$16"]
[{"$f":"Tableau_Pyr!$B$2&\"\"&Tableau_Pyr!B18","v":"D_St_PV_D1"},"D",null,"Tableau_Images!$C$17"]
[{"$f":"Tableau_Pyr!$B$2&\"\"&Tableau_Pyr!B19","v":"D_St_PV_D2"},"D",null,"Tableau_Images!$C$18"]
[{"$f":"Tableau_Pyr!$B$2&\"\"&Tableau_Pyr!B20","v":"D_St_PV_D3"},"D",null,"Tableau_Images!$C$19"]
[{"$f":"Tableau_Pyr!$B$2&\"\"&Tableau_Pyr!B21","v":"D_St_PV_D4"},"D",null,"Tableau_Images!$C$20"]
[{"$f":"Tableau_Pyr!$B$2&\"\"&Tableau_Pyr!B22","v":"D_St_PV_D5"},"D",null,"Tableau_Images!$C$21"]
[{"$f":"Tableau_Pyr!$B$2&\"\"&Tableau_Pyr!B23","v":"D_St_PV_D6"},"D",null,"Tableau_Images!$C$22"]
[{"$f":"Tableau_Pyr!$B$2&\"\"&Tableau_Pyr!B24","v":"D_St_PV_+"},"?","?","Tableau_Images!$C$23"]
[{"$f":"Tableau_Pyr!$C$2&\"\"&Tableau_Pyr!C4","v":"D_St_EQ_A1"},"A",null,"Tableau_Images!$C$24"]
[{"$f":"Tableau_Pyr!$C$2&\"\"&Tableau_Pyr!C5","v":"D_St_EQ_A4"},"A",null,"Tableau_Images!$C$25"]
[{"$f":"Tableau_Pyr!$C$2&\"\"&Tableau_Pyr!C6","v":"D_St_EQ_B1"},"B",null,"Tableau_Images!$C$26"]
[{"$f":"Tableau_Pyr!$C$2&\"\"&Tableau_Pyr!C7","v":"D_St_EQ_B4"},"B",null,"Tableau_Images!$C$27"]
[{"$f":"Tableau_Pyr!$C$2&\"\"&Tableau_Pyr!C8","v":"D_St_EQ_C1"},"C",null,"Tableau_Images!$C$28"]
[{"$f":"Tableau_Pyr!$C$2&\"\"&Tableau_Pyr!C9","v":"D_St_EQ_C4"},"C",null,"Tableau_Images!$C$29"]
[{"$f":"Tableau_Pyr!$C$2&\"\"&Tableau_Pyr!C10","v":"D_St_EQ_D4"},"D",null,"Tableau_Images!$C$30"]
[{"$f":"Tableau_Pyr!$C$2&\"\"&Tableau_Pyr!C11","v":"D_St_EQ_D5"},"D",null,"Tableau_Images!$C$31"]
[{"$f":"Tableau_Pyr!$C$2&\"\"&Tableau_Pyr!C12","v":"D_St_EQ_+"},"?","?","Tableau_Images!$C$32"]
[{"$f":"Tableau_Pyr!$D$2&\"\"&Tableau_Pyr!D4","v":"D_St_ATR_A2"},"A",null,"Tableau_Images!$C$33"]
[{"$f":"Tableau_Pyr!$D$2&\"\"&Tableau_Pyr!D5","v":"D_St_ATR_A3"},"A",null,"Tableau_Images!$C$34"]
[{"$f":"Tableau_Pyr!$D$2&\"\"&Tableau_Pyr!D6","v":"D_St_ATR_A4"},"A",null,"Tableau_Images!$C$35"]
[{"$f":"Tableau_Pyr!$D$2&\"\"&Tableau_Pyr!D7","v":"D_St_ATR_B2"},"B",null,"Tableau_Images!$C$36"]
[{"$f":"Tableau_Pyr!$D$2&\"\"&Tableau_Pyr!D8","v":"D_St_ATR_B3"},"B",null,"Tableau_Images!$C$37"]
[{"$f":"Tableau_Pyr!$D$2&\"\"&Tableau_Pyr!D9","v":"D_St_ATR_B4"},"B",null,"Tableau_Images!$C$38"]
[{"$f":"Tableau_Pyr!$D$2&\"\"&Tableau_Pyr!D10","v":"D_St_ATR_C1"},"C",null,"Tableau_Images!$C$39"]
[{"$f":"Tableau_Pyr!$D$2&\"\"&Tableau_Pyr!D11","v":"D_St_ATR_C2"},"C",null,"Tableau_Images!$C$40"]
[{"$f":"Tableau_Pyr!$D$2&\"\"&Tableau_Pyr!D12","v":"D_St_ATR_C3"},"C",null,"Tableau_Images!$C$41"]
[{"$f":"Tableau_Pyr!$D$2&\"\"&Tableau_Pyr!D13","v":"D_St_ATR_C4"},"C",null,"Tableau_Images!$C$42"]
[{"$f":"Tableau_Pyr!$D$2&\"\"&Tableau_Pyr!D14","v":"D_St_ATR_D1"},"D",null,"Tableau_Images!$C$43"]
[{"$f":"Tableau_Pyr!$D$2&\"\"&Tableau_Pyr!D15","v":"D_St_ATR_D2"},"D",null,"Tableau_Images!$C$44"]
[{"$f":"Tableau_Pyr!$D$2&\"\"&Tableau_Pyr!D16","v":"D_St_ATR_D4"},"D",null,"Tableau_Images!$C$45"]
[{"$f":"Tableau_Pyr!$D$2&\"\"&Tableau_Pyr!D17","v":"D_St_ATR_D5"},"D",null,"Tableau_Images!$C$46"]
[{"$f":"Tableau_Pyr!$D$2&\"\"&Tableau_Pyr!D18","v":"D_St_ATR_+"},"?","?","Tableau_Images!$C$47"]
[{"$f":"Tableau_Pyr!$E$2&\"\"&Tableau_Pyr!E4","v":"D_Dy_A1"},"A",null,"Tableau_Images!$C$48"]
[{"$f":"Tableau_Pyr!$E$2&\"\"&Tableau_Pyr!E5","v":"D_Dy_A2"},"A",null,"Tableau_Images!$C$49"]
[{"$f":"Tableau_Pyr!$E$2&\"\"&Tableau_Pyr!E6","v":"D_Dy_A4"},"A",null,"Tableau_Images!$C$50"]
[{"$f":"Tableau_Pyr!$E$2&\"\"&Tableau_Pyr!E7","v":"D_Dy_B1"},"B",null,"Tableau_Images!$C$51"]
[{"$f":"Tableau_Pyr!$E$2&\"\"&Tableau_Pyr!E8","v":"D_Dy_B2"},"B",null,"Tableau_Images!$C$52"]
[{"$f":"Tableau_Pyr!$E$2&\"\"&Tableau_Pyr!E9","v":"D_Dy_B3"},"B",null,"Tableau_Images!$C$53"]
[{"$f":"Tableau_Pyr!$E$2&\"\"&Tableau_Pyr!E10","v":"D_Dy_B4"},"B",null,"Tableau_Images!$C$54"]
[{"$f":"Tableau_Pyr!$E$2&\"\"&Tableau_Pyr!E11","v":"D_Dy_B5"},"B",null,"Tableau_Images!$C$55"]
[{"$f":"Tableau_Pyr!$E$2&\"\"&Tableau_Pyr!E12","v":"D_Dy_B6"},"B",null,"Tableau_Images!$C$56"]
[{"$f":"Tableau_Pyr!$E$2&\"\"&Tableau_Pyr!E13","v":"D_Dy_C1"},"C",null,"Tableau_Images!$C$57"]
[{"$f":"Tableau_Pyr!$E$2&\"\"&Tableau_Pyr!E14","v":"D_Dy_C3"},"C",null,"Tableau_Images!$C$58"]
[{"$f":"Tableau_Pyr!$E$2&\"\"&Tableau_Pyr!E15","v":"D_Dy_C4"},"C",null,"Tableau_Images!$C$59"]
[{"$f":"Tableau_Pyr!$E$2&\"\"&Tableau_Pyr!E16","v":"D_Dy_C6"},"C",null,"Tableau_Images!$C$60"]
[{"$f":"Tableau_Pyr!$E$2&\"\"&Tableau_Pyr!E17","v":"D_Dy_D2"},"D",null,"Tableau_Images!$C$61"]
[{"$f":"Tableau_Pyr!$E$2&\"\"&Tableau_Pyr!E18","v":"D_Dy_D3"},"D",null,"Tableau_Images!$C$62"]
[{"$f":"Tableau_Pyr!$E$2&\"\"&Tableau_Pyr!E19","v":"D_Dy_D4"},"D",null,"Tableau_Images!$C$63"]
[{"$f":"Tableau_Pyr!$E$2&\"\"&Tableau_Pyr!E20","v":"D_Dy_D6"},"D",null,"Tableau_Images!$C$64"]
[{"$f":"Tableau_Pyr!$E$2&\"\"&Tableau_Pyr!E21","v":"D_Dy_+"},"?","?","Tableau_Images!$C$65"]
[{"$f":"Tableau_Pyr!$F$2&\"\"&Tableau_Pyr!F4","v":"T_St_PV_A1"},"A",null,"Tableau_Images!$C$66"]
[{"$f":"Tableau_Pyr!$F$2&\"\"&Tableau_Pyr!F5","v":"T_St_PV_A3"},"A",null,"Tableau_Images!$C$67"]
[{"$f":"Tableau_Pyr!$F$2&\"\"&Tableau_Pyr!F6","v":"T_St_PV_A4"},"A",null,"Tableau_Images!$C$68"]
[{"$f":"Tableau_Pyr!$F$2&\"\"&Tableau_Pyr!F7","v":"T_St_PV_A6"},"A",null,{"$f":"\"Tableau_Images!\"&CELL(\"adresse\",C69)","v":"Tableau_Images!$C$69"}]
[{"$f":"Tableau_Pyr!$F$2&\"\"&Tableau_Pyr!F8","v":"T_St_PV_B1"},"B",null,"Tableau_Images!$C$70"]
[{"$f":"Tableau_Pyr!$F$2&\"\"&Tableau_Pyr!F9","v":"T_St_PV_B3"},"B",null,"Tableau_Images!$C$71"]
[{"$f":"Tableau_Pyr!$F$2&\"\"&Tableau_Pyr!F10","v":"T_St_PV_B4"},"B",null,"Tableau_Images!$C$72"]
[{"$f":"Tableau_Pyr!$F$2&\"\"&Tableau_Pyr!F11","v":"T_St_PV_B5"},"B",null,"Tableau_Images!$C$73"]
[{"$f":"Tableau_Pyr!$F$2&\"\"&Tableau_Pyr!F12","v":"T_St_PV_B6"},"B",null,"Tableau_Images!$C$74"]
[{"$f":"Tableau_Pyr!$F$2&\"\"&Tableau_Pyr!F13","v":"T_St_PV_C1"},"C",null,"Tableau_Images!$C$75"]
[{"$f":"Tableau_Pyr!$F$2&\"\"&Tableau_Pyr!F14","v":"T_St_PV_C2"},"C",null,"Tableau_Images!$C$76"]
[{"$f":"Tableau_Pyr!$F$2&\"\"&Tableau_Pyr!F15","v":"T_St_PV_C3"},"C",null,"Tableau_Images!$C$77"]
[{"$f":"Tableau_Pyr!$F$2&\"\"&Tableau_Pyr!F16","v":"T_St_PV_C5"},"C",null,"Tableau_Images!$C$78"]
[{"$f":"Tableau_Pyr!$F$2&\"\"&Tableau_Pyr!F17","v":"T_St_PV_C6"},"C",null,"Tableau_Images!$C$79"]
[{"$f":"Tableau_Pyr!$F$2&\"\"&Tableau_Pyr!F18","v":"T_St_PV_D2"},"D",null,"Tableau_Images!$C$80"]
[{"$f":"Tableau_Pyr!$F$2&\"\"&Tableau_Pyr!F19","v":"T_St_PV_D3"},"D",null,"Tableau_Images!$C$81"]
[{"$f":"Tableau_Pyr!$F$2&\"\"&Tableau_Pyr!F20","v":"T_St_PV_D4"},"D",null,"Tableau_Images!$C$82"]
[{"$f":"Tableau_Pyr!$F$2&\"\"&Tableau_Pyr!F21","v":"T_St_PV_D5"},"D",null,"Tableau_Images!$C$83"]
[{"$f":"Tableau_Pyr!$F$2&\"\"&Tableau_Pyr!F22","v":"T_St_PV_+"},"?","?","Tableau_Images!$C$84"]
[{"$f":"Tableau_Pyr!$G$2&\"\"&Tableau_Pyr!G4","v":"T_St_EQ_A3"},"A",null,"Tableau_Images!$C$85"]
[{"$f":"Tableau_Pyr!$G$2&\"\"&Tableau_Pyr!G5","v":"T_St_EQ_A5"},"A",null,"Tableau_Images!$C$86"]
[{"$f":"Tableau_Pyr!$G$2&\"\"&Tableau_Pyr!G6","v":"T_St_EQ_A6"},"A",null,"Tableau_Images!$C$87"]
[{"$f":"Tableau_Pyr!$G$2&\"\"&Tableau_Pyr!G7","v":"T_St_EQ_B2"},"B",null,"Tableau_Images!$C$88"]
[{"$f":"Tableau_Pyr!$G$2&\"\"&Tableau_Pyr!G8","v":"T_St_EQ_B3"},"B",null,"Tableau_Images!$C$89"]
[{"$f":"Tableau_Pyr!$G$2&\"\"&Tableau_Pyr!G9","v":"T_St_EQ_B6"},"B",null,"Tableau_Images!$C$90"]
[{"$f":"Tableau_Pyr!$G$2&\"\"&Tableau_Pyr!G10","v":"T_St_EQ_C2"},"C",null,"Tableau_Images!$C$91"]
[{"$f":"Tableau_Pyr!$G$2&\"\"&Tableau_Pyr!G11","v":"T_St_EQ_C3"},"C",null,"Tableau_Images!$C$92"]
[{"$f":"Tableau_Pyr!$G$2&\"\"&Tableau_Pyr!G12","v":"T_St_EQ_C4"},"C",null,"Tableau_Images!$C$93"]
[{"$f":"Tableau_Pyr!$G$2&\"\"&Tableau_Pyr!G13","v":"T_St_EQ_D2"},"D",null,"Tableau_Images!$C$94"]
[{"$f":"Tableau_Pyr!$G$2&\"\"&Tableau_Pyr!G14","v":"T_St_EQ_D4"},"D",null,"Tableau_Images!$C$95"]
[{"$f":"Tableau_Pyr!$G$2&\"\"&Tableau_Pyr!G15","v":"T_St_EQ_D5"},"D",null,"Tableau_Images!$C$96"]
[{"$f":"Tableau_Pyr!$G$2&\"\"&Tableau_Pyr!G16","v":"T_St_EQ_+"},"?","?","Tableau_Images!$C$97"]
[{"$f":"Tableau_Pyr!$H$2&\"\"&Tableau_Pyr!H4","v":"T_St_ATR_A1"},null,null,"Tableau_Images!$C$98"]
[{"$f":"Tableau_Pyr!$H$2&\"\"&Tableau_Pyr!H5","v":"T_St_ATR_A2"},"A",null,"Tableau_Images!$C$99"]
[{"$f":"Tableau_Pyr!$H$2&\"\"&Tableau_Pyr!H6","v":"T_St_ATR_A4"},"A",null,"Tableau_Images!$C$100"]
[{"$f":"Tableau_Pyr!$H$2&\"\"&Tableau_Pyr!H7","v":"T_St_ATR_B1"},"B",null,"Tableau_Images!$C$101"]
[{"$f":"Tableau_Pyr!$H$2&\"\"&Tableau_Pyr!H8","v":"T_St_ATR_B2"},"B",null,"Tableau_Images!$C$102"]
[{"$f":"Tableau_Pyr!$H$2&\"\"&Tableau_Pyr!H9","v":"T_St_ATR_B3"},"B",null,"Tableau_Images!$C$103"]
[{"$f":"Tableau_Pyr!$H$2&\"\"&Tableau_Pyr!H10","v":"T_St_ATR_C1"},"C",null,"Tableau_Images!$C$104"]
[{"$f":"Tableau_Pyr!$H$2&\"\"&Tableau_Pyr!H11","v":"T_St_ATR_C2"},"C",null,"Tableau_Images!$C$105"]
[{"$f":"Tableau_Pyr!$H$2&\"\"&Tableau_Pyr!H12","v":"T_St_ATR_C3"},"C",null,"Tableau_Images!$C$106"]
[{"$f":"Tableau_Pyr!$H$2&\"\"&Tableau_Pyr!H13","v":"T_St_ATR_C4"},"C",null,"Tableau_Images!$C$107"]
[{"$f":"Tableau_Pyr!$H$2&\"\"&Tableau_Pyr!H14","v":"T_St_ATR_C5"},"C",null,"Tableau_Images!$C$108"]
[{"$f":"Tableau_Pyr!$H$2&\"\"&Tableau_Pyr!H15","v":"T_St_ATR_D1"},"D",null,"Tableau_Images!$C$109"]
[{"$f":"Tableau_Pyr!$H$2&\"\"&Tableau_Pyr!H16","v":"T_St_ATR_D2"},"D",null,"Tableau_Images!$C$110"]
[{"$f":"Tableau_Pyr!$H$2&\"\"&Tableau_Pyr!H17","v":"T_St_ATR_D3"},"D",null,"Tableau_Images!$C$111"]
[{"$f":"Tableau_Pyr!$H$2&\"\"&Tableau_Pyr!H18","v":"T_St_ATR_D4"},"D",null,"Tableau_Images!$C$112"]
[{"$f":"Tableau_Pyr!$H$2&\"\"&Tableau_Pyr!H19","v":"T_St_ATR_+"},"?","?","Tableau_Images!$C$113"]
[{"$f":"Tableau_Pyr!$I$2&\"\"&Tableau_Pyr!I4","v":"T_Dy_A1"},"A",null,"Tableau_Images!$C$114"]
[{"$f":"Tableau_Pyr!$I$2&\"\"&Tableau_Pyr!I5","v":"T_Dy_A3"},"A",null,"Tableau_Images!$C$115"]
[{"$f":"Tableau_Pyr!$I$2&\"\"&Tableau_Pyr!I6","v":"T_Dy_A4"},"A",null,"Tableau_Images!$C$116"]
[{"$f":"Tableau_Pyr!$I$2&\"\"&Tableau_Pyr!I7","v":"T_Dy_A5"},"A",null,"Tableau_Images!$C$117"]
[{"$f":"Tableau_Pyr!$I$2&\"\"&Tableau_Pyr!I8","v":"T_Dy_B1"},"B",null,"Tableau_Images!$C$118"]
[{"$f":"Tableau_Pyr!$I$2&\"\"&Tableau_Pyr!I9","v":"T_Dy_B2"},"B",null,"Tableau_Images!$C$119"]
[{"$f":"Tableau_Pyr!$I$2&\"\"&Tableau_Pyr!I10","v":"T_Dy_B3"},"B",null,"Tableau_Images!$C$120"]
[{"$f":"Tableau_Pyr!$I$2&\"\"&Tableau_Pyr!I11","v":"T_Dy_B4"},"B",null,"Tableau_Images!$C$121"]
[{"$f":"Tableau_Pyr!$I$2&\"\"&Tableau_Pyr!I12","v":"T_Dy_B5"},"B",null,"Tableau_Images!$C$122"]
[{"$f":"Tableau_Pyr!$I$2&\"\"&Tableau_Pyr!I13","v":"T_Dy_B6"},"B",null,"Tableau_Images!$C$123"]
[{"$f":"Tableau_Pyr!$I$2&\"\"&Tableau_Pyr!I14","v":"T_Dy_C1"},"C",null,"Tableau_Images!$C$124"]
[{"$f":"Tableau_Pyr!$I$2&\"\"&Tableau_Pyr!I15","v":"T_Dy_C2"},"C",null,"Tableau_Images!$C$125"]
[{"$f":"Tableau_Pyr!$I$2&\"\"&Tableau_Pyr!I16","v":"T_Dy_C3"},"C",null,"Tableau_Images!$C$126"]
[{"$f":"Tableau_Pyr!$I$2&\"\"&Tableau_Pyr!I17","v":"T_Dy_C4"},"C",null,"Tableau_Images!$C$127"]
[{"$f":"Tableau_Pyr!$I$2&\"\"&Tableau_Pyr!I18","v":"T_Dy_C5"},"C",null,"Tableau_Images!$C$128"]
[{"$f":"Tableau_Pyr!$I$2&\"\"&Tableau_Pyr!I19","v":"T_Dy_D2"},"D",null,"Tableau_Images!$C$129"]
[{"$f":"Tableau_Pyr!$I$2&\"\"&Tableau_Pyr!I20","v":"T_Dy_D3"},"D",null,"Tableau_Images!$C$130"]
[{"$f":"Tableau_Pyr!$I$2&\"\"&Tableau_Pyr!I21","v":"T_Dy_D5"},"D",null,"Tableau_Images!$C$131"]
[{"$f":"Tableau_Pyr!$I$2&\"\"&Tableau_Pyr!I22","v":"T_Dy_D6"},"D",null,"Tableau_Images!$C$132"]
[{"$f":"Tableau_Pyr!$I$2&\"\"&Tableau_Pyr!I23","v":"T_Dy_+"},"?","?",{"$f":"\"Tableau_Images!\"&CELL(\"adresse\",C133)","v":"Tableau_Images!$C$133"}]
[{"$f":"Tableau_Pyr!$J$2&\"\"&Tableau_Pyr!J4","v":"Q_St_PV_A1"},"A",null,"Tableau_Images!$C$134"]
[{"$f":"Tableau_Pyr!$J$2&\"\"&Tableau_Pyr!J5","v":"Q_St_PV_B1"},"B",null,"Tableau_Images!$C$135"]
[{"$f":"Tableau_Pyr!$J$2&\"\"&Tableau_Pyr!J6","v":"Q_St_PV_B2"},"B",null,"Tableau_Images!$C$136"]
[{"$f":"Tableau_Pyr!$J$2&\"\"&Tableau_Pyr!J7","v":"Q_St_PV_B3"},"B",null,"Tableau_Images!$C$137"]
[{"$f":"Tableau_Pyr!$J$2&\"\"&Tableau_Pyr!J8","v":"Q_St_PV_B4"},"B",null,"Tableau_Images!$C$138"]
[{"$f":"Tableau_Pyr!$J$2&\"\"&Tableau_Pyr!J9","v":"Q_St_PV_B5"},"B",null,"Tableau_Images!$C$139"]
[{"$f":"Tableau_Pyr!$J$2&\"\"&Tableau_Pyr!J10","v":"Q_St_PV_C2"},"C",null,"Tableau_Images!$C$140"]
[{"$f":"Tableau_Pyr!$J$2&\"\"&Tableau_Pyr!J11","v":"Q_St_PV_C3"},"C",null,"Tableau_Images!$C$141"]
[{"$f":"Tableau_Pyr!$J$2&\"\"&Tableau_Pyr!J12","v":"Q_St_PV_C4"},"C",null,"Tableau_Images!$C$142"]
[{"$f":"Tableau_Pyr!$J$2&\"\"&Tableau_Pyr!J13","v":"Q_St_PV_C5"},"C",null,"Tableau_Images!$C$143"]
[{"$f":"Tableau_Pyr!$J$2&\"\"&Tableau_Pyr!J14","v":"Q_St_PV_D1"},"D",null,"Tableau_Images!$C$144"]
[{"$f":"Tableau_Pyr!$J$2&\"\"&Tableau_Pyr!J15","v":"Q_St_PV_D2"},"D",null,"Tableau_Images!$C$145"]
[{"$f":"Tableau_Pyr!$J$2&\"\"&Tableau_Pyr!J16","v":"Q_St_PV_D3"},"D",null,"Tableau_Images!$C$146"]
[{"$f":"Tableau_Pyr!$J$2&\"\"&Tableau_Pyr!J17","v":"Q_St_PV_D4"},"D",null,"Tableau_Images!$C$147"]
[{"$f":"Tableau_Pyr!$J$2&\"\"&Tableau_Pyr!J18","v":"Q_St_PV_D5"},"D",null,"Tableau_Images!$C$148"]
[{"$f":"Tableau_Pyr!$J$2&\"\"&Tableau_Pyr!J19","v":"Q_St_PV_D6"},"D",null,"Tableau_Images!$C$149"]
[{"$f":"Tableau_Pyr!$J$2&\"\"&Tableau_Pyr!J20","v":"Q_St_PV_+"},"?","?","Tableau_Images!$C$150"]
[{"$f":"Tableau_Pyr!$K$2&\"\"&Tableau_Pyr!K4","v":"Q_St_EQ_A5"},"A",null,"Tableau_Images!$C$151"]
[{"$f":"Tableau_Pyr!$K$2&\"\"&Tableau_Pyr!K5","v":"Q_St_EQ_A6"},"A",null,"Tableau_Images!$C$152"]
[{"$f":"Tableau_Pyr!$K$2&\"\"&Tableau_Pyr!K6","v":"Q_St_EQ_B5"},"B",null,"Tableau_Images!$C$153"]
[{"$f":"Tableau_Pyr!$K$2&\"\"&Tableau_Pyr!K7","v":"Q_St_EQ_B6"},"B",null,"Tableau_Images!$C$154"]
[{"$f":"Tableau_Pyr!$K$2&\"\"&Tableau_Pyr!K8","v":"Q_St_EQ_C5"},"C",null,"Tableau_Images!$C$155"]
[{"$f":"Tableau_Pyr!$K$2&\"\"&Tableau_Pyr!K9","v":"Q_St_EQ_C6"},"C",null,"Tableau_Images!$C$156"]
[{"$f":"Tableau_Pyr!$K$2&\"\"&Tableau_Pyr!K10","v":"Q_St_EQ_D3"},"D",null,"Tableau_Images!$C$157"]
[{"$f":"Tableau_Pyr!$K$2&\"\"&Tableau_Pyr!K11","v":"Q_St_EQ_D4"},"D",null,"Tableau_Images!$C$158"]
[{"$f":"Tableau_Pyr!$K$2&\"\"&Tableau_Pyr!K12","v":"Q_St_EQ_D5"},"D",null,"Tableau_Images!$C$159"]
[{"$f":"Tableau_Pyr!$K$2&\"\"&Tableau_Pyr!K13","v":"Q_St_EQ_+"},"?","?","Tableau_Images!$C$160"]
[{"$f":"Tableau_Pyr!$L$2&\"\"&Tableau_Pyr!L4","v":"Q_St_ATR_A1"},"A",null,"Tableau_Images!$C$161"]
[{"$f":"Tableau_Pyr!$L$2&\"\"&Tableau_Pyr!L5","v":"Q_St_ATR_A4"},"A",null,"Tableau_Images!$C$162"]
[{"$f":"Tableau_Pyr!$L$2&\"\"&Tableau_Pyr!L6","v":"Q_St_ATR_B1"},"B",null,"Tableau_Images!$C$163"]
[{"$f":"Tableau_Pyr!$L$2&\"\"&Tableau_Pyr!L7","v":"Q_St_ATR_B2"},"B",null,"Tableau_Images!$C$164"]
[{"$f":"Tableau_Pyr!$L$2&\"\"&Tableau_Pyr!L8","v":"Q_St_ATR_B3"},"B",null,"Tableau_Images!$C$165"]
[{"$f":"Tableau_Pyr!$L$2&\"\"&Tableau_Pyr!L9","v":"Q_St_ATR_C1"},"C",null,"Tableau_Images!$C$166"]
[{"$f":"Tableau_Pyr!$L$2&\"\"&Tableau_Pyr!L10","v":"Q_St_ATR_C2"},"C",null,"Tableau_Images!$C$167"]
[{"$f":"Tableau_Pyr!$L$2&\"\"&Tableau_Pyr!L11","v":"Q_St_ATR_C3"},"C",null,"Tableau_Images!$C$168"]
[{"$f":"Tableau_Pyr!$L$2&\"\"&Tableau_Pyr!L12","v":"Q_St_ATR_C5"},"C",null,"Tableau_Images!$C$169"]
[{"$f":"Tableau_Pyr!$L$2&\"\"&Tableau_Pyr!L13","v":"Q_St_ATR_D1"},"D",null,"Tableau_Images!$C$170"]
[{"$f":"Tableau_Pyr!$L$2&\"\"&Tableau_Pyr!L14","v":"Q_St_ATR_D3"},"D",null,"Tableau_Images!$C$171"]
[{"$f":"Tableau_Pyr!$L$2&\"\"&Tableau_Pyr!L15","v":"Q_St_ATR_D4"},"D",null,"Tableau_Images!$C$172"]
[{"$f":"Tableau_Pyr!$L$2&\"\"&Tableau_Pyr!L16","v":"Q_St_ATR_+"},"?","?","Tableau_Images!$C$173"]
[{"$f":"Tableau_Pyr!$M$2&\"\"&Tableau_Pyr!M4","v":"Q_Dy_A2"},"A",null,"Tableau_Images!$C$174"]
[{"$f":"Tableau_Pyr!$M$2&\"\"&Tableau_Pyr!M5","v":"Q_Dy_A3"},"A",null,"Tableau_Images!$C$175"]
[{"$f":"Tableau_Pyr!$M$2&\"\"&Tableau_Pyr!M6","v":"Q_Dy_A4"},"A",null,"Tableau_Images!$C$176"]
[{"$f":"Tableau_Pyr!$M$2&\"\"&Tableau_Pyr!M7","v":"Q_Dy_B1"},"B",null,"Tableau_Images!$C$177"]
[{"$f":"Tableau_Pyr!$M$2&\"\"&Tableau_Pyr!M8","v":"Q_Dy_B2"},"B",null,"Tableau_Images!$C$178"]
[{"$f":"Tableau_Pyr!$M$2&\"\"&Tableau_Pyr!M9","v":"Q_Dy_B3"},"B",null,"Tableau_Images!$C$179"]
[{"$f":"Tableau_Pyr!$M$2&\"\"&Tableau_Pyr!M10","v":"Q_Dy_B4"},"B",null,"Tableau_Images!$C$180"]
[{"$f":"Tableau_Pyr!$M$2&\"\"&Tableau_Pyr!M11","v":"Q_Dy_C2"},"C",null,"Tableau_Images!$C$181"]
[{"$f":"Tableau_Pyr!$M$2&\"\"&Tableau_Pyr!M12","v":"Q_Dy_C3"},"C",null,"Tableau_Images!$C$182"]
[{"$f":"Tableau_Pyr!$M$2&\"\"&Tableau_Pyr!M13","v":"Q_Dy_C5"},"C",null,"Tableau_Images!$C$183"]
[{"$f":"Tableau_Pyr!$M$2&\"\"&Tableau_Pyr!M14","v":"Q_Dy_C6"},"C",null,"Tableau_Images!$C$184"]
[{"$f":"Tableau_Pyr!$M$2&\"\"&Tableau_Pyr!M15","v":"Q_Dy_D1"},"D",null,"Tableau_Images!$C$185"]
[{"$f":"Tableau_Pyr!$M$2&\"\"&Tableau_Pyr!M16","v":"Q_Dy_D2"},"D",null,"Tableau_Images!$C$186"]
[{"$f":"Tableau_Pyr!$M$2&\"\"&Tableau_Pyr!M17","v":"Q_Dy_D3"},"D",null,"Tableau_Images!$C$187"]
[{"$f":"Tableau_Pyr!$M$2&\"\"&Tableau_Pyr!M18","v":"Q_Dy_D4"},"D",null,"Tableau_Images!$C$188"]
[{"$f":"Tableau_Pyr!$M$2&\"\"&Tableau_Pyr!M19","v":"Q_Dy_D5"},"D",null,"Tableau_Images!$C$189"]
[{"$f":"Tableau_Pyr!$M$2&\"\"&Tableau_Pyr!M20","v":"Q_Dy_D6"},"D",null,"Tableau_Images!$C$190"]
[{"$f":"Tableau_Pyr!$M$2&\"\"&Tableau_Pyr!M21","v":"Q_Dy_+"},"?","?","Tableau_Images!$C$191"]
[{"$f":"Tableau_Pyr!$N$2&\"\"&Tableau_Pyr!N4","v":"El_M_A1"},"A",null,"Tableau_Images!$C$192"]
[{"$f":"Tableau_Pyr!$N$2&\"\"&Tableau_Pyr!N5","v":"El_M_A2"},"A",null,"Tableau_Images!$C$193"]
[{"$f":"Tableau_Pyr!$N$2&\"\"&Tableau_Pyr!N6","v":"El_M_B2"},"B",null,"Tableau_Images!$C$194"]
[{"$f":"Tableau_Pyr!$N$2&\"\"&Tableau_Pyr!N7","v":"El_M_B3"},"B",null,"Tableau_Images!$C$195"]
[{"$f":"Tableau_Pyr!$N$2&\"\"&Tableau_Pyr!N8","v":"El_M_C2"},"C",null,"Tableau_Images!$C$196"]
[{"$f":"Tableau_Pyr!$N$2&\"\"&Tableau_Pyr!N9","v":"El_M_C3"},"C",null,{"$f":"\"Tableau_Images!\"&CELL(\"adresse\",C197)","v":"Tableau_Images!$C$197"}]
[{"$f":"Tableau_Pyr!$N$2&\"\"&Tableau_Pyr!N10","v":"El_M_C4"},"C",null,"Tableau_Images!$C$198"]
[{"$f":"Tableau_Pyr!$N$2&\"\"&Tableau_Pyr!N11","v":"El_M_D1"},"D",null,"Tableau_Images!$C$199"]
[{"$f":"Tableau_Pyr!$N$2&\"\"&Tableau_Pyr!N12","v":"El_M_D2"},"D",null,"Tableau_Images!$C$200"]
[{"$f":"Tableau_Pyr!$N$2&\"\"&Tableau_Pyr!N13","v":"El_M_D3"},"D",null,"Tableau_Images!$C$201"]
[{"$f":"Tableau_Pyr!$N$2&\"\"&Tableau_Pyr!N14","v":"El_M_+"},"?","?","Tableau_Images!$C$202"]
[{"$f":"Tableau_Pyr!$O$2&\"\"&Tableau_Pyr!O4","v":"El_Sou_A1"},"A",null,"Tableau_Images!$C$203"]
[{"$f":"Tableau_Pyr!$O$2&\"\"&Tableau_Pyr!O5","v":"El_Sou_A2"},"A",null,"Tableau_Images!$C$204"]
[{"$f":"Tableau_Pyr!$O$2&\"\"&Tableau_Pyr!O6","v":"El_Sou_B1"},"B",null,"Tableau_Images!$C$205"]
[{"$f":"Tableau_Pyr!$O$2&\"\"&Tableau_Pyr!O7","v":"El_Sou_B2"},"B",null,"Tableau_Images!$C$206"]
[{"$f":"Tableau_Pyr!$O$2&\"\"&Tableau_Pyr!O8","v":"El_Sou_C2"},"C",null,"Tableau_Images!$C$207"]
[{"$f":"Tableau_Pyr!$O$2&\"\"&Tableau_Pyr!O9","v":"El_Sou_D1"},"D",null,"Tableau_Images!$C$208"]
[{"$f":"Tableau_Pyr!$O$2&\"\"&Tableau_Pyr!O10","v":"El_Sou_D3"},"D",null,"Tableau_Images!$C$209"]
[{"$f":"Tableau_Pyr!$O$2&\"\"&Tableau_Pyr!O11","v":"El_Sou_D4"},"D",null,"Tableau_Images!$C$210"]
[{"$f":"Tableau_Pyr!$O$2&\"\"&Tableau_Pyr!O12","v":"El_Sou_+"},"?","?","Tableau_Images!$C$211"]
[{"$f":"Tableau_Pyr!$P$2&\"\"&Tableau_Pyr!P4","v":"El_Ag_A1"},"A",null,"Tableau_Images!$C$212"]
[{"$f":"Tableau_Pyr!$P$2&\"\"&Tableau_Pyr!P5","v":"El_Ag_A2"},"A",null,"Tableau_Images!$C$213"]
[{"$f":"Tableau_Pyr!$P$2&\"\"&Tableau_Pyr!P6","v":"El_Ag_B1"},"B",null,"Tableau_Images!$C$214"]
[{"$f":"Tableau_Pyr!$P$2&\"\"&Tableau_Pyr!P7","v":"El_Ag_B2"},"B",null,"Tableau_Images!$C$215"]
[{"$f":"Tableau_Pyr!$P$2&\"\"&Tableau_Pyr!P8","v":"El_Ag_B3"},"B",null,"Tableau_Images!$C$216"]
[{"$f":"Tableau_Pyr!$P$2&\"\"&Tableau_Pyr!P9","v":"El_Ag_C2"},"C",null,"Tableau_Images!$C$217"]
[{"$f":"Tableau_Pyr!$P$2&\"\"&Tableau_Pyr!P10","v":"El_Ag_C4"},"C",null,"Tableau_Images!$C$218"]
[{"$f":"Tableau_Pyr!$P$2&\"\"&Tableau_Pyr!P11","v":"El_Ag_D1"},"D",null,"Tableau_Images!$C$219"]
[{"$f":"Tableau_Pyr!$P$2&\"\"&Tableau_Pyr!P12","v":"El_Ag_D3"},"D",null,"Tableau_Images!$C$220"]
[{"$f":"Tableau_Pyr!$P$2&\"\"&Tableau_Pyr!P13","v":"El_Ag_D5"},"D",null,"Tableau_Images!$C$221"]
[{"$f":"Tableau_Pyr!$P$2&\"\"&Tableau_Pyr!P14","v":"El_Ag_+"},"?","?","Tableau_Images!$C$222"]
[{"$f":"Tableau_Pyr!$Q$2&\"\"&Tableau_Pyr!Q4","v":"El_Tu_A1"},"A",null,"Tableau_Images!$C$223"]
[{"$f":"Tableau_Pyr!$Q$2&\"\"&Tableau_Pyr!Q5","v":"El_Tu_B1"},"B",null,"Tableau_Images!$C$224"]
[{"$f":"Tableau_Pyr!$Q$2&\"\"&Tableau_Pyr!Q6","v":"El_Tu_B2"},"B",null,"Tableau_Images!$C$225"]
[{"$f":"Tableau_Pyr!$Q$2&\"\"&Tableau_Pyr!Q7","v":"El_Tu_C1"},"C",null,"Tableau_Images!$C$226"]
[{"$f":"Tableau_Pyr!$Q$2&\"\"&Tableau_Pyr!Q8","v":"El_Tu_C2"},"C",null,"Tableau_Images!$C$227"]
[{"$f":"Tableau_Pyr!$Q$2&\"\"&Tableau_Pyr!Q9","v":"El_Tu_C3"},"C",null,"Tableau_Images!$C$228"]
[{"$f":"Tableau_Pyr!$Q$2&\"\"&Tableau_Pyr!Q10","v":"El_Tu_D1"},"D",null,"Tableau_Images!$C$229"]
[{"$f":"Tableau_Pyr!$Q$2&\"\"&Tableau_Pyr!Q11","v":"El_Tu_+"},"?","?","Tableau_Images!$C$230"]
["Aucune",null,null,"Tableau_Images!$C$231"]

{"sheet":"Tableau_Pyr","index":26,"n_rows":24,"n_cols":19,"rows_kept":24,"cut":false,"hidden":true,"merged":[[0,18,1,18],[0,1,0,4],[0,5,0,8],[0,9,0,12],[0,13,0,16],[0,17,1,17]]}
["Autres","Duos",null,null,null,"Trios",null,null,null,"Quatuors",null,null,null,"Eléments",null,null,null,"Rôle","Types Pyramide"]
[null,"D_St_PV_","D_St_EQ_","D_St_ATR_","D_Dy_","T_St_PV_","T_St_EQ_","T_St_ATR_","T_Dy_","Q_St_PV_","Q_St_EQ_","Q_St_ATR_","Q_Dy_","El_M_","El_Sou_","El_Ag_","El_Tu_"]
[null,null,null,null,null,null,null,null,null,null,null,null,null,null,null,null,null,null,"Statique"]
[null,"A1","A1","A2","A1","A1","A3","A1","A1","A1","A5","A1","A2","A1","A1","A1","A1","P","Dynamique"]
[null,"A2","A4","A3","A2","A3","A5","A2","A3","B1","A6","A4","A3","A2","A2","A2","B1","V","Elément Indiv"]
[null,"A4","B1","A4","A4","A4","A6","A4","A4","B2","B5","B1","A4","B2","B1","B1","B2","El Ind","Elément Synchro"]
[null,"A5","B4","B2","B1","A6","B2","B1","A5","B3","B6","B2","B1","B3","B2","B2","C1","El Syn"]
[null,"B1","C1","B3","B2","B1","B3","B2","B1","B4","C5","B3","B2","C2","C2","B3","C2"]
[null,"B2","C4","B4","B3","B3","B6","B3","B2","B5","C6","C1","B3","C3","D1","C2","C3"]
[null,"B3","D4","C1","B4","B4","C2","C1","B3","C2","D3","C2","B4","C4","D3","C4","D1"]
[null,"B4","D5","C2","B5","B5","C3","C2","B4","C3","D4","C3","C2","D1","D4","D1","+"]
[null,"B5","+","C3","B6","B6","C4","C3","B5","C4","D5","C5","C3","D2","+","D3"]
[null,"C1",null,"C4","C1","C1","D2","C4","B6","C5","+","D1","C5","D3",null,"D5"]
[null,"C3",null,"D1","C3","C2","D4","C5","C1","D1",null,"D3","C6","+",null,"+"]
[null,"C4",null,"D2","C4","C3","D5","D1","C2","D2",null,"D4","D1"]
[null,"C5",null,"D4","C6","C5","+","D2","C3","D3",null,"+","D2"]
[null,"C6",null,"D5","D2","C6",null,"D3","C4","D4",null,null,"D3"]
[null,"D1",null,"+","D3","D2",null,"D4","C5","D5",null,null,"D4"]
[null,"D2",null,null,"D4","D3",null,"+","D2","D6",null,null,"D5"]
[null,"D3",null,null,"D6","D4",null,null,"D3","+",null,null,"D6"]
[null,"D4",null,null,"+","D5",null,null,"D5",null,null,null,"+"]
[null,"D5",null,null,null,"+",null,null,"D6"]
[null,"D6",null,null,null,null,null,null,"+"]
[null,"+"]

{"sheet":"Tableau_Eleves","index":27,"n_rows":110,"n_cols":22,"rows_kept":110,"cut":false,"hidden":true,"merged":[[58,0,58,23],[0,23,57,23],[99,0,99,10],[59,10,98,10]]}
["Nom - Prenom","Groupe","Classe","Figure / élément 1","P / V / El","Points","Figure / élément 2","P / V / El","Points","Figure / élément 3","P / V / El","Points","Figure / élément 4","P / V / El","Points","Figure / élément 5","P / V / El","Points","Figure / élément 6","P / V / El","Points","Point total"]
[]
[{"$f":"CELL(\"contenu\",('G1'!$B$1:$C$4))","v":"Metral Lucie"},{"$f":"IF(A3=\"\",\"\",'G1'!$A$1)","v":"Groupe 1"},{"$f":"IF(Groupes!$C3=\"\",\"\",CELL(\"contenu\",(Groupes!$C3)))","v":"TL"},{"$f":"CELL(\"contenu\",('G1'!$D$3:$E$3))","v":"D_Dy_C6"},{"$f":"IF('G1'!$D$4=\"\",\"\",CELL(\"contenu\",('G1'!$D$4)))","v":"V"},{"$f":"IF('G1'!$E$4=\"\",\"\",CELL(\"contenu\",('G1'!$E$4)))","v":"C"},{"$f":"CELL(\"contenu\",('G1'!$F$3:$G$3))","v":"D_St_PV_C6"},{"$f":"IF('G1'!$F$4=\"\",\"\",CELL(\"contenu\",('G1'!$F$4)))","v":"V"},{"$f":"IF('G1'!$G$4=\"\",\"\",CELL(\"contenu\",('G1'!$G$4)))","v":"C"},{"$f":"CELL(\"contenu\",('G1'!$H$3:$I$3))","v":"D_St_EQ_B1"},{"$f":"IF('G1'!$H$4=\"\",\"\",CELL(\"contenu\",('G1'!$H$4)))","v":"V"},{"$f":"IF('G1'!$I$4=\"\",\"\",CELL(\"contenu\",('G1'!$I$4)))","v":"B"},{"$f":"CELL(\"contenu\",('G1'!$J$3:$K$3))","v":"El_Sou_C2"},{"$f":"IF('G1'!$J$4=\"\",\"\",CELL(\"contenu\",('G1'!$J$4)))","v":"El Ind"},{"$f":"IF('G1'!$K$4=\"\",\"\",CELL(\"contenu\",('G1'!$K$4)))","v":"C"},{"$f":"CELL(\"contenu\",('G1'!$L$3:$M$3))","v":"D_St_EQ_B4"},{"$f":"IF('G1'!$L$4=\"\",\"\",CELL(\"contenu\",('G1'!$L$4)))","v":"P"},{"$f":"IF('G1'!$M$4=\"\",\"\",CELL(\"contenu\",('G1'!$M$4)))","v":"B"},{"$f":"CELL(\"contenu\",('G1'!$N$3:$O$3))","v":"El_Ag_B1"},{"$f":"IF('G1'!$N$4=\"\",\"\",CELL(\"contenu\",('G1'!$N$4)))","v":"El Syn"},{"$f":"IF('G1'!$O$4=\"\",\"\",CELL(\"contenu\",('G1'!$O$4)))","v":"B"},{"$f":"CELL(\"contenu\",'G1'!$Q$2)","v":4.2}]
[{"$f":"CELL(\"contenu\",('G1'!$B$7:$C$10))","v":"Bredier Nicolas"},{"$f":"IF(A4=\"\",\"\",'G1'!$A$1)","v":"Groupe 1"},{"$f":"IF(Groupes!$C4=\"\",\"\",CELL(\"contenu\",(Groupes!$C4)))","v":"TS"},{"$f":"CELL(\"contenu\",('G1'!$D$9:$E$9))","v":"D_St_EQ_B1"},{"$f":"IF('G1'!$D$10=\"\",\"\",CELL(\"contenu\",('G1'!$D$10)))","v":""},{"$f":"IF('G1'!$E$10=\"\",\"\",CELL(\"contenu\",('G1'!$E$10)))","v":"B"},{"$f":"CELL(\"contenu\",('G1'!$F$9:$G$9))","v":"D_St_ATR_C4"},{"$f":"IF('G1'!$F$10=\"\",\"\",CELL(\"contenu\",('G1'!$F$10)))","v":"P"},{"$f":"IF('G1'!$G$10=\"\",\"\",CELL(\"contenu\",('G1'!$G$10)))","v":"C"},{"$f":"CELL(\"contenu\",('G1'!$H$9:$I$9))","v":"T_St_EQ_B6"},{"$f":"IF('G1'!$H$10=\"\",\"\",CELL(\"contenu\",('G1'!$H$10)))","v":"P"},{"$f":"IF('G1'!$I$10=\"\",\"\",CELL(\"contenu\",('G1'!$I$10)))","v":"B"},{"$f":"CELL(\"contenu\",('G1'!$J$9:$K$9))","v":"D_Dy_B2"},{"$f":"IF('G1'!$J$10=\"\",\"\",CELL(\"contenu\",('G1'!$J$10)))","v":"V"},{"$f":"IF('G1'!$K$10=\"\",\"\",CELL(\"contenu\",('G1'!$K$10)))","v":"B"},{"$f":"CELL(\"contenu\",('G1'!$L$9:$M$9))","v":"El_Ag_B3"},{"$f":"IF('G1'!$L$10=\"\",\"\",CELL(\"contenu\",('G1'!$L$10)))","v":"El Ind"},{"$f":"IF('G1'!$M$10=\"\",\"\",CELL(\"contenu\",('G1'!$M$10)))","v":"B"},{"$f":"CELL(\"contenu\",('G1'!$N$9:$O$9))","v":"El_Ag_B1"},{"$f":"IF('G1'!$N$10=\"\",\"\",CELL(\"contenu\",('G1'!$N$10)))","v":"El Syn"},{"$f":"IF('G1'!$O$10=\"\",\"\",CELL(\"contenu\",('G1'!$O$10)))","v":"B"},{"$f":"CELL(\"contenu\",'G1'!$Q$8)","v":3.8}]
[{"$f":"CELL(\"contenu\",('G1'!$B$13:$C$16))","v":"Sophie Lasgne"},{"$f":"IF(A5=\"\",\"\",'G1'!$A$1)","v":"Groupe 1"},{"$f":"IF(Groupes!$C5=\"\",\"\",CELL(\"contenu\",(Groupes!$C5)))","v":"TL"},{"$f":"CELL(\"contenu\",('G1'!$D$15:$E$15))","v":"D_St_EQ_B1"},{"$f":"IF('G1'!$D$16=\"\",\"\",CELL(\"contenu\",('G1'!$D$16)))","v":"El Ind"},{"$f":"IF('G1'!$E$16=\"\",\"\",CELL(\"contenu\",('G1'!$E$16)))","v":"B"},{"$f":"CELL(\"contenu\",('G1'!$F$15:$G$15))","v":"D_St_ATR_B2"},{"$f":"IF('G1'!$F$16=\"\",\"\",CELL(\"contenu\",('G1'!$F$16)))","v":"P"},{"$f":"IF('G1'!$G$16=\"\",\"\",CELL(\"contenu\",('G1'!$G$16)))","v":"B"},{"$f":"CELL(\"contenu\",('G1'!$H$15:$I$15))","v":"T_Dy_D6"},{"$f":"IF('G1'!$H$16=\"\",\"\",CELL(\"contenu\",('G1'!$H$16)))","v":"V"},{"$f":"IF('G1'!$I$16=\"\",\"\",CELL(\"contenu\",('G1'!$I$16)))","v":"D"},{"$f":"CELL(\"contenu\",('G1'!$J$15:$K$15))","v":"El_M_A2"},{"$f":"IF('G1'!$J$16=\"\",\"\",CELL(\"contenu\",('G1'!$J$16)))","v":"El Ind"},{"$f":"IF('G1'!$K$16=\"\",\"\",CELL(\"contenu\",('G1'!$K$16)))","v":"A"},{"$f":"CELL(\"contenu\",('G1'!$L$15:$M$15))","v":"T_St_PV_B1"},{"$f":"IF('G1'!$L$16=\"\",\"\",CELL(\"contenu\",('G1'!$L$16)))","v":"V"},{"$f":"IF('G1'!$M$16=\"\",\"\",CELL(\"contenu\",('G1'!$M$16)))","v":"B"},{"$f":"CELL(\"contenu\",('G1'!$N$15:$O$15))","v":"El_Ag_B1"},{"$f":"IF('G1'!$N$16=\"\",\"\",CELL(\"contenu\",('G1'!$N$16)))","v":"El Syn"},{"$f":"IF('G1'!$O$16=\"\",\"\",CELL(\"contenu\",('G1'!$O$16)))","v":"B"},{"$f":"CELL(\"contenu\",'G1'!$Q$14)","v":3.8}]
[{"$f":"CELL(\"contenu\",('G1'!$B$19:$C$22))","v":""},{"$f":"IF(A6=\"\",\"\",'G1'!$A$1)","v":""},{"$f":"IF(Groupes!$C6=\"\",\"\",CELL(\"contenu\",(Groupes!$C6)))","v":""},{"$f":"CELL(\"contenu\",('G1'!$D$21:$E$21))","v":""},{"$f":"IF('G1'!$D$22=\"\",\"\",CELL(\"contenu\",('G1'!$D$22)))","v":""},{"$f":"IF('G1'!$E$22=\"\",\"\",CELL(\"contenu\",('G1'!$E$22)))","v":""},{"$f":"CELL(\"contenu\",('G1'!$F$21:$G$21))","v":""},{"$f":"IF('G1'!$F$22=\"\",\"\",CELL(\"contenu\",('G1'!$F$22)))","v":""},{"$f":"IF('G1'!$G$22=\"\",\"\",CELL(\"contenu\",('G1'!$G$22)))","v":""},{"$f":"CELL(\"contenu\",('G1'!$H$21:$I$21))","v":""},{"$f":"IF('G1'!$H$22=\"\",\"\",CELL(\"contenu\",('G1'!$H$22)))","v":""},{"$f":"IF('G1'!$I$22=\"\",\"\",CELL(\"contenu\",('G1'!$I$22)))","v":""},{"$f":"CELL(\"contenu\",('G1'!$J$21:$K$21))","v":""},{"$f":"IF('G1'!$J$22=\"\",\"\",CELL(\"contenu\",('G1'!$J$22)))","v":""},{"$f":"IF('G1'!$K$22=\"\",\"\",CELL(\"contenu\",('G1'!$K$22)))","v":""},{"$f":"CELL(\"contenu\",('G1'!$L$21:$M$21))","v":""},{"$f":"IF('G1'!$L$22=\"\",\"\",CELL(\"contenu\",('G1'!$L$22)))","v":""},{"$f":"IF('G1'!$M$22=\"\",\"\",CELL(\"contenu\",('G1'!$M$22)))","v":""},{"$f":"CELL(\"contenu\",('G1'!$N$21:$O$21))","v":""},{"$f":"IF('G1'!$N$22=\"\",\"\",CELL(\"contenu\",('G1'!$N$22)))","v":""},{"$f":"IF('G1'!$O$22=\"\",\"\",CELL(\"contenu\",('G1'!$O$22)))","v":""},{"$f":"CELL(\"contenu\",'G1'!$Q$20)","v":""}]
[{"$f":"CELL(\"contenu\",('G1'!$B$25:$C$28))","v":""},{"$f":"IF(A7=\"\",\"\",'G1'!$A$1)","v":""},{"$f":"IF(Groupes!$C7=\"\",\"\",CELL(\"contenu\",(Groupes!$C7)))","v":""},{"$f":"CELL(\"contenu\",('G1'!$D$27:$E$27))","v":""},{"$f":"IF('G1'!$D$28=\"\",\"\",CELL(\"contenu\",('G1'!$D$28)))","v":""},{"$f":"IF('G1'!$E$28=\"\",\"\",CELL(\"contenu\",('G1'!$E$28)))","v":""},{"$f":"CELL(\"contenu\",('G1'!$F$27:$G$27))","v":""},{"$f":"IF('G1'!$F$28=\"\",\"\",CELL(\"contenu\",('G1'!$F$28)))","v":""},{"$f":"IF('G1'!$G$28=\"\",\"\",CELL(\"contenu\",('G1'!$G$28)))","v":""},{"$f":"CELL(\"contenu\",('G1'!$H$27:$I$27))","v":""},{"$f":"IF('G1'!$H$28=\"\",\"\",CELL(\"contenu\",('G1'!$H$28)))","v":""},{"$f":"IF('G1'!$I$28=\"\",\"\",CELL(\"contenu\",('G1'!$I$28)))","v":""},{"$f":"CELL(\"contenu\",('G1'!$J$27:$K$27))","v":""},{"$f":"IF('G1'!$J$28=\"\",\"\",CELL(\"contenu\",('G1'!$J$28)))","v":""},{"$f":"IF('G1'!$K$28=\"\",\"\",CELL(\"contenu\",('G1'!$K$28)))","v":""},{"$f":"CELL(\"contenu\",('G1'!$L$27:$M$27))","v":""},{"$f":"IF('G1'!$L$28=\"\",\"\",CELL(\"contenu\",('G1'!$L$28)))","v":""},{"$f":"IF('G1'!$M$28=\"\",\"\",CELL(\"contenu\",('G1'!$M$28)))","v":""},{"$f":"CELL(\"contenu\",('G1'!$N$27:$O$27))","v":""},{"$f":"IF('G1'!$N$28=\"\",\"\",CELL(\"contenu\",('G1'!$N$28)))","v":""},{"$f":"IF('G1'!$O$28=\"\",\"\",CELL(\"contenu\",('G1'!$O$28)))","v":""},{"$f":"CELL(\"contenu\",'G1'!$Q$26)","v":""}]
[{"$f":"CELL(\"contenu\",('G1'!$B$31:$C$34))","v":""},{"$f":"IF(A8=\"\",\"\",'G1'!$A$1)","v":""},{"$f":"IF(Groupes!$C8=\"\",\"\",CELL(\"contenu\",(Groupes!$C8)))","v":""},{"$f":"CELL(\"contenu\",('G1'!$D$33:$E$33))","v":""},{"$f":"IF('G1'!$D$34=\"\",\"\",CELL(\"contenu\",('G1'!$D$34)))","v":""},{"$f":"IF('G1'!$E$34=\"\",\"\",CELL(\"contenu\",('G1'!$E$34)))","v":""},{"$f":"CELL(\"contenu\",('G1'!$F$33:$G$33))","v":""},{"$f":"IF('G1'!$F$34=\"\",\"\",CELL(\"contenu\",('G1'!$F$34)))","v":""},{"$f":"IF('G1'!$G$34=\"\",\"\",CELL(\"contenu\",('G1'!$G$34)))","v":""},{"$f":"CELL(\"contenu\",('G1'!$H$33:$I$33))","v":""},{"$f":"IF('G1'!$H$34=\"\",\"\",CELL(\"contenu\",('G1'!$H$34)))","v":""},{"$f":"IF('G1'!$I$34=\"\",\"\",CELL(\"contenu\",('G1'!$I$34)))","v":""},{"$f":"CELL(\"contenu\",('G1'!$J$33:$K$33))","v":""},{"$f":"IF('G1'!$J$34=\"\",\"\",CELL(\"contenu\",('G1'!$J$34)))","v":""},{"$f":"IF('G1'!$K$34=\"\",\"\",CELL(\"contenu\",('G1'!$K$34)))","v":""},{"$f":"CELL(\"contenu\",('G1'!$L$33:$M$33))","v":""},{"$f":"IF('G1'!$L$34=\"\",\"\",CELL(\"contenu\",('G1'!$L$34)))","v":""},{"$f":"IF('G1'!$M$34=\"\",\"\",CELL(\"contenu\",('G1'!$M$34)))","v":""},{"$f":"CELL(\"contenu\",('G1'!$N$33:$O$33))","v":""},{"$f":"IF('G1'!$N$34=\"\",\"\",CELL(\"contenu\",('G1'!$N$34)))","v":""},{"$f":"IF('G1'!$O$34=\"\",\"\",CELL(\"contenu\",('G1'!$O$34)))","v":""},{"$f":"CELL(\"contenu\",'G1'!$Q$32)","v":""}]
[{"$f":"CELL(\"contenu\",('G2'!$B$1:$C$4))","v":"Hebert Georges"},{"$f":"IF(A9=\"\",\"\",'G2'!$A$1)","v":"Groupe 2"},{"$f":"IF(Groupes!$H3=\"\",\"\",CELL(\"contenu\",(Groupes!$H3)))","v":"TS"},{"$f":"CELL(\"contenu\",('G2'!$D$3:$E$3))","v":"D_St_EQ_D4"},{"$f":"IF('G2'!$D$4=\"\",\"\",CELL(\"contenu\",('G2'!$D$4)))","v":"P"},{"$f":"IF('G2'!$E$4=\"\",\"\",CELL(\"contenu\",('G2'!$E$4)))","v":"D"},{"$f":"CELL(\"contenu\",('G2'!$F$3:$G$3))","v":"D_St_ATR_B2"},{"$f":"IF('G2'!$F$4=\"\",\"\",CELL(\"contenu\",('G2'!$F$4)))","v":"P"},{"$f":"IF('G2'!$G$4=\"\",\"\",CELL(\"contenu\",('G2'!$G$4)))","v":"B"},{"$f":"CELL(\"contenu\",('G2'!$H$3:$I$3))","v":"D_Dy_B2"},{"$f":"IF('G2'!$H$4=\"\",\"\",CELL(\"contenu\",('G2'!$H$4)))","v":"P"},{"$f":"IF('G2'!$I$4=\"\",\"\",CELL(\"contenu\",('G2'!$I$4)))","v":"B"},{"$f":"CELL(\"contenu\",('G2'!$J$3:$K$3))","v":"T_St_PV_B1"},{"$f":"IF('G2'!$J$4=\"\",\"\",CELL(\"contenu\",('G2'!$J$4)))","v":"P"},{"$f":"IF('G2'!$K$4=\"\",\"\",CELL(\"contenu\",('G2'!$K$4)))","v":"B"},{"$f":"CELL(\"contenu\",('G2'!$L$3:$M$3))","v":"T_St_EQ_B6"},{"$f":"IF('G2'!$L$4=\"\",\"\",CELL(\"contenu\",('G2'!$L$4)))","v":"P"},{"$f":"IF('G2'!$M$4=\"\",\"\",CELL(\"contenu\",('G2'!$M$4)))","v":"B"},{"$f":"CELL(\"contenu\",('G2'!$N$3:$O$3))","v":"Q_St_ATR_C1"},{"$f":"IF('G2'!$N$4=\"\",\"\",CELL(\"contenu\",('G2'!$N$4)))","v":"P"},{"$f":"IF('G2'!$O$4=\"\",\"\",CELL(\"contenu\",('G2'!$O$4)))","v":"C"},{"$f":"CELL(\"contenu\",'G2'!$Q$2)","v":4.2}]
[{"$f":"CELL(\"contenu\",('G2'!$B$7:$C$10))","v":"Tissié Phillippe"},{"$f":"IF(A10=\"\",\"\",'G2'!$A$1)","v":"Groupe 2"},{"$f":"IF(Groupes!$H4=\"\",\"\",CELL(\"contenu\",(Groupes!$H4)))","v":"TS"},{"$f":"CELL(\"contenu\",('G2'!$D$9:$E$9))","v":"D_Dy_B1"},{"$f":"IF('G2'!$D$10=\"\",\"\",CELL(\"contenu\",('G2'!$D$10)))","v":"V"},{"$f":"IF('G2'!$E$10=\"\",\"\",CELL(\"contenu\",('G2'!$E$10)))","v":"B"},{"$f":"CELL(\"contenu\",('G2'!$F$9:$G$9))","v":"D_St_EQ_B1"},{"$f":"IF('G2'!$F$10=\"\",\"\",CELL(\"contenu\",('G2'!$F$10)))","v":"V"},{"$f":"IF('G2'!$G$10=\"\",\"\",CELL(\"contenu\",('G2'!$G$10)))","v":"B"},{"$f":"CELL(\"contenu\",('G2'!$H$9:$I$9))","v":"D_Dy_B1"},{"$f":"IF('G2'!$H$10=\"\",\"\",CELL(\"contenu\",('G2'!$H$10)))","v":"V"},{"$f":"IF('G2'!$I$10=\"\",\"\",CELL(\"contenu\",('G2'!$I$10)))","v":"B"},{"$f":"CELL(\"contenu\",('G2'!$J$9:$K$9))","v":"D_St_ATR_B3"},{"$f":"IF('G2'!$J$10=\"\",\"\",CELL(\"contenu\",('G2'!$J$10)))","v":"V"},{"$f":"IF('G2'!$K$10=\"\",\"\",CELL(\"contenu\",('G2'!$K$10)))","v":"B"},{"$f":"CELL(\"contenu\",('G2'!$L$9:$M$9))","v":"D_Dy_A2"},{"$f":"IF('G2'!$L$10=\"\",\"\",CELL(\"contenu\",('G2'!$L$10)))","v":"V"},{"$f":"IF('G2'!$M$10=\"\",\"\",CELL(\"contenu\",('G2'!$M$10)))","v":"A"},{"$f":"CELL(\"contenu\",('G2'!$N$9:$O$9))","v":"T_St_PV_A6"},{"$f":"IF('G2'!$N$10=\"\",\"\",CELL(\"contenu\",('G2'!$N$10)))","v":"V"},{"$f":"IF('G2'!$O$10=\"\",\"\",CELL(\"contenu\",('G2'!$O$10)))","v":"A"},{"$f":"CELL(\"contenu\",'G2'!$Q$8)","v":3.2}]
[{"$f":"CELL(\"contenu\",('G2'!$B$13:$C$16))","v":"Leboulch Jean"},{"$f":"IF(A11=\"\",\"\",'G2'!$A$1)","v":"Groupe 2"},{"$f":"IF(Groupes!$H5=\"\",\"\",CELL(\"contenu\",(Groupes!$H5)))","v":"TL"},{"$f":"CELL(\"contenu\",('G2'!$D$15:$E$15))","v":"D_Dy_B1"},{"$f":"IF('G2'!$D$16=\"\",\"\",CELL(\"contenu\",('G2'!$D$16)))","v":"El Ind"},{"$f":"IF('G2'!$E$16=\"\",\"\",CELL(\"contenu\",('G2'!$E$16)))","v":"B"},{"$f":"CELL(\"contenu\",('G2'!$F$15:$G$15))","v":"D_Dy_B2"},{"$f":"IF('G2'!$F$16=\"\",\"\",CELL(\"contenu\",('G2'!$F$16)))","v":"El Ind"},{"$f":"IF('G2'!$G$16=\"\",\"\",CELL(\"contenu\",('G2'!$G$16)))","v":"B"},{"$f":"CELL(\"contenu\",('G2'!$H$15:$I$15))","v":"Q_St_PV_A1"},{"$f":"IF('G2'!$H$16=\"\",\"\",CELL(\"contenu\",('G2'!$H$16)))","v":"El Ind"},{"$f":"IF('G2'!$I$16=\"\",\"\",CELL(\"contenu\",('G2'!$I$16)))","v":"A"},{"$f":"CELL(\"contenu\",('G2'!$J$15:$K$15))","v":"D_Dy_B1"},{"$f":"IF('G2'!$J$16=\"\",\"\",CELL(\"contenu\",('G2'!$J$16)))","v":"El Ind"},{"$f":"IF('G2'!$K$16=\"\",\"\",CELL(\"contenu\",('G2'!$K$16)))","v":"B"},{"$f":"CELL(\"contenu\",('G2'!$L$15:$M$15))","v":"D_Dy_B3"},{"$f":"IF('G2'!$L$16=\"\",\"\",CELL(\"contenu\",('G2'!$L$16)))","v":"El Ind"},{"$f":"IF('G2'!$M$16=\"\",\"\",CELL(\"contenu\",('G2'!$M$16)))","v":"B"},{"$f":"CELL(\"contenu\",('G2'!$N$15:$O$15))","v":"T_St_PV_B4"},{"$f":"IF('G2'!$N$16=\"\",\"\",CELL(\"contenu\",('G2'!$N$16)))","v":"El Ind"},{"$f":"IF('G2'!$O$16=\"\",\"\",CELL(\"contenu\",('G2'!$O$16)))","v":"B"},{"$f":"CELL(\"contenu\",'G2'!$Q$14)","v":3.4}]
[{"$f":"CELL(\"contenu\",('G2'!$B$19:$C$22))","v":"Mérand Robert"},{"$f":"IF(A12=\"\",\"\",'G2'!$A$1)","v":"Groupe 2"},{"$f":"IF(Groupes!$H6=\"\",\"\",CELL(\"contenu\",(Groupes!$H6)))","v":"TS"},{"$f":"CELL(\"contenu\",('G2'!$D$21:$E$21))","v":"D_Dy_B1"},{"$f":"IF('G2'!$D$22=\"\",\"\",CELL(\"contenu\",('G2'!$D$22)))","v":"El Syn"},{"$f":"IF('G2'!$E$22=\"\",\"\",CELL(\"contenu\",('G2'!$E$22)))","v":"B"},{"$f":"CELL(\"contenu\",('G2'!$F$21:$G$21))","v":"El_M_B3"},{"$f":"IF('G2'!$F$22=\"\",\"\",CELL(\"contenu\",('G2'!$F$22)))","v":"El Syn"},{"$f":"IF('G2'!$G$22=\"\",\"\",CELL(\"contenu\",('G2'!$G$22)))","v":"B"},{"$f":"CELL(\"contenu\",('G2'!$H$21:$I$21))","v":"El_M_B3"},{"$f":"IF('G2'!$H$22=\"\",\"\",CELL(\"contenu\",('G2'!$H$22)))","v":"El Syn"},{"$f":"IF('G2'!$I$22=\"\",\"\",CELL(\"contenu\",('G2'!$I$22)))","v":"B"},{"$f":"CELL(\"contenu\",('G2'!$J$21:$K$21))","v":"El_Ag_B3"},{"$f":"IF('G2'!$J$22=\"\",\"\",CELL(\"contenu\",('G2'!$J$22)))","v":"El Syn"},{"$f":"IF('G2'!$K$22=\"\",\"\",CELL(\"contenu\",('G2'!$K$22)))","v":"B"},{"$f":"CELL(\"contenu\",('G2'!$L$21:$M$21))","v":"El_Ag_B3"},{"$f":"IF('G2'!$L$22=\"\",\"\",CELL(\"contenu\",('G2'!$L$22)))","v":"El Syn"},{"$f":"IF('G2'!$M$22=\"\",\"\",CELL(\"contenu\",('G2'!$M$22)))","v":"B"},{"$f":"CELL(\"contenu\",('G2'!$N$21:$O$21))","v":"El_Ag_C2"},{"$f":"IF('G2'!$N$22=\"\",\"\",CELL(\"contenu\",('G2'!$N$22)))","v":"El Syn"},{"$f":"IF('G2'!$O$22=\"\",\"\",CELL(\"contenu\",('G2'!$O$22)))","v":"C"},{"$f":"CELL(\"contenu\",'G2'!$Q$20)","v":3.8}]
[{"$f":"CELL(\"contenu\",('G2'!$B$25:$C$28))","v":"Coubertin Pierre"},{"$f":"IF(A13=\"\",\"\",'G2'!$A$1)","v":"Groupe 2"},{"$f":"IF(Groupes!$H7=\"\",\"\",CELL(\"contenu\",(Groupes!$H7)))","v":"TL"},{"$f":"CELL(\"contenu\",('G2'!$D$27:$E$27))","v":"D_Dy_B1"},{"$f":"IF('G2'!$D$28=\"\",\"\",CELL(\"contenu\",('G2'!$D$28)))","v":"P"},{"$f":"IF('G2'!$E$28=\"\",\"\",CELL(\"contenu\",('G2'!$E$28)))","v":"B"},{"$f":"CELL(\"contenu\",('G2'!$F$27:$G$27))","v":"T_St_PV_B3"},{"$f":"IF('G2'!$F$28=\"\",\"\",CELL(\"contenu\",('G2'!$F$28)))","v":"V"},{"$f":"IF('G2'!$G$28=\"\",\"\",CELL(\"contenu\",('G2'!$G$28)))","v":"B"},{"$f":"CELL(\"contenu\",('G2'!$H$27:$I$27))","v":"El_Sou_B2"},{"$f":"IF('G2'!$H$28=\"\",\"\",CELL(\"contenu\",('G2'!$H$28)))","v":"El Ind"},{"$f":"IF('G2'!$I$28=\"\",\"\",CELL(\"contenu\",('G2'!$I$28)))","v":"B"},{"$f":"CELL(\"contenu\",('G2'!$J$27:$K$27))","v":"D_Dy_B3"},{"$f":"IF('G2'!$J$28=\"\",\"\",CELL(\"contenu\",('G2'!$J$28)))","v":"V"},{"$f":"IF('G2'!$K$28=\"\",\"\",CELL(\"contenu\",('G2'!$K$28)))","v":"B"},{"$f":"CELL(\"contenu\",('G2'!$L$27:$M$27))","v":"T_St_EQ_B2"},{"$f":"IF('G2'!$L$28=\"\",\"\",CELL(\"contenu\",('G2'!$L$28)))","v":"V"},{"$f":"IF('G2'!$M$28=\"\",\"\",CELL(\"contenu\",('G2'!$M$28)))","v":"B"},{"$f":"CELL(\"contenu\",('G2'!$N$27:$O$27))","v":"El_Ag_C2"},{"$f":"IF('G2'!$N$28=\"\",\"\",CELL(\"contenu\",('G2'!$N$28)))","v":"El Ind"},{"$f":"IF('G2'!$O$28=\"\",\"\",CELL(\"contenu\",('G2'!$O$28)))","v":"C"},{"$f":"CELL(\"contenu\",'G2'!$Q$26)","v":3.8}]
[{"$f":"CELL(\"contenu\",('G2'!$B$31:$C$34))","v":""},{"$f":"IF(A14=\"\",\"\",'G2'!$A$1)","v":""},{"$f":"IF(Groupes!$H8=\"\",\"\",CELL(\"contenu\",(Groupes!$H8)))","v":""},{"$f":"CELL(\"contenu\",('G2'!$D$33:$E$33))","v":""},{"$f":"IF('G2'!$D$34=\"\",\"\",CELL(\"contenu\",('G2'!$D$34)))","v":""},{"$f":"IF('G2'!$E$34=\"\",\"\",CELL(\"contenu\",('G2'!$E$34)))","v":""},{"$f":"CELL(\"contenu\",('G2'!$F$33:$G$33))","v":""},{"$f":"IF('G2'!$F$34=\"\",\"\",CELL(\"contenu\",('G2'!$F$34)))","v":""},{"$f":"IF('G2'!$G$34=\"\",\"\",CELL(\"contenu\",('G2'!$G$34)))","v":""},{"$f":"CELL(\"contenu\",('G2'!$H$33:$I$33))","v":""},{"$f":"IF('G2'!$H$34=\"\",\"\",CELL(\"contenu\",('G2'!$H$34)))","v":""},{"$f":"IF('G2'!$I$34=\"\",\"\",CELL(\"contenu\",('G2'!$I$34)))","v":""},{"$f":"CELL(\"contenu\",('G2'!$J$33:$K$33))","v":""},{"$f":"IF('G2'!$J$34=\"\",\"\",CELL(\"contenu\",('G2'!$J$34)))","v":""},{"$f":"IF('G2'!$K$34=\"\",\"\",CELL(\"contenu\",('G2'!$K$34)))","v":""},{"$f":"CELL(\"contenu\",('G2'!$L$33:$M$33))","v":""},{"$f":"IF('G2'!$L$34=\"\",\"\",CELL(\"contenu\",('G2'!$L$34)))","v":""},{"$f":"IF('G2'!$M$34=\"\",\"\",CELL(\"contenu\",('G2'!$M$34)))","v":""},{"$f":"CELL(\"contenu\",('G2'!$N$33:$O$33))","v":""},{"$f":"IF('G2'!$N$34=\"\",\"\",CELL(\"contenu\",('G2'!$N$34)))","v":""},{"$f":"IF('G2'!$O$34=\"\",\"\",CELL(\"contenu\",('G2'!$O$34)))","v":""},{"$f":"CELL(\"contenu\",'G2'!$Q$32)","v":""}]
[{"$f":"CELL(\"contenu\",('G3'!$B$1:$C$4))","v":""},{"$f":"IF(A15=\"\",\"\",'G3'!$A$1)","v":""},{"$f":"IF(Groupes!$M3=\"\",\"\",CELL(\"contenu\",(Groupes!$M3)))","v":""},{"$f":"CELL(\"contenu\",('G3'!$D$3:$E$3))","v":"D_St_PV_A1"},{"$f":"IF('G3'!$D$4=\"\",\"\",CELL(\"contenu\",('G3'!$D$4)))","v":""},{"$f":"IF('G3'!$E$4=\"\",\"\",CELL(\"contenu\",('G3'!$E$4)))","v":"A"},{"$f":"CELL(\"contenu\",('G3'!$F$3:$G$3))","v":""},{"$f":"IF('G3'!$F$4=\"\",\"\",CELL(\"contenu\",('G3'!$F$4)))","v":""},{"$f":"IF('G3'!$G$4=\"\",\"\",CELL(\"contenu\",('G3'!$G$4)))","v":""},{"$f":"CELL(\"contenu\",('G3'!$H$3:$I$3))","v":""},{"$f":"IF('G3'!$H$4=\"\",\"\",CELL(\"contenu\",('G3'!$H$4)))","v":""},{"$f":"IF('G3'!$I$4=\"\",\"\",CELL(\"contenu\",('G3'!$I$4)))","v":""},{"$f":"CELL(\"contenu\",('G3'!$J$3:$K$3))","v":""},{"$f":"IF('G3'!$J$4=\"\",\"\",CELL(\"contenu\",('G3'!$J$4)))","v":""},{"$f":"IF('G3'!$K$4=\"\",\"\",CELL(\"contenu\",('G3'!$K$4)))","v":""},{"$f":"CELL(\"contenu\",('G3'!$L$3:$M$3))","v":""},{"$f":"IF('G3'!$L$4=\"\",\"\",CELL(\"contenu\",('G3'!$L$4)))","v":""},{"$f":"IF('G3'!$M$4=\"\",\"\",CELL(\"contenu\",('G3'!$M$4)))","v":""},{"$f":"CELL(\"contenu\",('G3'!$N$3:$O$3))","v":""},{"$f":"IF('G3'!$N$4=\"\",\"\",CELL(\"contenu\",('G3'!$N$4)))","v":""},{"$f":"IF('G3'!$O$4=\"\",\"\",CELL(\"contenu\",('G3'!$O$4)))","v":""},{"$f":"CELL(\"contenu\",'G3'!$Q$2)","v":0.4}]
[{"$f":"CELL(\"contenu\",('G3'!$B$7:$C$10))","v":""},{"$f":"IF(A16=\"\",\"\",'G3'!$A$1)","v":""},{"$f":"IF(Groupes!$M4=\"\",\"\",CELL(\"contenu\",(Groupes!$M4)))","v":""},{"$f":"CELL(\"contenu\",('G3'!$D$9:$E$9))","v":""},{"$f":"IF('G3'!$D$10=\"\",\"\",CELL(\"contenu\",('G3'!$D$10)))","v":""},{"$f":"IF('G3'!$E$10=\"\",\"\",CELL(\"contenu\",('G3'!$E$10)))","v":""},{"$f":"CELL(\"contenu\",('G3'!$F$9:$G$9))","v":""},{"$f":"IF('G3'!$F$10=\"\",\"\",CELL(\"contenu\",('G3'!$F$10)))","v":""},{"$f":"IF('G3'!$G$10=\"\",\"\",CELL(\"contenu\",('G3'!$G$10)))","v":""},{"$f":"CELL(\"contenu\",('G3'!$H$9:$I$9))","v":""},{"$f":"IF('G3'!$H$10=\"\",\"\",CELL(\"contenu\",('G3'!$H$10)))","v":""},{"$f":"IF('G3'!$I$10=\"\",\"\",CELL(\"contenu\",('G3'!$I$10)))","v":""},{"$f":"CELL(\"contenu\",('G3'!$J$9:$K$9))","v":""},{"$f":"IF('G3'!$J$10=\"\",\"\",CELL(\"contenu\",('G3'!$J$10)))","v":""},{"$f":"IF('G3'!$K$10=\"\",\"\",CELL(\"contenu\",('G3'!$K$10)))","v":""},{"$f":"CELL(\"contenu\",('G3'!$L$9:$M$9))","v":""},{"$f":"IF('G3'!$L$10=\"\",\"\",CELL(\"contenu\",('G3'!$L$10)))","v":""},{"$f":"IF('G3'!$M$10=\"\",\"\",CELL(\"contenu\",('G3'!$M$10)))","v":""},{"$f":"CELL(\"contenu\",('G3'!$N$9:$O$9))","v":""},{"$f":"IF('G3'!$N$10=\"\",\"\",CELL(\"contenu\",('G3'!$N$10)))","v":""},{"$f":"IF('G3'!$O$10=\"\",\"\",CELL(\"contenu\",('G3'!$O$10)))","v":""},{"$f":"CELL(\"contenu\",'G3'!$Q$8)","v":""}]
[{"$f":"CELL(\"contenu\",('G3'!$B$13:$C$16))","v":""},{"$f":"IF(A17=\"\",\"\",'G3'!$A$1)","v":""},{"$f":"IF(Groupes!$M5=\"\",\"\",CELL(\"contenu\",(Groupes!$M5)))","v":""},{"$f":"CELL(\"contenu\",('G3'!$D$15:$E$15))","v":""},{"$f":"IF('G3'!$D$16=\"\",\"\",CELL(\"contenu\",('G3'!$D$16)))","v":""},{"$f":"IF('G3'!$E$16=\"\",\"\",CELL(\"contenu\",('G3'!$E$16)))","v":""},{"$f":"CELL(\"contenu\",('G3'!$F$15:$G$15))","v":""},{"$f":"IF('G3'!$F$16=\"\",\"\",CELL(\"contenu\",('G3'!$F$16)))","v":""},{"$f":"IF('G3'!$G$16=\"\",\"\",CELL(\"contenu\",('G3'!$G$16)))","v":""},{"$f":"CELL(\"contenu\",('G3'!$H$15:$I$15))","v":""},{"$f":"IF('G3'!$H$16=\"\",\"\",CELL(\"contenu\",('G3'!$H$16)))","v":""},{"$f":"IF('G3'!$I$16=\"\",\"\",CELL(\"contenu\",('G3'!$I$16)))","v":""},{"$f":"CELL(\"contenu\",('G3'!$J$15:$K$15))","v":""},{"$f":"IF('G3'!$J$16=\"\",\"\",CELL(\"contenu\",('G3'!$J$16)))","v":""},{"$f":"IF('G3'!$K$16=\"\",\"\",CELL(\"contenu\",('G3'!$K$16)))","v":""},{"$f":"CELL(\"contenu\",('G3'!$L$15:$M$15))","v":""},{"$f":"IF('G3'!$L$16=\"\",\"\",CELL(\"contenu\",('G3'!$L$16)))","v":""},{"$f":"IF('G3'!$M$16=\"\",\"\",CELL(\"contenu\",('G3'!$M$16)))","v":""},{"$f":"CELL(\"contenu\",('G3'!$N$15:$O$15))","v":""},{"$f":"IF('G3'!$N$16=\"\",\"\",CELL(\"contenu\",('G3'!$N$16)))","v":""},{"$f":"IF('G3'!$O$16=\"\",\"\",CELL(\"contenu\",('G3'!$O$16)))","v":""},{"$f":"CELL(\"contenu\",'G3'!$Q$14)","v":""}]
[{"$f":"CELL(\"contenu\",('G3'!$B$19:$C$22))","v":""},{"$f":"IF(A18=\"\",\"\",'G3'!$A$1)","v":""},{"$f":"IF(Groupes!$M6=\"\",\"\",CELL(\"contenu\",(Groupes!$M6)))","v":""},{"$f":"CELL(\"contenu\",('G3'!$D$21:$E$21))","v":""},{"$f":"IF('G3'!$D$22=\"\",\"\",CELL(\"contenu\",('G3'!$D$22)))","v":""},{"$f":"IF('G3'!$E$22=\"\",\"\",CELL(\"contenu\",('G3'!$E$22)))","v":""},{"$f":"CELL(\"contenu\",('G3'!$F$21:$G$21))","v":""},{"$f":"IF('G3'!$F$22=\"\",\"\",CELL(\"contenu\",('G3'!$F$22)))","v":""},{"$f":"IF('G3'!$G$22=\"\",\"\",CELL(\"contenu\",('G3'!$G$22)))","v":""},{"$f":"CELL(\"contenu\",('G3'!$H$21:$I$21))","v":""},{"$f":"IF('G3'!$H$22=\"\",\"\",CELL(\"contenu\",('G3'!$H$22)))","v":""},{"$f":"IF('G3'!$I$22=\"\",\"\",CELL(\"contenu\",('G3'!$I$22)))","v":""},{"$f":"CELL(\"contenu\",('G3'!$J$21:$K$21))","v":""},{"$f":"IF('G3'!$J$22=\"\",\"\",CELL(\"contenu\",('G3'!$J$22)))","v":""},{"$f":"IF('G3'!$K$22=\"\",\"\",CELL(\"contenu\",('G3'!$K$22)))","v":""},{"$f":"CELL(\"contenu\",('G3'!$L$21:$M$21))","v":""},{"$f":"IF('G3'!$L$22=\"\",\"\",CELL(\"contenu\",('G3'!$L$22)))","v":""},{"$f":"IF('G3'!$M$22=\"\",\"\",CELL(\"contenu\",('G3'!$M$22)))","v":""},{"$f":"CELL(\"contenu\",('G3'!$N$21:$O$21))","v":""},{"$f":"IF('G3'!$N$22=\"\",\"\",CELL(\"contenu\",('G3'!$N$22)))","v":""},{"$f":"IF('G3'!$O$22=\"\",\"\",CELL(\"contenu\",('G3'!$O$22)))","v":""},{"$f":"CELL(\"contenu\",'G3'!$Q$20)","v":""}]
[{"$f":"CELL(\"contenu\",('G3'!$B$25:$C$28))","v":""},{"$f":"IF(A19=\"\",\"\",'G3'!$A$1)","v":""},{"$f":"IF(Groupes!$M7=\"\",\"\",CELL(\"contenu\",(Groupes!$M7)))","v":""},{"$f":"CELL(\"contenu\",('G3'!$D$27:$E$27))","v":""},{"$f":"IF('G3'!$D$28=\"\",\"\",CELL(\"contenu\",('G3'!$D$28)))","v":""},{"$f":"IF('G3'!$E$28=\"\",\"\",CELL(\"contenu\",('G3'!$E$28)))","v":""},{"$f":"CELL(\"contenu\",('G3'!$F$27:$G$27))","v":""},{"$f":"IF('G3'!$F$28=\"\",\"\",CELL(\"contenu\",('G3'!$F$28)))","v":""},{"$f":"IF('G3'!$G$28=\"\",\"\",CELL(\"contenu\",('G3'!$G$28)))","v":""},{"$f":"CELL(\"contenu\",('G3'!$H$27:$I$27))","v":""},{"$f":"IF('G3'!$H$28=\"\",\"\",CELL(\"contenu\",('G3'!$H$28)))","v":""},{"$f":"IF('G3'!$I$28=\"\",\"\",CELL(\"contenu\",('G3'!$I$28)))","v":""},{"$f":"CELL(\"contenu\",('G3'!$J$27:$K$27))","v":""},{"$f":"IF('G3'!$J$28=\"\",\"\",CELL(\"contenu\",('G3'!$J$28)))","v":""},{"$f":"IF('G3'!$K$28=\"\",\"\",CELL(\"contenu\",('G3'!$K$28)))","v":""},{"$f":"CELL(\"contenu\",('G3'!$L$27:$M$27))","v":""},{"$f":"IF('G3'!$L$28=\"\",\"\",CELL(\"contenu\",('G3'!$L$28)))","v":""},{"$f":"IF('G3'!$M$28=\"\",\"\",CELL(\"contenu\",('G3'!$M$28)))","v":""},{"$f":"CELL(\"contenu\",('G3'!$N$27:$O$27))","v":""},{"$f":"IF('G3'!$N$28=\"\",\"\",CELL(\"contenu\",('G3'!$N$28)))","v":""},{"$f":"IF('G3'!$O$28=\"\",\"\",CELL(\"contenu\",('G3'!$O$28)))","v":""},{"$f":"CELL(\"contenu\",'G3'!$Q$26)","v":""}]
[{"$f":"CELL(\"contenu\",('G3'!$B$31:$C$34))","v":""},{"$f":"IF(A20=\"\",\"\",'G3'!$A$1)","v":""},{"$f":"IF(Groupes!$M8=\"\",\"\",CELL(\"contenu\",(Groupes!$M8)))","v":""},{"$f":"CELL(\"contenu\",('G3'!$D$33:$E$33))","v":""},{"$f":"IF('G3'!$D$34=\"\",\"\",CELL(\"contenu\",('G3'!$D$34)))","v":""},{"$f":"IF('G3'!$E$34=\"\",\"\",CELL(\"contenu\",('G3'!$E$34)))","v":""},{"$f":"CELL(\"contenu\",('G3'!$F$33:$G$33))","v":""},{"$f":"IF('G3'!$F$34=\"\",\"\",CELL(\"contenu\",('G3'!$F$34)))","v":""},{"$f":"IF('G3'!$G$34=\"\",\"\",CELL(\"contenu\",('G3'!$G$34)))","v":""},{"$f":"CELL(\"contenu\",('G3'!$H$33:$I$33))","v":""},{"$f":"IF('G3'!$H$34=\"\",\"\",CELL(\"contenu\",('G3'!$H$34)))","v":""},{"$f":"IF('G3'!$I$34=\"\",\"\",CELL(\"contenu\",('G3'!$I$34)))","v":""},{"$f":"CELL(\"contenu\",('G3'!$J$33:$K$33))","v":""},{"$f":"IF('G3'!$J$34=\"\",\"\",CELL(\"contenu\",('G3'!$J$34)))","v":""},{"$f":"IF('G3'!$K$34=\"\",\"\",CELL(\"contenu\",('G3'!$K$34)))","v":""},{"$f":"CELL(\"contenu\",('G3'!$L$33:$M$33))","v":""},{"$f":"IF('G3'!$L$34=\"\",\"\",CELL(\"contenu\",('G3'!$L$34)))","v":""},{"$f":"IF('G3'!$M$34=\"\",\"\",CELL(\"contenu\",('G3'!$M$34)))","v":""},{"$f":"CELL(\"contenu\",('G3'!$N$33:$O$33))","v":""},{"$f":"IF('G3'!$N$34=\"\",\"\",CELL(\"contenu\",('G3'!$N$34)))","v":""},{"$f":"IF('G3'!$O$34=\"\",\"\",CELL(\"contenu\",('G3'!$O$34)))","v":""},{"$f":"CELL(\"contenu\",'G3'!$Q$32)","v":""}]
[{"$f":"CELL(\"contenu\",('G4'!$B$1:$C$4))","v":""},{"$f":"IF(A21=\"\",\"\",'G4'!$A$1)","v":""},{"$f":"IF(Groupes!C15=\"\",\"\",CELL(\"contenu\",(Groupes!C15)))","v":""},{"$f":"CELL(\"contenu\",('G4'!$D$3:$E$3))","v":"D_St_EQ_A4"},{"$f":"IF('G4'!$D$4=\"\",\"\",CELL(\"contenu\",('G4'!$D$4)))","v":""},{"$f":"IF('G4'!$E$4=\"\",\"\",CELL(\"contenu\",('G4'!$E$4)))","v":"A"},{"$f":"CELL(\"contenu\",('G4'!$F$3:$G$3))","v":"D_St_PV_A4"},{"$f":"IF('G4'!$F$4=\"\",\"\",CELL(\"contenu\",('G4'!$F$4)))","v":"V"},{"$f":"IF('G4'!$G$4=\"\",\"\",CELL(\"contenu\",('G4'!$G$4)))","v":"A"},{"$f":"CELL(\"contenu\",('G4'!$H$3:$I$3))","v":"D_St_EQ_A4"},{"$f":"IF('G4'!$H$4=\"\",\"\",CELL(\"contenu\",('G4'!$H$4)))","v":""},{"$f":"IF('G4'!$I$4=\"\",\"\",CELL(\"contenu\",('G4'!$I$4)))","v":"A"},{"$f":"CELL(\"contenu\",('G4'!$J$3:$K$3))","v":""},{"$f":"IF('G4'!$J$4=\"\",\"\",CELL(\"contenu\",('G4'!$J$4)))","v":""},{"$f":"IF('G4'!$K$4=\"\",\"\",CELL(\"contenu\",('G4'!$K$4)))","v":""},{"$f":"CELL(\"contenu\",('G4'!$L$3:$M$3))","v":""},{"$f":"IF('G4'!$L$4=\"\",\"\",CELL(\"contenu\",('G4'!$L$4)))","v":""},{"$f":"IF('G4'!$M$4=\"\",\"\",CELL(\"contenu\",('G4'!$M$4)))","v":""},{"$f":"CELL(\"contenu\",('G4'!$N$3:$O$3))","v":""},{"$f":"IF('G4'!$N$4=\"\",\"\",CELL(\"contenu\",('G4'!$N$4)))","v":""},{"$f":"IF('G4'!$O$4=\"\",\"\",CELL(\"contenu\",('G4'!$O$4)))","v":""},{"$f":"CELL(\"contenu\",'G4'!$Q$2)","v":1.2000000000000002}]
[{"$f":"CELL(\"contenu\",('G4'!$B$7:$C$10))","v":""},{"$f":"IF(A22=\"\",\"\",'G4'!$A$1)","v":""},{"$f":"IF(Groupes!C16=\"\",\"\",CELL(\"contenu\",(Groupes!C16)))","v":""},{"$f":"CELL(\"contenu\",('G4'!$D$9:$E$9))","v":""},{"$f":"IF('G4'!$D$10=\"\",\"\",CELL(\"contenu\",('G4'!$D$10)))","v":""},{"$f":"IF('G4'!$E$10=\"\",\"\",CELL(\"contenu\",('G4'!$E$10)))","v":""},{"$f":"CELL(\"contenu\",('G4'!$F$9:$G$9))","v":""},{"$f":"IF('G4'!$F$10=\"\",\"\",CELL(\"contenu\",('G4'!$F$10)))","v":""},{"$f":"IF('G4'!$G$10=\"\",\"\",CELL(\"contenu\",('G4'!$G$10)))","v":""},{"$f":"CELL(\"contenu\",('G4'!$H$9:$I$9))","v":""},{"$f":"IF('G4'!$H$10=\"\",\"\",CELL(\"contenu\",('G4'!$H$10)))","v":""},{"$f":"IF('G4'!$I$10=\"\",\"\",CELL(\"contenu\",('G4'!$I$10)))","v":""},{"$f":"CELL(\"contenu\",('G4'!$J$9:$K$9))","v":""},{"$f":"IF('G4'!$J$10=\"\",\"\",CELL(\"contenu\",('G4'!$J$10)))","v":""},{"$f":"IF('G4'!$K$10=\"\",\"\",CELL(\"contenu\",('G4'!$K$10)))","v":""},{"$f":"CELL(\"contenu\",('G4'!$L$9:$M$9))","v":""},{"$f":"IF('G4'!$L$10=\"\",\"\",CELL(\"contenu\",('G4'!$L$10)))","v":""},{"$f":"IF('G4'!$M$10=\"\",\"\",CELL(\"contenu\",('G4'!$M$10)))","v":""},{"$f":"CELL(\"contenu\",('G4'!$N$9:$O$9))","v":""},{"$f":"IF('G4'!$N$10=\"\",\"\",CELL(\"contenu\",('G4'!$N$10)))","v":""},{"$f":"IF('G4'!$O$10=\"\",\"\",CELL(\"contenu\",('G4'!$O$10)))","v":""},{"$f":"CELL(\"contenu\",'G4'!$Q$8)","v":""}]
[{"$f":"CELL(\"contenu\",('G4'!$B$13:$C$16))","v":""},{"$f":"IF(A23=\"\",\"\",'G4'!$A$1)","v":""},{"$f":"IF(Groupes!C17=\"\",\"\",CELL(\"contenu\",(Groupes!C17)))","v":""},{"$f":"CELL(\"contenu\",('G4'!$D$15:$E$15))","v":""},{"$f":"IF('G4'!$D$16=\"\",\"\",CELL(\"contenu\",('G4'!$D$16)))","v":""},{"$f":"IF('G4'!$E$16=\"\",\"\",CELL(\"contenu\",('G4'!$E$16)))","v":""},{"$f":"CELL(\"contenu\",('G4'!$F$15:$G$15))","v":""},{"$f":"IF('G4'!$F$16=\"\",\"\",CELL(\"contenu\",('G4'!$F$16)))","v":""},{"$f":"IF('G4'!$G$16=\"\",\"\",CELL(\"contenu\",('G4'!$G$16)))","v":""},{"$f":"CELL(\"contenu\",('G4'!$H$15:$I$15))","v":""},{"$f":"IF('G4'!$H$16=\"\",\"\",CELL(\"contenu\",('G4'!$H$16)))","v":""},{"$f":"IF('G4'!$I$16=\"\",\"\",CELL(\"contenu\",('G4'!$I$16)))","v":""},{"$f":"CELL(\"contenu\",('G4'!$J$15:$K$15))","v":""},{"$f":"IF('G4'!$J$16=\"\",\"\",CELL(\"contenu\",('G4'!$J$16)))","v":""},{"$f":"IF('G4'!$K$16=\"\",\"\",CELL(\"contenu\",('G4'!$K$16)))","v":""},{"$f":"CELL(\"contenu\",('G4'!$L$15:$M$15))","v":""},{"$f":"IF('G4'!$L$16=\"\",\"\",CELL(\"contenu\",('G4'!$L$16)))","v":""},{"$f":"IF('G4'!$M$16=\"\",\"\",CELL(\"contenu\",('G4'!$M$16)))","v":""},{"$f":"CELL(\"contenu\",('G4'!$N$15:$O$15))","v":""},{"$f":"IF('G4'!$N$16=\"\",\"\",CELL(\"contenu\",('G4'!$N$16)))","v":""},{"$f":"IF('G4'!$O$16=\"\",\"\",CELL(\"contenu\",('G4'!$O$16)))","v":""},{"$f":"CELL(\"contenu\",'G4'!$Q$14)","v":""}]
[{"$f":"CELL(\"contenu\",('G4'!$B$19:$C$22))","v":""},{"$f":"IF(A24=\"\",\"\",'G4'!$A$1)","v":""},{"$f":"IF(Groupes!C18=\"\",\"\",CELL(\"contenu\",(Groupes!C18)))","v":""},{"$f":"CELL(\"contenu\",('G4'!$D$21:$E$21))","v":""},{"$f":"IF('G4'!$D$22=\"\",\"\",CELL(\"contenu\",('G4'!$D$22)))","v":""},{"$f":"IF('G4'!$E$22=\"\",\"\",CELL(\"contenu\",('G4'!$E$22)))","v":""},{"$f":"CELL(\"contenu\",('G4'!$F$21:$G$21))","v":""},{"$f":"IF('G4'!$F$22=\"\",\"\",CELL(\"contenu\",('G4'!$F$22)))","v":""},{"$f":"IF('G4'!$G$22=\"\",\"\",CELL(\"contenu\",('G4'!$G$22)))","v":""},{"$f":"CELL(\"contenu\",('G4'!$H$21:$I$21))","v":""},{"$f":"IF('G4'!$H$22=\"\",\"\",CELL(\"contenu\",('G4'!$H$22)))","v":""},{"$f":"IF('G4'!$I$22=\"\",\"\",CELL(\"contenu\",('G4'!$I$22)))","v":""},{"$f":"CELL(\"contenu\",('G4'!$J$21:$K$21))","v":""},{"$f":"IF('G4'!$J$22=\"\",\"\",CELL(\"contenu\",('G4'!$J$22)))","v":""},{"$f":"IF('G4'!$K$22=\"\",\"\",CELL(\"contenu\",('G4'!$K$22)))","v":""},{"$f":"CELL(\"contenu\",('G4'!$L$21:$M$21))","v":""},{"$f":"IF('G4'!$L$22=\"\",\"\",CELL(\"contenu\",('G4'!$L$22)))","v":""},{"$f":"IF('G4'!$M$22=\"\",\"\",CELL(\"contenu\",('G4'!$M$22)))","v":""},{"$f":"CELL(\"contenu\",('G4'!$N$21:$O$21))","v":""},{"$f":"IF('G4'!$N$22=\"\",\"\",CELL(\"contenu\",('G4'!$N$22)))","v":""},{"$f":"IF('G4'!$O$22=\"\",\"\",CELL(\"contenu\",('G4'!$O$22)))","v":""},{"$f":"CELL(\"contenu\",'G4'!$Q$20)","v":""}]
[{"$f":"CELL(\"contenu\",('G4'!$B$25:$C$28))","v":""},{"$f":"IF(A25=\"\",\"\",'G4'!$A$1)","v":""},{"$f":"IF(Groupes!C19=\"\",\"\",CELL(\"contenu\",(Groupes!C19)))","v":""},{"$f":"CELL(\"contenu\",('G4'!$D$27:$E$27))","v":""},{"$f":"IF('G4'!$D$28=\"\",\"\",CELL(\"contenu\",('G4'!$D$28)))","v":""},{"$f":"IF('G4'!$E$28=\"\",\"\",CELL(\"contenu\",('G4'!$E$28)))","v":""},{"$f":"CELL(\"contenu\",('G4'!$F$27:$G$27))","v":""},{"$f":"IF('G4'!$F$28=\"\",\"\",CELL(\"contenu\",('G4'!$F$28)))","v":""},{"$f":"IF('G4'!$G$28=\"\",\"\",CELL(\"contenu\",('G4'!$G$28)))","v":""},{"$f":"CELL(\"contenu\",('G4'!$H$27:$I$27))","v":""},{"$f":"IF('G4'!$H$28=\"\",\"\",CELL(\"contenu\",('G4'!$H$28)))","v":""},{"$f":"IF('G4'!$I$28=\"\",\"\",CELL(\"contenu\",('G4'!$I$28)))","v":""},{"$f":"CELL(\"contenu\",('G4'!$J$27:$K$27))","v":""},{"$f":"IF('G4'!$J$28=\"\",\"\",CELL(\"contenu\",('G4'!$J$28)))","v":""},{"$f":"IF('G4'!$K$28=\"\",\"\",CELL(\"contenu\",('G4'!$K$28)))","v":""},{"$f":"CELL(\"contenu\",('G4'!$L$27:$M$27))","v":""},{"$f":"IF('G4'!$L$28=\"\",\"\",CELL(\"contenu\",('G4'!$L$28)))","v":""},{"$f":"IF('G4'!$M$28=\"\",\"\",CELL(\"contenu\",('G4'!$M$28)))","v":""},{"$f":"CELL(\"contenu\",('G4'!$N$27:$O$27))","v":""},{"$f":"IF('G4'!$N$28=\"\",\"\",CELL(\"contenu\",('G4'!$N$28)))","v":""},{"$f":"IF('G4'!$O$28=\"\",\"\",CELL(\"contenu\",('G4'!$O$28)))","v":""},{"$f":"CELL(\"contenu\",'G4'!$Q$26)","v":""}]
[{"$f":"CELL(\"contenu\",('G4'!$B$31:$C$34))","v":""},{"$f":"IF(A26=\"\",\"\",'G4'!$A$1)","v":""},{"$f":"IF(Groupes!C20=\"\",\"\",CELL(\"contenu\",(Groupes!C20)))","v":""},{"$f":"CELL(\"contenu\",('G4'!$D$33:$E$33))","v":""},{"$f":"IF('G4'!$D$34=\"\",\"\",CELL(\"contenu\",('G4'!$D$34)))","v":""},{"$f":"IF('G4'!$E$34=\"\",\"\",CELL(\"contenu\",('G4'!$E$34)))","v":""},{"$f":"CELL(\"contenu\",('G4'!$F$33:$G$33))","v":""},{"$f":"IF('G4'!$F$34=\"\",\"\",CELL(\"contenu\",('G4'!$F$34)))","v":""},{"$f":"IF('G4'!$G$34=\"\",\"\",CELL(\"contenu\",('G4'!$G$34)))","v":""},{"$f":"CELL(\"contenu\",('G4'!$H$33:$I$33))","v":""},{"$f":"IF('G4'!$H$34=\"\",\"\",CELL(\"contenu\",('G4'!$H$34)))","v":""},{"$f":"IF('G4'!$I$34=\"\",\"\",CELL(\"contenu\",('G4'!$I$34)))","v":""},{"$f":"CELL(\"contenu\",('G4'!$J$33:$K$33))","v":""},{"$f":"IF('G4'!$J$34=\"\",\"\",CELL(\"contenu\",('G4'!$J$34)))","v":""},{"$f":"IF('G4'!$K$34=\"\",\"\",CELL(\"contenu\",('G4'!$K$34)))","v":""},{"$f":"CELL(\"contenu\",('G4'!$L$33:$M$33))","v":""},{"$f":"IF('G4'!$L$34=\"\",\"\",CELL(\"contenu\",('G4'!$L$34)))","v":""},{"$f":"IF('G4'!$M$34=\"\",\"\",CELL(\"contenu\",('G4'!$M$34)))","v":""},{"$f":"CELL(\"contenu\",('G4'!$N$33:$O$33))","v":""},{"$f":"IF('G4'!$N$34=\"\",\"\",CELL(\"contenu\",('G4'!$N$34)))","v":""},{"$f":"IF('G4'!$O$34=\"\",\"\",CELL(\"contenu\",('G4'!$O$34)))","v":""},{"$f":"CELL(\"contenu\",'G3'!$Q$32)","v":""}]
[{"$f":"CELL(\"contenu\",('G5'!$B$1:$C$4))","v":""},{"$f":"IF(A27=\"\",\"\",'G5'!$A$1)","v":""},{"$f":"IF(Groupes!$H15=\"\",\"\",CELL(\"contenu\",(Groupes!$H15)))","v":""},{"$f":"CELL(\"contenu\",('G5'!$D$3:$E$3))","v":"D_St_ATR_A2"},{"$f":"IF('G5'!$D$4=\"\",\"\",CELL(\"contenu\",('G5'!$D$4)))","v":""},{"$f":"IF('G5'!$E$4=\"\",\"\",CELL(\"contenu\",('G5'!$E$4)))","v":"A"},{"$f":"CELL(\"contenu\",('G5'!$F$3:$G$3))","v":""},{"$f":"IF('G5'!$F$4=\"\",\"\",CELL(\"contenu\",('G5'!$F$4)))","v":""},{"$f":"IF('G5'!$G$4=\"\",\"\",CELL(\"contenu\",('G5'!$G$4)))","v":""},{"$f":"CELL(\"contenu\",('G5'!$H$3:$I$3))","v":""},{"$f":"IF('G5'!$H$4=\"\",\"\",CELL(\"contenu\",('G5'!$H$4)))","v":""},{"$f":"IF('G5'!$I$4=\"\",\"\",CELL(\"contenu\",('G5'!$I$4)))","v":""},{"$f":"CELL(\"contenu\",('G5'!$J$3:$K$3))","v":""},{"$f":"IF('G5'!$J$4=\"\",\"\",CELL(\"contenu\",('G5'!$J$4)))","v":""},{"$f":"IF('G5'!$K$4=\"\",\"\",CELL(\"contenu\",('G5'!$K$4)))","v":""},{"$f":"CELL(\"contenu\",('G5'!$L$3:$M$3))","v":""},{"$f":"IF('G5'!$L$4=\"\",\"\",CELL(\"contenu\",('G5'!$L$4)))","v":""},{"$f":"IF('G5'!$M$4=\"\",\"\",CELL(\"contenu\",('G5'!$M$4)))","v":""},{"$f":"CELL(\"contenu\",('G5'!$N$3:$O$3))","v":""},{"$f":"IF('G5'!$N$4=\"\",\"\",CELL(\"contenu\",('G5'!$N$4)))","v":""},{"$f":"IF('G5'!$O$4=\"\",\"\",CELL(\"contenu\",('G5'!$O$4)))","v":""},{"$f":"CELL(\"contenu\",'G5'!$Q$2)","v":0.4}]
[{"$f":"CELL(\"contenu\",('G5'!$B$7:$C$10))","v":""},{"$f":"IF(A28=\"\",\"\",'G5'!$A$1)","v":""},{"$f":"IF(Groupes!$H16=\"\",\"\",CELL(\"contenu\",(Groupes!$H16)))","v":""},{"$f":"CELL(\"contenu\",('G5'!$D$9:$E$9))","v":""},{"$f":"IF('G5'!$D$10=\"\",\"\",CELL(\"contenu\",('G5'!$D$10)))","v":""},{"$f":"IF('G5'!$E$10=\"\",\"\",CELL(\"contenu\",('G5'!$E$10)))","v":""},{"$f":"CELL(\"contenu\",('G5'!$F$9:$G$9))","v":""},{"$f":"IF('G5'!$F$10=\"\",\"\",CELL(\"contenu\",('G5'!$F$10)))","v":""},{"$f":"IF('G5'!$G$10=\"\",\"\",CELL(\"contenu\",('G5'!$G$10)))","v":""},{"$f":"CELL(\"contenu\",('G5'!$H$9:$I$9))","v":""},{"$f":"IF('G5'!$H$10=\"\",\"\",CELL(\"contenu\",('G5'!$H$10)))","v":""},{"$f":"IF('G5'!$I$10=\"\",\"\",CELL(\"contenu\",('G5'!$I$10)))","v":""},{"$f":"CELL(\"contenu\",('G5'!$J$9:$K$9))","v":""},{"$f":"IF('G5'!$J$10=\"\",\"\",CELL(\"contenu\",('G5'!$J$10)))","v":""},{"$f":"IF('G5'!$K$10=\"\",\"\",CELL(\"contenu\",('G5'!$K$10)))","v":""},{"$f":"CELL(\"contenu\",('G5'!$L$9:$M$9))","v":""},{"$f":"IF('G5'!$L$10=\"\",\"\",CELL(\"contenu\",('G5'!$L$10)))","v":""},{"$f":"IF('G5'!$M$10=\"\",\"\",CELL(\"contenu\",('G5'!$M$10)))","v":""},{"$f":"CELL(\"contenu\",('G5'!$N$9:$O$9))","v":""},{"$f":"IF('G5'!$N$10=\"\",\"\",CELL(\"contenu\",('G5'!$N$10)))","v":""},{"$f":"IF('G5'!$O$10=\"\",\"\",CELL(\"contenu\",('G5'!$O$10)))","v":""},{"$f":"CELL(\"contenu\",'G5'!$Q$8)","v":""}]
[{"$f":"CELL(\"contenu\",('G5'!$B$13:$C$16))","v":""},{"$f":"IF(A29=\"\",\"\",'G5'!$A$1)","v":""},{"$f":"IF(Groupes!$H17=\"\",\"\",CELL(\"contenu\",(Groupes!$H17)))","v":""},{"$f":"CELL(\"contenu\",('G5'!$D$15:$E$15))","v":""},{"$f":"IF('G5'!$D$16=\"\",\"\",CELL(\"contenu\",('G5'!$D$16)))","v":""},{"$f":"IF('G5'!$E$16=\"\",\"\",CELL(\"contenu\",('G5'!$E$16)))","v":""},{"$f":"CELL(\"contenu\",('G5'!$F$15:$G$15))","v":""},{"$f":"IF('G5'!$F$16=\"\",\"\",CELL(\"contenu\",('G5'!$F$16)))","v":""},{"$f":"IF('G5'!$G$16=\"\",\"\",CELL(\"contenu\",('G5'!$G$16)))","v":""},{"$f":"CELL(\"contenu\",('G5'!$H$15:$I$15))","v":""},{"$f":"IF('G5'!$H$16=\"\",\"\",CELL(\"contenu\",('G5'!$H$16)))","v":""},{"$f":"IF('G5'!$I$16=\"\",\"\",CELL(\"contenu\",('G5'!$I$16)))","v":""},{"$f":"CELL(\"contenu\",('G5'!$J$15:$K$15))","v":""},{"$f":"IF('G5'!$J$16=\"\",\"\",CELL(\"contenu\",('G5'!$J$16)))","v":""},{"$f":"IF('G5'!$K$16=\"\",\"\",CELL(\"contenu\",('G5'!$K$16)))","v":""},{"$f":"CELL(\"contenu\",('G5'!$L$15:$M$15))","v":""},{"$f":"IF('G5'!$L$16=\"\",\"\",CELL(\"contenu\",('G5'!$L$16)))","v":""},{"$f":"IF('G5'!$M$16=\"\",\"\",CELL(\"contenu\",('G5'!$M$16)))","v":""},{"$f":"CELL(\"contenu\",('G5'!$N$15:$O$15))","v":""},{"$f":"IF('G5'!$N$16=\"\",\"\",CELL(\"contenu\",('G5'!$N$16)))","v":""},{"$f":"IF('G5'!$O$16=\"\",\"\",CELL(\"contenu\",('G5'!$O$16)))","v":""},{"$f":"CELL(\"contenu\",'G5'!$Q$14)","v":""}]
[{"$f":"CELL(\"contenu\",('G5'!$B$19:$C$22))","v":""},{"$f":"IF(A30=\"\",\"\",'G5'!$A$1)","v":""},{"$f":"IF(Groupes!$H18=\"\",\"\",CELL(\"contenu\",(Groupes!$H18)))","v":""},{"$f":"CELL(\"contenu\",('G5'!$D$21:$E$21))","v":""},{"$f":"IF('G5'!$D$22=\"\",\"\",CELL(\"contenu\",('G5'!$D$22)))","v":""},{"$f":"IF('G5'!$E$22=\"\",\"\",CELL(\"contenu\",('G5'!$E$22)))","v":""},{"$f":"CELL(\"contenu\",('G5'!$F$21:$G$21))","v":""},{"$f":"IF('G5'!$F$22=\"\",\"\",CELL(\"contenu\",('G5'!$F$22)))","v":""},{"$f":"IF('G5'!$G$22=\"\",\"\",CELL(\"contenu\",('G5'!$G$22)))","v":""},{"$f":"CELL(\"contenu\",('G5'!$H$21:$I$21))","v":""},{"$f":"IF('G5'!$H$22=\"\",\"\",CELL(\"contenu\",('G5'!$H$22)))","v":""},{"$f":"IF('G5'!$I$22=\"\",\"\",CELL(\"contenu\",('G5'!$I$22)))","v":""},{"$f":"CELL(\"contenu\",('G5'!$J$21:$K$21))","v":""},{"$f":"IF('G5'!$J$22=\"\",\"\",CELL(\"contenu\",('G5'!$J$22)))","v":""},{"$f":"IF('G5'!$K$22=\"\",\"\",CELL(\"contenu\",('G5'!$K$22)))","v":""},{"$f":"CELL(\"contenu\",('G5'!$L$21:$M$21))","v":""},{"$f":"IF('G5'!$L$22=\"\",\"\",CELL(\"contenu\",('G5'!$L$22)))","v":""},{"$f":"IF('G5'!$M$22=\"\",\"\",CELL(\"contenu\",('G5'!$M$22)))","v":""},{"$f":"CELL(\"contenu\",('G5'!$N$21:$O$21))","v":""},{"$f":"IF('G5'!$N$22=\"\",\"\",CELL(\"contenu\",('G5'!$N$22)))","v":""},{"$f":"IF('G5'!$O$22=\"\",\"\",CELL(\"contenu\",('G5'!$O$22)))","v":""},{"$f":"CELL(\"contenu\",'G5'!$Q$20)","v":""}]
[{"$f":"CELL(\"contenu\",('G5'!$B$25:$C$28))","v":""},{"$f":"IF(A31=\"\",\"\",'G5'!$A$1)","v":""},{"$f":"IF(Groupes!$H19=\"\",\"\",CELL(\"contenu\",(Groupes!$H19)))","v":""},{"$f":"CELL(\"contenu\",('G5'!$D$27:$E$27))","v":""},{"$f":"IF('G5'!$D$28=\"\",\"\",CELL(\"contenu\",('G5'!$D$28)))","v":""},{"$f":"IF('G5'!$E$28=\"\",\"\",CELL(\"contenu\",('G5'!$E$28)))","v":""},{"$f":"CELL(\"contenu\",('G5'!$F$27:$G$27))","v":""},{"$f":"IF('G5'!$F$28=\"\",\"\",CELL(\"contenu\",('G5'!$F$28)))","v":""},{"$f":"IF('G5'!$G$28=\"\",\"\",CELL(\"contenu\",('G5'!$G$28)))","v":""},{"$f":"CELL(\"contenu\",('G5'!$H$27:$I$27))","v":""},{"$f":"IF('G5'!$H$28=\"\",\"\",CELL(\"contenu\",('G5'!$H$28)))","v":""},{"$f":"IF('G5'!$I$28=\"\",\"\",CELL(\"contenu\",('G5'!$I$28)))","v":""},{"$f":"CELL(\"contenu\",('G5'!$J$27:$K$27))","v":""},{"$f":"IF('G5'!$J$28=\"\",\"\",CELL(\"contenu\",('G5'!$J$28)))","v":""},{"$f":"IF('G5'!$K$28=\"\",\"\",CELL(\"contenu\",('G5'!$K$28)))","v":""},{"$f":"CELL(\"contenu\",('G5'!$L$27:$M$27))","v":""},{"$f":"IF('G5'!$L$28=\"\",\"\",CELL(\"contenu\",('G5'!$L$28)))","v":""},{"$f":"IF('G5'!$M$28=\"\",\"\",CELL(\"contenu\",('G5'!$M$28)))","v":""},{"$f":"CELL(\"contenu\",('G5'!$N$27:$O$27))","v":""},{"$f":"IF('G5'!$N$28=\"\",\"\",CELL(\"contenu\",('G5'!$N$28)))","v":""},{"$f":"IF('G5'!$O$28=\"\",\"\",CELL(\"contenu\",('G5'!$O$28)))","v":""},{"$f":"CELL(\"contenu\",'G5'!$Q$26)","v":""}]
[{"$f":"CELL(\"contenu\",('G5'!$B$31:$C$34))","v":""},{"$f":"IF(A32=\"\",\"\",'G5'!$A$1)","v":""},{"$f":"IF(Groupes!$H20=\"\",\"\",CELL(\"contenu\",(Groupes!$H20)))","v":""},{"$f":"CELL(\"contenu\",('G5'!$D$33:$E$33))","v":""},{"$f":"IF('G5'!$D$34=\"\",\"\",CELL(\"contenu\",('G5'!$D$34)))","v":""},{"$f":"IF('G5'!$E$34=\"\",\"\",CELL(\"contenu\",('G5'!$E$34)))","v":""},{"$f":"CELL(\"contenu\",('G5'!$F$33:$G$33))","v":""},{"$f":"IF('G5'!$F$34=\"\",\"\",CELL(\"contenu\",('G5'!$F$34)))","v":""},{"$f":"IF('G5'!$G$34=\"\",\"\",CELL(\"contenu\",('G5'!$G$34)))","v":""},{"$f":"CELL(\"contenu\",('G5'!$H$33:$I$33))","v":""},{"$f":"IF('G5'!$H$34=\"\",\"\",CELL(\"contenu\",('G5'!$H$34)))","v":""},{"$f":"IF('G5'!$I$34=\"\",\"\",CELL(\"contenu\",('G5'!$I$34)))","v":""},{"$f":"CELL(\"contenu\",('G5'!$J$33:$K$33))","v":""},{"$f":"IF('G5'!$J$34=\"\",\"\",CELL(\"contenu\",('G5'!$J$34)))","v":""},{"$f":"IF('G5'!$K$34=\"\",\"\",CELL(\"contenu\",('G5'!$K$34)))","v":""},{"$f":"CELL(\"contenu\",('G5'!$L$33:$M$33))","v":""},{"$f":"IF('G5'!$L$34=\"\",\"\",CELL(\"contenu\",('G5'!$L$34)))","v":""},{"$f":"IF('G5'!$M$34=\"\",\"\",CELL(\"contenu\",('G5'!$M$34)))","v":""},{"$f":"CELL(\"contenu\",('G5'!$N$33:$O$33))","v":""},{"$f":"IF('G5'!$N$34=\"\",\"\",CELL(\"contenu\",('G5'!$N$34)))","v":""},{"$f":"IF('G5'!$O$34=\"\",\"\",CELL(\"contenu\",('G5'!$O$34)))","v":""},{"$f":"CELL(\"contenu\",'G5'!$Q$32)","v":""}]
[{"$f":"CELL(\"contenu\",('G6'!$B$1:$C$4))","v":""},{"$f":"IF(A33=\"\",\"\",'G6'!$A$1)","v":""},{"$f":"IF(Groupes!$M15=\"\",\"\",CELL(\"contenu\",(Groupes!$M15)))","v":""},{"$f":"CELL(\"contenu\",('G6'!$D$3:$E$3))","v":"D_St_EQ_A1"},{"$f":"IF('G6'!$D$4=\"\",\"\",CELL(\"contenu\",('G6'!$D$4)))","v":""},{"$f":"IF('G6'!$E$4=\"\",\"\",CELL(\"contenu\",('G6'!$E$4)))","v":"A"},{"$f":"CELL(\"contenu\",('G6'!$F$3:$G$3))","v":""},{"$f":"IF('G6'!$F$4=\"\",\"\",CELL(\"contenu\",('G6'!$F$4)))","v":""},{"$f":"IF('G6'!$G$4=\"\",\"\",CELL(\"contenu\",('G6'!$G$4)))","v":""},{"$f":"CELL(\"contenu\",('G6'!$H$3:$I$3))","v":""},{"$f":"IF('G6'!$H$4=\"\",\"\",CELL(\"contenu\",('G6'!$H$4)))","v":""},{"$f":"IF('G6'!$I$4=\"\",\"\",CELL(\"contenu\",('G6'!$I$4)))","v":""},{"$f":"CELL(\"contenu\",('G6'!$J$3:$K$3))","v":""},{"$f":"IF('G6'!$J$4=\"\",\"\",CELL(\"contenu\",('G6'!$J$4)))","v":""},{"$f":"IF('G6'!$K$4=\"\",\"\",CELL(\"contenu\",('G6'!$K$4)))","v":""},{"$f":"CELL(\"contenu\",('G6'!$L$3:$M$3))","v":""},{"$f":"IF('G6'!$L$4=\"\",\"\",CELL(\"contenu\",('G6'!$L$4)))","v":""},{"$f":"IF('G6'!$M$4=\"\",\"\",CELL(\"contenu\",('G6'!$M$4)))","v":""},{"$f":"CELL(\"contenu\",('G6'!$N$3:$O$3))","v":""},{"$f":"IF('G6'!$N$4=\"\",\"\",CELL(\"contenu\",('G6'!$N$4)))","v":""},{"$f":"IF('G6'!$O$4=\"\",\"\",CELL(\"contenu\",('G6'!$O$4)))","v":""},{"$f":"CELL(\"contenu\",'G6'!$Q$2)","v":0.4}]
[{"$f":"CELL(\"contenu\",('G6'!$B$7:$C$10))","v":""},{"$f":"IF(A34=\"\",\"\",'G6'!$A$1)","v":""},{"$f":"IF(Groupes!$M16=\"\",\"\",CELL(\"contenu\",(Groupes!$M16)))","v":""},{"$f":"CELL(\"contenu\",('G6'!$D$9:$E$9))","v":""},{"$f":"IF('G6'!$D$10=\"\",\"\",CELL(\"contenu\",('G6'!$D$10)))","v":""},{"$f":"IF('G6'!$E$10=\"\",\"\",CELL(\"contenu\",('G6'!$E$10)))","v":""},{"$f":"CELL(\"contenu\",('G6'!$F$9:$G$9))","v":""},{"$f":"IF('G6'!$F$10=\"\",\"\",CELL(\"contenu\",('G6'!$F$10)))","v":""},{"$f":"IF('G6'!$G$10=\"\",\"\",CELL(\"contenu\",('G6'!$G$10)))","v":""},{"$f":"CELL(\"contenu\",('G6'!$H$9:$I$9))","v":""},{"$f":"IF('G6'!$H$10=\"\",\"\",CELL(\"contenu\",('G6'!$H$10)))","v":""},{"$f":"IF('G6'!$I$10=\"\",\"\",CELL(\"contenu\",('G6'!$I$10)))","v":""},{"$f":"CELL(\"contenu\",('G6'!$J$9:$K$9))","v":""},{"$f":"IF('G6'!$J$10=\"\",\"\",CELL(\"contenu\",('G6'!$J$10)))","v":""},{"$f":"IF('G6'!$K$10=\"\",\"\",CELL(\"contenu\",('G6'!$K$10)))","v":""},{"$f":"CELL(\"contenu\",('G6'!$L$9:$M$9))","v":""},{"$f":"IF('G6'!$L$10=\"\",\"\",CELL(\"contenu\",('G6'!$L$10)))","v":""},{"$f":"IF('G6'!$M$10=\"\",\"\",CELL(\"contenu\",('G6'!$M$10)))","v":""},{"$f":"CELL(\"contenu\",('G6'!$N$9:$O$9))","v":""},{"$f":"IF('G6'!$N$10=\"\",\"\",CELL(\"contenu\",('G6'!$N$10)))","v":""},{"$f":"IF('G6'!$O$10=\"\",\"\",CELL(\"contenu\",('G6'!$O$10)))","v":""},{"$f":"CELL(\"contenu\",'G6'!$Q$8)","v":""}]
[{"$f":"CELL(\"contenu\",('G6'!$B$13:$C$16))","v":""},{"$f":"IF(A35=\"\",\"\",'G6'!$A$1)","v":""},{"$f":"IF(Groupes!$M17=\"\",\"\",CELL(\"contenu\",(Groupes!$M17)))","v":""},{"$f":"CELL(\"contenu\",('G6'!$D$15:$E$15))","v":""},{"$f":"IF('G6'!$D$16=\"\",\"\",CELL(\"contenu\",('G6'!$D$16)))","v":""},{"$f":"IF('G6'!$E$16=\"\",\"\",CELL(\"contenu\",('G6'!$E$16)))","v":""},{"$f":"CELL(\"contenu\",('G6'!$F$15:$G$15))","v":""},{"$f":"IF('G6'!$F$16=\"\",\"\",CELL(\"contenu\",('G6'!$F$16)))","v":""},{"$f":"IF('G6'!$G$16=\"\",\"\",CELL(\"contenu\",('G6'!$G$16)))","v":""},{"$f":"CELL(\"contenu\",('G6'!$H$15:$I$15))","v":""},{"$f":"IF('G6'!$H$16=\"\",\"\",CELL(\"contenu\",('G6'!$H$16)))","v":""},{"$f":"IF('G6'!$I$16=\"\",\"\",CELL(\"contenu\",('G6'!$I$16)))","v":""},{"$f":"CELL(\"contenu\",('G6'!$J$15:$K$15))","v":""},{"$f":"IF('G6'!$J$16=\"\",\"\",CELL(\"contenu\",('G6'!$J$16)))","v":""},{"$f":"IF('G6'!$K$16=\"\",\"\",CELL(\"contenu\",('G6'!$K$16)))","v":""},{"$f":"CELL(\"contenu\",('G6'!$L$15:$M$15))","v":""},{"$f":"IF('G6'!$L$16=\"\",\"\",CELL(\"contenu\",('G6'!$L$16)))","v":""},{"$f":"IF('G6'!$M$16=\"\",\"\",CELL(\"contenu\",('G6'!$M$16)))","v":""},{"$f":"CELL(\"contenu\",('G6'!$N$15:$O$15))","v":""},{"$f":"IF('G6'!$N$16=\"\",\"\",CELL(\"contenu\",('G6'!$N$16)))","v":""},{"$f":"IF('G6'!$O$16=\"\",\"\",CELL(\"contenu\",('G6'!$O$16)))","v":""},{"$f":"CELL(\"contenu\",'G6'!$Q$14)","v":""}]
[{"$f":"CELL(\"contenu\",('G6'!$B$19:$C$22))","v":""},{"$f":"IF(A36=\"\",\"\",'G6'!$A$1)","v":""},{"$f":"IF(Groupes!$M18=\"\",\"\",CELL(\"contenu\",(Groupes!$M18)))","v":""},{"$f":"CELL(\"contenu\",('G6'!$D$21:$E$21))","v":""},{"$f":"IF('G6'!$D$22=\"\",\"\",CELL(\"contenu\",('G6'!$D$22)))","v":""},{"$f":"IF('G6'!$E$22=\"\",\"\",CELL(\"contenu\",('G6'!$E$22)))","v":""},{"$f":"CELL(\"contenu\",('G6'!$F$21:$G$21))","v":""},{"$f":"IF('G6'!$F$22=\"\",\"\",CELL(\"contenu\",('G6'!$F$22)))","v":""},{"$f":"IF('G6'!$G$22=\"\",\"\",CELL(\"contenu\",('G6'!$G$22)))","v":""},{"$f":"CELL(\"contenu\",('G6'!$H$21:$I$21))","v":""},{"$f":"IF('G6'!$H$22=\"\",\"\",CELL(\"contenu\",('G6'!$H$22)))","v":""},{"$f":"IF('G6'!$I$22=\"\",\"\",CELL(\"contenu\",('G6'!$I$22)))","v":""},{"$f":"CELL(\"contenu\",('G6'!$J$21:$K$21))","v":""},{"$f":"IF('G6'!$J$22=\"\",\"\",CELL(\"contenu\",('G6'!$J$22)))","v":""},{"$f":"IF('G6'!$K$22=\"\",\"\",CELL(\"contenu\",('G6'!$K$22)))","v":""},{"$f":"CELL(\"contenu\",('G6'!$L$21:$M$21))","v":""},{"$f":"IF('G6'!$L$22=\"\",\"\",CELL(\"contenu\",('G6'!$L$22)))","v":""},{"$f":"IF('G6'!$M$22=\"\",\"\",CELL(\"contenu\",('G6'!$M$22)))","v":""},{"$f":"CELL(\"contenu\",('G6'!$N$21:$O$21))","v":""},{"$f":"IF('G6'!$N$22=\"\",\"\",CELL(\"contenu\",('G6'!$N$22)))","v":""},{"$f":"IF('G6'!$O$22=\"\",\"\",CELL(\"contenu\",('G6'!$O$22)))","v":""},{"$f":"CELL(\"contenu\",'G6'!$Q$20)","v":""}]
[{"$f":"CELL(\"contenu\",('G6'!$B$25:$C$28))","v":""},{"$f":"IF(A37=\"\",\"\",'G6'!$A$1)","v":""},{"$f":"IF(Groupes!$M19=\"\",\"\",CELL(\"contenu\",(Groupes!$M19)))","v":""},{"$f":"CELL(\"contenu\",('G6'!$D$27:$E$27))","v":""},{"$f":"IF('G6'!$D$28=\"\",\"\",CELL(\"contenu\",('G6'!$D$28)))","v":""},{"$f":"IF('G6'!$E$28=\"\",\"\",CELL(\"contenu\",('G6'!$E$28)))","v":""},{"$f":"CELL(\"contenu\",('G6'!$F$27:$G$27))","v":""},{"$f":"IF('G6'!$F$28=\"\",\"\",CELL(\"contenu\",('G6'!$F$28)))","v":""},{"$f":"IF('G6'!$G$28=\"\",\"\",CELL(\"contenu\",('G6'!$G$28)))","v":""},{"$f":"CELL(\"contenu\",('G6'!$H$27:$I$27))","v":""},{"$f":"IF('G6'!$H$28=\"\",\"\",CELL(\"contenu\",('G6'!$H$28)))","v":""},{"$f":"IF('G6'!$I$28=\"\",\"\",CELL(\"contenu\",('G6'!$I$28)))","v":""},{"$f":"CELL(\"contenu\",('G6'!$J$27:$K$27))","v":""},{"$f":"IF('G6'!$J$28=\"\",\"\",CELL(\"contenu\",('G6'!$J$28)))","v":""},{"$f":"IF('G6'!$K$28=\"\",\"\",CELL(\"contenu\",('G6'!$K$28)))","v":""},{"$f":"CELL(\"contenu\",('G6'!$L$27:$M$27))","v":""},{"$f":"IF('G6'!$L$28=\"\",\"\",CELL(\"contenu\",('G6'!$L$28)))","v":""},{"$f":"IF('G6'!$M$28=\"\",\"\",CELL(\"contenu\",('G6'!$M$28)))","v":""},{"$f":"CELL(\"contenu\",('G6'!$N$27:$O$27))","v":""},{"$f":"IF('G6'!$N$28=\"\",\"\",CELL(\"contenu\",('G6'!$N$28)))","v":""},{"$f":"IF('G6'!$O$28=\"\",\"\",CELL(\"contenu\",('G6'!$O$28)))","v":""},{"$f":"CELL(\"contenu\",'G6'!$Q$26)","v":""}]
[{"$f":"CELL(\"contenu\",('G6'!$B$31:$C$34))","v":""},{"$f":"IF(A38=\"\",\"\",'G6'!$A$1)","v":""},{"$f":"IF(Groupes!$M20=\"\",\"\",CELL(\"contenu\",(Groupes!$M20)))","v":""},{"$f":"CELL(\"contenu\",('G6'!$D$33:$E$33))","v":""},{"$f":"IF('G6'!$D$34=\"\",\"\",CELL(\"contenu\",('G6'!$D$34)))","v":""},{"$f":"IF('G6'!$E$34=\"\",\"\",CELL(\"contenu\",('G6'!$E$34)))","v":""},{"$f":"CELL(\"contenu\",('G6'!$F$33:$G$33))","v":""},{"$f":"IF('G6'!$F$34=\"\",\"\",CELL(\"contenu\",('G6'!$F$34)))","v":""},{"$f":"IF('G6'!$G$34=\"\",\"\",CELL(\"contenu\",('G6'!$G$34)))","v":""},{"$f":"CELL(\"contenu\",('G6'!$H$33:$I$33))","v":""},{"$f":"IF('G6'!$H$34=\"\",\"\",CELL(\"contenu\",('G6'!$H$34)))","v":""},{"$f":"IF('G6'!$I$34=\"\",\"\",CELL(\"contenu\",('G6'!$I$34)))","v":""},{"$f":"CELL(\"contenu\",('G6'!$J$33:$K$33))","v":""},{"$f":"IF('G6'!$J$34=\"\",\"\",CELL(\"contenu\",('G6'!$J$34)))","v":""},{"$f":"IF('G6'!$K$34=\"\",\"\",CELL(\"contenu\",('G6'!$K$34)))","v":""},{"$f":"CELL(\"contenu\",('G6'!$L$33:$M$33))","v":""},{"$f":"IF('G6'!$L$34=\"\",\"\",CELL(\"contenu\",('G6'!$L$34)))","v":""},{"$f":"IF('G6'!$M$34=\"\",\"\",CELL(\"contenu\",('G6'!$M$34)))","v":""},{"$f":"CELL(\"contenu\",('G6'!$N$33:$O$33))","v":""},{"$f":"IF('G6'!$N$34=\"\",\"\",CELL(\"contenu\",('G6'!$N$34)))","v":""},{"$f":"IF('G6'!$O$34=\"\",\"\",CELL(\"contenu\",('G6'!$O$34)))","v":""},{"$f":"CELL(\"contenu\",'G6'!$Q$32)","v":""}]
[{"$f":"CELL(\"contenu\",('G7'!$B$1:$C$4))","v":""},{"$f":"IF(A39=\"\",\"\",'G7'!$A$1)","v":""},{"$f":"IF(Groupes!$C27=\"\",\"\",CELL(\"contenu\",(Groupes!$C27)))","v":""},{"$f":"CELL(\"contenu\",('G7'!$D$3:$E$3))","v":"D_St_EQ_A4"},{"$f":"IF('G7'!$D$4=\"\",\"\",CELL(\"contenu\",('G7'!$D$4)))","v":""},{"$f":"IF('G7'!$E$4=\"\",\"\",CELL(\"contenu\",('G7'!$E$4)))","v":"A"},{"$f":"CELL(\"contenu\",('G7'!$F$3:$G$3))","v":""},{"$f":"IF('G7'!$F$4=\"\",\"\",CELL(\"contenu\",('G7'!$F$4)))","v":""},{"$f":"IF('G7'!$G$4=\"\",\"\",CELL(\"contenu\",('G7'!$G$4)))","v":""},{"$f":"CELL(\"contenu\",('G7'!$H$3:$I$3))","v":""},{"$f":"IF('G7'!$H$4=\"\",\"\",CELL(\"contenu\",('G7'!$H$4)))","v":""},{"$f":"IF('G7'!$I$4=\"\",\"\",CELL(\"contenu\",('G7'!$I$4)))","v":""},{"$f":"CELL(\"contenu\",('G7'!$J$3:$K$3))","v":""},{"$f":"IF('G7'!$J$4=\"\",\"\",CELL(\"contenu\",('G7'!$J$4)))","v":""},{"$f":"IF('G7'!$K$4=\"\",\"\",CELL(\"contenu\",('G7'!$K$4)))","v":""},{"$f":"CELL(\"contenu\",('G7'!$L$3:$M$3))","v":""},{"$f":"IF('G7'!$L$4=\"\",\"\",CELL(\"contenu\",('G7'!$L$4)))","v":""},{"$f":"IF('G7'!$M$4=\"\",\"\",CELL(\"contenu\",('G7'!$M$4)))","v":""},{"$f":"CELL(\"contenu\",('G7'!$N$3:$O$3))","v":""},{"$f":"IF('G7'!$N$4=\"\",\"\",CELL(\"contenu\",('G7'!$N$4)))","v":""},{"$f":"IF('G7'!$O$4=\"\",\"\",CELL(\"contenu\",('G7'!$O$4)))","v":""},{"$f":"CELL(\"contenu\",'G7'!$Q$2)","v":0.4}]
[{"$f":"CELL(\"contenu\",('G7'!$B$7:$C$10))","v":""},{"$f":"IF(A40=\"\",\"\",'G7'!$A$1)","v":""},{"$f":"IF(Groupes!$C28=\"\",\"\",CELL(\"contenu\",(Groupes!$C28)))","v":""},{"$f":"CELL(\"contenu\",('G7'!$D$9:$E$9))","v":""},{"$f":"IF('G7'!$D$10=\"\",\"\",CELL(\"contenu\",('G7'!$D$10)))","v":""},{"$f":"IF('G7'!$E$10=\"\",\"\",CELL(\"contenu\",('G7'!$E$10)))","v":""},{"$f":"CELL(\"contenu\",('G7'!$F$9:$G$9))","v":""},{"$f":"IF('G7'!$F$10=\"\",\"\",CELL(\"contenu\",('G7'!$F$10)))","v":""},{"$f":"IF('G7'!$G$10=\"\",\"\",CELL(\"contenu\",('G7'!$G$10)))","v":""},{"$f":"CELL(\"contenu\",('G7'!$H$9:$I$9))","v":""},{"$f":"IF('G7'!$H$10=\"\",\"\",CELL(\"contenu\",('G7'!$H$10)))","v":""},{"$f":"IF('G7'!$I$10=\"\",\"\",CELL(\"contenu\",('G7'!$I$10)))","v":""},{"$f":"CELL(\"contenu\",('G7'!$J$9:$K$9))","v":""},{"$f":"IF('G7'!$J$10=\"\",\"\",CELL(\"contenu\",('G7'!$J$10)))","v":""},{"$f":"IF('G7'!$K$10=\"\",\"\",CELL(\"contenu\",('G7'!$K$10)))","v":""},{"$f":"CELL(\"contenu\",('G7'!$L$9:$M$9))","v":""},{"$f":"IF('G7'!$L$10=\"\",\"\",CELL(\"contenu\",('G7'!$L$10)))","v":""},{"$f":"IF('G7'!$M$10=\"\",\"\",CELL(\"contenu\",('G7'!$M$10)))","v":""},{"$f":"CELL(\"contenu\",('G7'!$N$9:$O$9))","v":""},{"$f":"IF('G7'!$N$10=\"\",\"\",CELL(\"contenu\",('G7'!$N$10)))","v":""},{"$f":"IF('G7'!$O$10=\"\",\"\",CELL(\"contenu\",('G7'!$O$10)))","v":""},{"$f":"CELL(\"contenu\",'G7'!$Q$8)","v":""}]
[{"$f":"CELL(\"contenu\",('G7'!$B$13:$C$16))","v":""},{"$f":"IF(A41=\"\",\"\",'G7'!$A$1)","v":""},{"$f":"IF(Groupes!$C29=\"\",\"\",CELL(\"contenu\",(Groupes!$C29)))","v":""},{"$f":"CELL(\"contenu\",('G7'!$D$15:$E$15))","v":""},{"$f":"IF('G7'!$D$16=\"\",\"\",CELL(\"contenu\",('G7'!$D$16)))","v":""},{"$f":"IF('G7'!$E$16=\"\",\"\",CELL(\"contenu\",('G7'!$E$16)))","v":""},{"$f":"CELL(\"contenu\",('G7'!$F$15:$G$15))","v":""},{"$f":"IF('G7'!$F$16=\"\",\"\",CELL(\"contenu\",('G7'!$F$16)))","v":""},{"$f":"IF('G7'!$G$16=\"\",\"\",CELL(\"contenu\",('G7'!$G$16)))","v":""},{"$f":"CELL(\"contenu\",('G7'!$H$15:$I$15))","v":""},{"$f":"IF('G7'!$H$16=\"\",\"\",CELL(\"contenu\",('G7'!$H$16)))","v":""},{"$f":"IF('G7'!$I$16=\"\",\"\",CELL(\"contenu\",('G7'!$I$16)))","v":""},{"$f":"CELL(\"contenu\",('G7'!$J$15:$K$15))","v":""},{"$f":"IF('G7'!$J$16=\"\",\"\",CELL(\"contenu\",('G7'!$J$16)))","v":""},{"$f":"IF('G7'!$K$16=\"\",\"\",CELL(\"contenu\",('G7'!$K$16)))","v":""},{"$f":"CELL(\"contenu\",('G7'!$L$15:$M$15))","v":""},{"$f":"IF('G7'!$L$16=\"\",\"\",CELL(\"contenu\",('G7'!$L$16)))","v":""},{"$f":"IF('G7'!$M$16=\"\",\"\",CELL(\"contenu\",('G7'!$M$16)))","v":""},{"$f":"CELL(\"contenu\",('G7'!$N$15:$O$15))","v":""},{"$f":"IF('G7'!$N$16=\"\",\"\",CELL(\"contenu\",('G7'!$N$16)))","v":""},{"$f":"IF('G7'!$O$16=\"\",\"\",CELL(\"contenu\",('G7'!$O$16)))","v":""},{"$f":"CELL(\"contenu\",'G7'!$Q$14)","v":""}]
[{"$f":"CELL(\"contenu\",('G7'!$B$19:$C$22))","v":""},{"$f":"IF(A42=\"\",\"\",'G7'!$A$1)","v":""},{"$f":"IF(Groupes!$C30=\"\",\"\",CELL(\"contenu\",(Groupes!$C30)))","v":""},{"$f":"CELL(\"contenu\",('G7'!$D$21:$E$21))","v":""},{"$f":"IF('G7'!$D$22=\"\",\"\",CELL(\"contenu\",('G7'!$D$22)))","v":""},{"$f":"IF('G7'!$E$22=\"\",\"\",CELL(\"contenu\",('G7'!$E$22)))","v":""},{"$f":"CELL(\"contenu\",('G7'!$F$21:$G$21))","v":""},{"$f":"IF('G7'!$F$22=\"\",\"\",CELL(\"contenu\",('G7'!$F$22)))","v":""},{"$f":"IF('G7'!$G$22=\"\",\"\",CELL(\"contenu\",('G7'!$G$22)))","v":""},{"$f":"CELL(\"contenu\",('G7'!$H$21:$I$21))","v":""},{"$f":"IF('G7'!$H$22=\"\",\"\",CELL(\"contenu\",('G7'!$H$22)))","v":""},{"$f":"IF('G7'!$I$22=\"\",\"\",CELL(\"contenu\",('G7'!$I$22)))","v":""},{"$f":"CELL(\"contenu\",('G7'!$J$21:$K$21))","v":""},{"$f":"IF('G7'!$J$22=\"\",\"\",CELL(\"contenu\",('G7'!$J$22)))","v":""},{"$f":"IF('G7'!$K$22=\"\",\"\",CELL(\"contenu\",('G7'!$K$22)))","v":""},{"$f":"CELL(\"contenu\",('G7'!$L$21:$M$21))","v":""},{"$f":"IF('G7'!$L$22=\"\",\"\",CELL(\"contenu\",('G7'!$L$22)))","v":""},{"$f":"IF('G7'!$M$22=\"\",\"\",CELL(\"contenu\",('G7'!$M$22)))","v":""},{"$f":"CELL(\"contenu\",('G7'!$N$21:$O$21))","v":""},{"$f":"IF('G7'!$N$22=\"\",\"\",CELL(\"contenu\",('G7'!$N$22)))","v":""},{"$f":"IF('G7'!$O$22=\"\",\"\",CELL(\"contenu\",('G7'!$O$22)))","v":""},{"$f":"CELL(\"contenu\",'G7'!$Q$20)","v":""}]
[{"$f":"CELL(\"contenu\",('G7'!$B$25:$C$28))","v":""},{"$f":"IF(A43=\"\",\"\",'G7'!$A$1)","v":""},{"$f":"IF(Groupes!$C31=\"\",\"\",CELL(\"contenu\",(Groupes!$C31)))","v":""},{"$f":"CELL(\"contenu\",('G7'!$D$27:$E$27))","v":""},{"$f":"IF('G7'!$D$28=\"\",\"\",CELL(\"contenu\",('G7'!$D$28)))","v":""},{"$f":"IF('G7'!$E$28=\"\",\"\",CELL(\"contenu\",('G7'!$E$28)))","v":""},{"$f":"CELL(\"contenu\",('G7'!$F$27:$G$27))","v":""},{"$f":"IF('G7'!$F$28=\"\",\"\",CELL(\"contenu\",('G7'!$F$28)))","v":""},{"$f":"IF('G7'!$G$28=\"\",\"\",CELL(\"contenu\",('G7'!$G$28)))","v":""},{"$f":"CELL(\"contenu\",('G7'!$H$27:$I$27))","v":""},{"$f":"IF('G7'!$H$28=\"\",\"\",CELL(\"contenu\",('G7'!$H$28)))","v":""},{"$f":"IF('G7'!$I$28=\"\",\"\",CELL(\"contenu\",('G7'!$I$28)))","v":""},{"$f":"CELL(\"contenu\",('G7'!$J$27:$K$27))","v":""},{"$f":"IF('G7'!$J$28=\"\",\"\",CELL(\"contenu\",('G7'!$J$28)))","v":""},{"$f":"IF('G7'!$K$28=\"\",\"\",CELL(\"contenu\",('G7'!$K$28)))","v":""},{"$f":"CELL(\"contenu\",('G7'!$L$27:$M$27))","v":""},{"$f":"IF('G7'!$L$28=\"\",\"\",CELL(\"contenu\",('G7'!$L$28)))","v":""},{"$f":"IF('G7'!$M$28=\"\",\"\",CELL(\"contenu\",('G7'!$M$28)))","v":""},{"$f":"CELL(\"contenu\",('G7'!$N$27:$O$27))","v":""},{"$f":"IF('G7'!$N$28=\"\",\"\",CELL(\"contenu\",('G7'!$N$28)))","v":""},{"$f":"IF('G7'!$O$28=\"\",\"\",CELL(\"contenu\",('G7'!$O$28)))","v":""},{"$f":"CELL(\"contenu\",'G7'!$Q$26)","v":""}]
[{"$f":"CELL(\"contenu\",('G7'!$B$31:$C$34))","v":""},{"$f":"IF(A44=\"\",\"\",'G7'!$A$1)","v":""},{"$f":"IF(Groupes!$C32=\"\",\"\",CELL(\"contenu\",(Groupes!$C32)))","v":""},{"$f":"CELL(\"contenu\",('G7'!$D$33:$E$33))","v":""},{"$f":"IF('G7'!$D$34=\"\",\"\",CELL(\"contenu\",('G7'!$D$34)))","v":""},{"$f":"IF('G7'!$E$34=\"\",\"\",CELL(\"contenu\",('G7'!$E$34)))","v":""},{"$f":"CELL(\"contenu\",('G7'!$F$33:$G$33))","v":""},{"$f":"IF('G7'!$F$34=\"\",\"\",CELL(\"contenu\",('G7'!$F$34)))","v":""},{"$f":"IF('G7'!$G$34=\"\",\"\",CELL(\"contenu\",('G7'!$G$34)))","v":""},{"$f":"CELL(\"contenu\",('G7'!$H$33:$I$33))","v":""},{"$f":"IF('G7'!$H$34=\"\",\"\",CELL(\"contenu\",('G7'!$H$34)))","v":""},{"$f":"IF('G7'!$I$34=\"\",\"\",CELL(\"contenu\",('G7'!$I$34)))","v":""},{"$f":"CELL(\"contenu\",('G7'!$J$33:$K$33))","v":""},{"$f":"IF('G7'!$J$34=\"\",\"\",CELL(\"contenu\",('G7'!$J$34)))","v":""},{"$f":"IF('G7'!$K$34=\"\",\"\",CELL(\"contenu\",('G7'!$K$34)))","v":""},{"$f":"CELL(\"contenu\",('G7'!$L$33:$M$33))","v":""},{"$f":"IF('G7'!$L$34=\"\",\"\",CELL(\"contenu\",('G7'!$L$34)))","v":""},{"$f":"IF('G7'!$M$34=\"\",\"\",CELL(\"contenu\",('G7'!$M$34)))","v":""},{"$f":"CELL(\"contenu\",('G7'!$N$33:$O$33))","v":""},{"$f":"IF('G7'!$N$34=\"\",\"\",CELL(\"contenu\",('G7'!$N$34)))","v":""},{"$f":"IF('G7'!$O$34=\"\",\"\",CELL(\"contenu\",('G7'!$O$34)))","v":""},{"$f":"CELL(\"contenu\",'G7'!$Q$32)","v":""}]
[{"$f":"CELL(\"contenu\",('G8'!$B$1:$C$4))","v":""},{"$f":"IF(A45=\"\",\"\",'G8'!$A$1)","v":""},{"$f":"IF(Groupes!$H27=\"\",\"\",CELL(\"contenu\",(Groupes!$H27)))","v":""},{"$f":"CELL(\"contenu\",('G8'!$D$3:$E$3))","v":"D_St_PV_A4"},{"$f":"IF('G8'!$D$4=\"\",\"\",CELL(\"contenu\",('G8'!$D$4)))","v":""},{"$f":"IF('G8'!$E$4=\"\",\"\",CELL(\"contenu\",('G8'!$E$4)))","v":"A"},{"$f":"CELL(\"contenu\",('G8'!$F$3:$G$3))","v":""},{"$f":"IF('G8'!$F$4=\"\",\"\",CELL(\"contenu\",('G8'!$F$4)))","v":""},{"$f":"IF('G8'!$G$4=\"\",\"\",CELL(\"contenu\",('G8'!$G$4)))","v":""},{"$f":"CELL(\"contenu\",('G8'!$H$3:$I$3))","v":""},{"$f":"IF('G8'!$H$4=\"\",\"\",CELL(\"contenu\",('G8'!$H$4)))","v":""},{"$f":"IF('G8'!$I$4=\"\",\"\",CELL(\"contenu\",('G8'!$I$4)))","v":""},{"$f":"CELL(\"contenu\",('G8'!$J$3:$K$3))","v":""},{"$f":"IF('G8'!$J$4=\"\",\"\",CELL(\"contenu\",('G8'!$J$4)))","v":""},{"$f":"IF('G8'!$K$4=\"\",\"\",CELL(\"contenu\",('G8'!$K$4)))","v":""},{"$f":"CELL(\"contenu\",('G8'!$L$3:$M$3))","v":""},{"$f":"IF('G8'!$L$4=\"\",\"\",CELL(\"contenu\",('G8'!$L$4)))","v":""},{"$f":"IF('G8'!$M$4=\"\",\"\",CELL(\"contenu\",('G8'!$M$4)))","v":""},{"$f":"CELL(\"contenu\",('G8'!$N$3:$O$3))","v":""},{"$f":"IF('G8'!$N$4=\"\",\"\",CELL(\"contenu\",('G8'!$N$4)))","v":""},{"$f":"IF('G8'!$O$4=\"\",\"\",CELL(\"contenu\",('G8'!$O$4)))","v":""},{"$f":"CELL(\"contenu\",'G8'!$Q$2)","v":0.4}]
[{"$f":"CELL(\"contenu\",('G8'!$B$7:$C$10))","v":""},{"$f":"IF(A46=\"\",\"\",'G8'!$A$1)","v":""},{"$f":"IF(Groupes!$H28=\"\",\"\",CELL(\"contenu\",(Groupes!$H28)))","v":""},{"$f":"CELL(\"contenu\",('G8'!$D$9:$E$9))","v":""},{"$f":"IF('G8'!$D$10=\"\",\"\",CELL(\"contenu\",('G8'!$D$10)))","v":""},{"$f":"IF('G8'!$E$10=\"\",\"\",CELL(\"contenu\",('G8'!$E$10)))","v":""},{"$f":"CELL(\"contenu\",('G8'!$F$9:$G$9))","v":""},{"$f":"IF('G8'!$F$10=\"\",\"\",CELL(\"contenu\",('G8'!$F$10)))","v":""},{"$f":"IF('G8'!$G$10=\"\",\"\",CELL(\"contenu\",('G8'!$G$10)))","v":""},{"$f":"CELL(\"contenu\",('G8'!$H$9:$I$9))","v":""},{"$f":"IF('G8'!$H$10=\"\",\"\",CELL(\"contenu\",('G8'!$H$10)))","v":""},{"$f":"IF('G8'!$I$10=\"\",\"\",CELL(\"contenu\",('G8'!$I$10)))","v":""},{"$f":"CELL(\"contenu\",('G8'!$J$9:$K$9))","v":""},{"$f":"IF('G8'!$J$10=\"\",\"\",CELL(\"contenu\",('G8'!$J$10)))","v":""},{"$f":"IF('G8'!$K$10=\"\",\"\",CELL(\"contenu\",('G8'!$K$10)))","v":""},{"$f":"CELL(\"contenu\",('G8'!$L$9:$M$9))","v":""},{"$f":"IF('G8'!$L$10=\"\",\"\",CELL(\"contenu\",('G8'!$L$10)))","v":""},{"$f":"IF('G8'!$M$10=\"\",\"\",CELL(\"contenu\",('G8'!$M$10)))","v":""},{"$f":"CELL(\"contenu\",('G8'!$N$9:$O$9))","v":""},{"$f":"IF('G8'!$N$10=\"\",\"\",CELL(\"contenu\",('G8'!$N$10)))","v":""},{"$f":"IF('G8'!$O$10=\"\",\"\",CELL(\"contenu\",('G8'!$O$10)))","v":""},{"$f":"CELL(\"contenu\",'G8'!$Q$8)","v":""}]
[{"$f":"CELL(\"contenu\",('G8'!$B$13:$C$16))","v":""},{"$f":"IF(A47=\"\",\"\",'G8'!$A$1)","v":""},{"$f":"IF(Groupes!$H29=\"\",\"\",CELL(\"contenu\",(Groupes!$H29)))","v":""},{"$f":"CELL(\"contenu\",('G8'!$D$15:$E$15))","v":""},{"$f":"IF('G8'!$D$16=\"\",\"\",CELL(\"contenu\",('G8'!$D$16)))","v":""},{"$f":"IF('G8'!$E$16=\"\",\"\",CELL(\"contenu\",('G8'!$E$16)))","v":""},{"$f":"CELL(\"contenu\",('G8'!$F$15:$G$15))","v":""},{"$f":"IF('G8'!$F$16=\"\",\"\",CELL(\"contenu\",('G8'!$F$16)))","v":""},{"$f":"IF('G8'!$G$16=\"\",\"\",CELL(\"contenu\",('G8'!$G$16)))","v":""},{"$f":"CELL(\"contenu\",('G8'!$H$15:$I$15))","v":""},{"$f":"IF('G8'!$H$16=\"\",\"\",CELL(\"contenu\",('G8'!$H$16)))","v":""},{"$f":"IF('G8'!$I$16=\"\",\"\",CELL(\"contenu\",('G8'!$I$16)))","v":""},{"$f":"CELL(\"contenu\",('G8'!$J$15:$K$15))","v":""},{"$f":"IF('G8'!$J$16=\"\",\"\",CELL(\"contenu\",('G8'!$J$16)))","v":""},{"$f":"IF('G8'!$K$16=\"\",\"\",CELL(\"contenu\",('G8'!$K$16)))","v":""},{"$f":"CELL(\"contenu\",('G8'!$L$15:$M$15))","v":""},{"$f":"IF('G8'!$L$16=\"\",\"\",CELL(\"contenu\",('G8'!$L$16)))","v":""},{"$f":"IF('G8'!$M$16=\"\",\"\",CELL(\"contenu\",('G8'!$M$16)))","v":""},{"$f":"CELL(\"contenu\",('G8'!$N$15:$O$15))","v":""},{"$f":"IF('G8'!$N$16=\"\",\"\",CELL(\"contenu\",('G8'!$N$16)))","v":""},{"$f":"IF('G8'!$O$16=\"\",\"\",CELL(\"contenu\",('G8'!$O$16)))","v":""},{"$f":"CELL(\"contenu\",'G8'!$Q$14)","v":""}]
[{"$f":"CELL(\"contenu\",('G8'!$B$19:$C$22))","v":""},{"$f":"IF(A48=\"\",\"\",'G8'!$A$1)","v":""},{"$f":"IF(Groupes!$H30=\"\",\"\",CELL(\"contenu\",(Groupes!$H30)))","v":""},{"$f":"CELL(\"contenu\",('G8'!$D$21:$E$21))","v":""},{"$f":"IF('G8'!$D$22=\"\",\"\",CELL(\"contenu\",('G8'!$D$22)))","v":""},{"$f":"IF('G8'!$E$22=\"\",\"\",CELL(\"contenu\",('G8'!$E$22)))","v":""},{"$f":"CELL(\"contenu\",('G8'!$F$21:$G$21))","v":""},{"$f":"IF('G8'!$F$22=\"\",\"\",CELL(\"contenu\",('G8'!$F$22)))","v":""},{"$f":"IF('G8'!$G$22=\"\",\"\",CELL(\"contenu\",('G8'!$G$22)))","v":""},{"$f":"CELL(\"contenu\",('G8'!$H$21:$I$21))","v":""},{"$f":"IF('G8'!$H$22=\"\",\"\",CELL(\"contenu\",('G8'!$H$22)))","v":""},{"$f":"IF('G8'!$I$22=\"\",\"\",CELL(\"contenu\",('G8'!$I$22)))","v":""},{"$f":"CELL(\"contenu\",('G8'!$J$21:$K$21))","v":""},{"$f":"IF('G8'!$J$22=\"\",\"\",CELL(\"contenu\",('G8'!$J$22)))","v":""},{"$f":"IF('G8'!$K$22=\"\",\"\",CELL(\"contenu\",('G8'!$K$22)))","v":""},{"$f":"CELL(\"contenu\",('G8'!$L$21:$M$21))","v":""},{"$f":"IF('G8'!$L$22=\"\",\"\",CELL(\"contenu\",('G8'!$L$22)))","v":""},{"$f":"IF('G8'!$M$22=\"\",\"\",CELL(\"contenu\",('G8'!$M$22)))","v":""},{"$f":"CELL(\"contenu\",('G8'!$N$21:$O$21))","v":""},{"$f":"IF('G8'!$N$22=\"\",\"\",CELL(\"contenu\",('G8'!$N$22)))","v":""},{"$f":"IF('G8'!$O$22=\"\",\"\",CELL(\"contenu\",('G8'!$O$22)))","v":""},{"$f":"CELL(\"contenu\",'G8'!$Q$20)","v":""}]
[{"$f":"CELL(\"contenu\",('G8'!$B$25:$C$28))","v":""},{"$f":"IF(A49=\"\",\"\",'G8'!$A$1)","v":""},{"$f":"IF(Groupes!$H31=\"\",\"\",CELL(\"contenu\",(Groupes!$H31)))","v":""},{"$f":"CELL(\"contenu\",('G8'!$D$27:$E$27))","v":""},{"$f":"IF('G8'!$D$28=\"\",\"\",CELL(\"contenu\",('G8'!$D$28)))","v":""},{"$f":"IF('G8'!$E$28=\"\",\"\",CELL(\"contenu\",('G8'!$E$28)))","v":""},{"$f":"CELL(\"contenu\",('G8'!$F$27:$G$27))","v":""},{"$f":"IF('G8'!$F$28=\"\",\"\",CELL(\"contenu\",('G8'!$F$28)))","v":""},{"$f":"IF('G8'!$G$28=\"\",\"\",CELL(\"contenu\",('G8'!$G$28)))","v":""},{"$f":"CELL(\"contenu\",('G8'!$H$27:$I$27))","v":""},{"$f":"IF('G8'!$H$28=\"\",\"\",CELL(\"contenu\",('G8'!$H$28)))","v":""},{"$f":"IF('G8'!$I$28=\"\",\"\",CELL(\"contenu\",('G8'!$I$28)))","v":""},{"$f":"CELL(\"contenu\",('G8'!$J$27:$K$27))","v":""},{"$f":"IF('G8'!$J$28=\"\",\"\",CELL(\"contenu\",('G8'!$J$28)))","v":""},{"$f":"IF('G8'!$K$28=\"\",\"\",CELL(\"contenu\",('G8'!$K$28)))","v":""},{"$f":"CELL(\"contenu\",('G8'!$L$27:$M$27))","v":""},{"$f":"IF('G8'!$L$28=\"\",\"\",CELL(\"contenu\",('G8'!$L$28)))","v":""},{"$f":"IF('G8'!$M$28=\"\",\"\",CELL(\"contenu\",('G8'!$M$28)))","v":""},{"$f":"CELL(\"contenu\",('G8'!$N$27:$O$27))","v":""},{"$f":"IF('G8'!$N$28=\"\",\"\",CELL(\"contenu\",('G8'!$N$28)))","v":""},{"$f":"IF('G8'!$O$28=\"\",\"\",CELL(\"contenu\",('G8'!$O$28)))","v":""},{"$f":"CELL(\"contenu\",'G8'!$Q$26)","v":""}]
[{"$f":"CELL(\"contenu\",('G8'!$B$31:$C$34))","v":""},{"$f":"IF(A50=\"\",\"\",'G8'!$A$1)","v":""},{"$f":"IF(Groupes!$H32=\"\",\"\",CELL(\"contenu\",(Groupes!$H32)))","v":""},{"$f":"CELL(\"contenu\",('G8'!$D$33:$E$33))","v":""},{"$f":"IF('G8'!$D$34=\"\",\"\",CELL(\"contenu\",('G8'!$D$34)))","v":""},{"$f":"IF('G8'!$E$34=\"\",\"\",CELL(\"contenu\",('G8'!$E$34)))","v":""},{"$f":"CELL(\"contenu\",('G8'!$F$33:$G$33))","v":""},{"$f":"IF('G8'!$F$34=\"\",\"\",CELL(\"contenu\",('G8'!$F$34)))","v":""},{"$f":"IF('G8'!$G$34=\"\",\"\",CELL(\"contenu\",('G8'!$G$34)))","v":""},{"$f":"CELL(\"contenu\",('G8'!$H$33:$I$33))","v":""},{"$f":"IF('G8'!$H$34=\"\",\"\",CELL(\"contenu\",('G8'!$H$34)))","v":""},{"$f":"IF('G8'!$I$34=\"\",\"\",CELL(\"contenu\",('G8'!$I$34)))","v":""},{"$f":"CELL(\"contenu\",('G8'!$J$33:$K$33))","v":""},{"$f":"IF('G8'!$J$34=\"\",\"\",CELL(\"contenu\",('G8'!$J$34)))","v":""},{"$f":"IF('G8'!$K$34=\"\",\"\",CELL(\"contenu\",('G8'!$K$34)))","v":""},{"$f":"CELL(\"contenu\",('G8'!$L$33:$M$33))","v":""},{"$f":"IF('G8'!$L$34=\"\",\"\",CELL(\"contenu\",('G8'!$L$34)))","v":""},{"$f":"IF('G8'!$M$34=\"\",\"\",CELL(\"contenu\",('G8'!$M$34)))","v":""},{"$f":"CELL(\"contenu\",('G8'!$N$33:$O$33))","v":""},{"$f":"IF('G8'!$N$34=\"\",\"\",CELL(\"contenu\",('G8'!$N$34)))","v":""},{"$f":"IF('G8'!$O$34=\"\",\"\",CELL(\"contenu\",('G8'!$O$34)))","v":""},{"$f":"CELL(\"contenu\",'G8'!$Q$32)","v":""}]
[{"$f":"CELL(\"contenu\",('G9'!$B$1:$C$4))","v":""},{"$f":"IF(A51=\"\",\"\",'G9'!$A$1)","v":""},{"$f":"IF(Groupes!$M27=\"\",\"\",CELL(\"contenu\",(Groupes!$M27)))","v":""},{"$f":"CELL(\"contenu\",('G9'!$D$3:$E$3))","v":"D_St_ATR_A4"},{"$f":"IF('G9'!$D$4=\"\",\"\",CELL(\"contenu\",('G9'!$D$4)))","v":""},{"$f":"IF('G9'!$E$4=\"\",\"\",CELL(\"contenu\",('G9'!$E$4)))","v":"A"},{"$f":"CELL(\"contenu\",('G9'!$F$3:$G$3))","v":""},{"$f":"IF('G9'!$F$4=\"\",\"\",CELL(\"contenu\",('G9'!$F$4)))","v":""},{"$f":"IF('G9'!$G$4=\"\",\"\",CELL(\"contenu\",('G9'!$G$4)))","v":""},{"$f":"CELL(\"contenu\",('G9'!$H$3:$I$3))","v":""},{"$f":"IF('G9'!$H$4=\"\",\"\",CELL(\"contenu\",('G9'!$H$4)))","v":""},{"$f":"IF('G9'!$I$4=\"\",\"\",CELL(\"contenu\",('G9'!$I$4)))","v":""},{"$f":"CELL(\"contenu\",('G9'!$J$3:$K$3))","v":""},{"$f":"IF('G9'!$J$4=\"\",\"\",CELL(\"contenu\",('G9'!$J$4)))","v":""},{"$f":"IF('G9'!$K$4=\"\",\"\",CELL(\"contenu\",('G9'!$K$4)))","v":""},{"$f":"CELL(\"contenu\",('G9'!$L$3:$M$3))","v":""},{"$f":"IF('G9'!$L$4=\"\",\"\",CELL(\"contenu\",('G9'!$L$4)))","v":""},{"$f":"IF('G9'!$M$4=\"\",\"\",CELL(\"contenu\",('G9'!$M$4)))","v":""},{"$f":"CELL(\"contenu\",('G9'!$N$3:$O$3))","v":""},{"$f":"IF('G9'!$N$4=\"\",\"\",CELL(\"contenu\",('G9'!$N$4)))","v":""},{"$f":"IF('G9'!$O$4=\"\",\"\",CELL(\"contenu\",('G9'!$O$4)))","v":""},{"$f":"CELL(\"contenu\",'G9'!$Q$2)","v":0.4}]
[{"$f":"CELL(\"contenu\",('G9'!$B$7:$C$10))","v":""},{"$f":"IF(A52=\"\",\"\",'G9'!$A$1)","v":""},{"$f":"IF(Groupes!$M28=\"\",\"\",CELL(\"contenu\",(Groupes!$M28)))","v":""},{"$f":"CELL(\"contenu\",('G9'!$D$9:$E$9))","v":""},{"$f":"IF('G9'!$D$10=\"\",\"\",CELL(\"contenu\",('G9'!$D$10)))","v":""},{"$f":"IF('G9'!$E$10=\"\",\"\",CELL(\"contenu\",('G9'!$E$10)))","v":""},{"$f":"CELL(\"contenu\",('G9'!$F$9:$G$9))","v":""},{"$f":"IF('G9'!$F$10=\"\",\"\",CELL(\"contenu\",('G9'!$F$10)))","v":""},{"$f":"IF('G9'!$G$10=\"\",\"\",CELL(\"contenu\",('G9'!$G$10)))","v":""},{"$f":"CELL(\"contenu\",('G9'!$H$9:$I$9))","v":""},{"$f":"IF('G9'!$H$10=\"\",\"\",CELL(\"contenu\",('G9'!$H$10)))","v":""},{"$f":"IF('G9'!$I$10=\"\",\"\",CELL(\"contenu\",('G9'!$I$10)))","v":""},{"$f":"CELL(\"contenu\",('G9'!$J$9:$K$9))","v":""},{"$f":"IF('G9'!$J$10=\"\",\"\",CELL(\"contenu\",('G9'!$J$10)))","v":""},{"$f":"IF('G9'!$K$10=\"\",\"\",CELL(\"contenu\",('G9'!$K$10)))","v":""},{"$f":"CELL(\"contenu\",('G9'!$L$9:$M$9))","v":""},{"$f":"IF('G9'!$L$10=\"\",\"\",CELL(\"contenu\",('G9'!$L$10)))","v":""},{"$f":"IF('G9'!$M$10=\"\",\"\",CELL(\"contenu\",('G9'!$M$10)))","v":""},{"$f":"CELL(\"contenu\",('G9'!$N$9:$O$9))","v":""},{"$f":"IF('G9'!$N$10=\"\",\"\",CELL(\"contenu\",('G9'!$N$10)))","v":""},{"$f":"IF('G9'!$O$10=\"\",\"\",CELL(\"contenu\",('G9'!$O$10)))","v":""},{"$f":"CELL(\"contenu\",'G9'!$Q$8)","v":""}]
[{"$f":"CELL(\"contenu\",('G9'!$B$13:$C$16))","v":""},{"$f":"IF(A53=\"\",\"\",'G9'!$A$1)","v":""},{"$f":"IF(Groupes!$M29=\"\",\"\",CELL(\"contenu\",(Groupes!$M29)))","v":""},{"$f":"CELL(\"contenu\",('G9'!$D$15:$E$15))","v":""},{"$f":"IF('G9'!$D$16=\"\",\"\",CELL(\"contenu\",('G9'!$D$16)))","v":""},{"$f":"IF('G9'!$E$16=\"\",\"\",CELL(\"contenu\",('G9'!$E$16)))","v":""},{"$f":"CELL(\"contenu\",('G9'!$F$15:$G$15))","v":""},{"$f":"IF('G9'!$F$16=\"\",\"\",CELL(\"contenu\",('G9'!$F$16)))","v":""},{"$f":"IF('G9'!$G$16=\"\",\"\",CELL(\"contenu\",('G9'!$G$16)))","v":""},{"$f":"CELL(\"contenu\",('G9'!$H$15:$I$15))","v":""},{"$f":"IF('G9'!$H$16=\"\",\"\",CELL(\"contenu\",('G9'!$H$16)))","v":""},{"$f":"IF('G9'!$I$16=\"\",\"\",CELL(\"contenu\",('G9'!$I$16)))","v":""},{"$f":"CELL(\"contenu\",('G9'!$J$15:$K$15))","v":""},{"$f":"IF('G9'!$J$16=\"\",\"\",CELL(\"contenu\",('G9'!$J$16)))","v":""},{"$f":"IF('G9'!$K$16=\"\",\"\",CELL(\"contenu\",('G9'!$K$16)))","v":""},{"$f":"CELL(\"contenu\",('G9'!$L$15:$M$15))","v":""},{"$f":"IF('G9'!$L$16=\"\",\"\",CELL(\"contenu\",('G9'!$L$16)))","v":""},{"$f":"IF('G9'!$M$16=\"\",\"\",CELL(\"contenu\",('G9'!$M$16)))","v":""},{"$f":"CELL(\"contenu\",('G9'!$N$15:$O$15))","v":""},{"$f":"IF('G9'!$N$16=\"\",\"\",CELL(\"contenu\",('G9'!$N$16)))","v":""},{"$f":"IF('G9'!$O$16=\"\",\"\",CELL(\"contenu\",('G9'!$O$16)))","v":""},{"$f":"CELL(\"contenu\",'G9'!$Q$14)","v":""}]
[{"$f":"CELL(\"contenu\",('G9'!$B$19:$C$22))","v":""},{"$f":"IF(A54=\"\",\"\",'G9'!$A$1)","v":""},{"$f":"IF(Groupes!$M30=\"\",\"\",CELL(\"contenu\",(Groupes!$M30)))","v":""},{"$f":"CELL(\"contenu\",('G9'!$D$21:$E$21))","v":""},{"$f":"IF('G9'!$D$22=\"\",\"\",CELL(\"contenu\",('G9'!$D$22)))","v":""},{"$f":"IF('G9'!$E$22=\"\",\"\",CELL(\"contenu\",('G9'!$E$22)))","v":""},{"$f":"CELL(\"contenu\",('G9'!$F$21:$G$21))","v":""},{"$f":"IF('G9'!$F$22=\"\",\"\",CELL(\"contenu\",('G9'!$F$22)))","v":""},{"$f":"IF('G9'!$G$22=\"\",\"\",CELL(\"contenu\",('G9'!$G$22)))","v":""},{"$f":"CELL(\"contenu\",('G9'!$H$21:$I$21))","v":""},{"$f":"IF('G9'!$H$22=\"\",\"\",CELL(\"contenu\",('G9'!$H$22)))","v":""},{"$f":"IF('G9'!$I$22=\"\",\"\",CELL(\"contenu\",('G9'!$I$22)))","v":""},{"$f":"CELL(\"contenu\",('G9'!$J$21:$K$21))","v":""},{"$f":"IF('G9'!$J$22=\"\",\"\",CELL(\"contenu\",('G9'!$J$22)))","v":""},{"$f":"IF('G9'!$K$22=\"\",\"\",CELL(\"contenu\",('G9'!$K$22)))","v":""},{"$f":"CELL(\"contenu\",('G9'!$L$21:$M$21))","v":""},{"$f":"IF('G9'!$L$22=\"\",\"\",CELL(\"contenu\",('G9'!$L$22)))","v":""},{"$f":"IF('G9'!$M$22=\"\",\"\",CELL(\"contenu\",('G9'!$M$22)))","v":""},{"$f":"CELL(\"contenu\",('G9'!$N$21:$O$21))","v":""},{"$f":"IF('G9'!$N$22=\"\",\"\",CELL(\"contenu\",('G9'!$N$22)))","v":""},{"$f":"IF('G9'!$O$22=\"\",\"\",CELL(\"contenu\",('G9'!$O$22)))","v":""},{"$f":"CELL(\"contenu\",'G9'!$Q$20)","v":""}]
[{"$f":"CELL(\"contenu\",('G9'!$B$25:$C$28))","v":""},{"$f":"IF(A55=\"\",\"\",'G9'!$A$1)","v":""},{"$f":"IF(Groupes!$M31=\"\",\"\",CELL(\"contenu\",(Groupes!$M31)))","v":""},{"$f":"CELL(\"contenu\",('G9'!$D$27:$E$27))","v":""},{"$f":"IF('G9'!$D$28=\"\",\"\",CELL(\"contenu\",('G9'!$D$28)))","v":""},{"$f":"IF('G9'!$E$28=\"\",\"\",CELL(\"contenu\",('G9'!$E$28)))","v":""},{"$f":"CELL(\"contenu\",('G9'!$F$27:$G$27))","v":""},{"$f":"IF('G9'!$F$28=\"\",\"\",CELL(\"contenu\",('G9'!$F$28)))","v":""},{"$f":"IF('G9'!$G$28=\"\",\"\",CELL(\"contenu\",('G9'!$G$28)))","v":""},{"$f":"CELL(\"contenu\",('G9'!$H$27:$I$27))","v":""},{"$f":"IF('G9'!$H$28=\"\",\"\",CELL(\"contenu\",('G9'!$H$28)))","v":""},{"$f":"IF('G9'!$I$28=\"\",\"\",CELL(\"contenu\",('G9'!$I$28)))","v":""},{"$f":"CELL(\"contenu\",('G9'!$J$27:$K$27))","v":""},{"$f":"IF('G9'!$J$28=\"\",\"\",CELL(\"contenu\",('G9'!$J$28)))","v":""},{"$f":"IF('G9'!$K$28=\"\",\"\",CELL(\"contenu\",('G9'!$K$28)))","v":""},{"$f":"CELL(\"contenu\",('G9'!$L$27:$M$27))","v":""},{"$f":"IF('G9'!$L$28=\"\",\"\",CELL(\"contenu\",('G9'!$L$28)))","v":""},{"$f":"IF('G9'!$M$28=\"\",\"\",CELL(\"contenu\",('G9'!$M$28)))","v":""},{"$f":"CELL(\"contenu\",('G9'!$N$27:$O$27))","v":""},{"$f":"IF('G9'!$N$28=\"\",\"\",CELL(\"contenu\",('G9'!$N$28)))","v":""},{"$f":"IF('G9'!$O$28=\"\",\"\",CELL(\"contenu\",('G9'!$O$28)))","v":""},{"$f":"CELL(\"contenu\",'G9'!$Q$26)","v":""}]
[{"$f":"CELL(\"contenu\",('G9'!$B$31:$C$34))","v":""},{"$f":"IF(A56=\"\",\"\",'G9'!$A$1)","v":""},{"$f":"IF(Groupes!$M32=\"\",\"\",CELL(\"contenu\",(Groupes!$M32)))","v":""},{"$f":"CELL(\"contenu\",('G9'!$D$33:$E$33))","v":""},{"$f":"IF('G9'!$D$34=\"\",\"\",CELL(\"contenu\",('G9'!$D$34)))","v":""},{"$f":"IF('G9'!$E$34=\"\",\"\",CELL(\"contenu\",('G9'!$E$34)))","v":""},{"$f":"CELL(\"contenu\",('G9'!$F$33:$G$33))","v":""},{"$f":"IF('G9'!$F$34=\"\",\"\",CELL(\"contenu\",('G9'!$F$34)))","v":""},{"$f":"IF('G9'!$G$34=\"\",\"\",CELL(\"contenu\",('G9'!$G$34)))","v":""},{"$f":"CELL(\"contenu\",('G9'!$H$33:$I$33))","v":""},{"$f":"IF('G9'!$H$34=\"\",\"\",CELL(\"contenu\",('G9'!$H$34)))","v":""},{"$f":"IF('G9'!$I$34=\"\",\"\",CELL(\"contenu\",('G9'!$I$34)))","v":""},{"$f":"CELL(\"contenu\",('G9'!$J$33:$K$33))","v":""},{"$f":"IF('G9'!$J$34=\"\",\"\",CELL(\"contenu\",('G9'!$J$34)))","v":""},{"$f":"IF('G9'!$K$34=\"\",\"\",CELL(\"contenu\",('G9'!$K$34)))","v":""},{"$f":"CELL(\"contenu\",('G9'!$L$33:$M$33))","v":""},{"$f":"IF('G9'!$L$34=\"\",\"\",CELL(\"contenu\",('G9'!$L$34)))","v":""},{"$f":"IF('G9'!$M$34=\"\",\"\",CELL(\"contenu\",('G9'!$M$34)))","v":""},{"$f":"CELL(\"contenu\",('G9'!$N$33:$O$33))","v":""},{"$f":"IF('G9'!$N$34=\"\",\"\",CELL(\"contenu\",('G9'!$N$34)))","v":""},{"$f":"IF('G9'!$O$34=\"\",\"\",CELL(\"contenu\",('G9'!$O$34)))","v":""},{"$f":"CELL(\"contenu\",'G9'!$Q$32)","v":""}]
[]
[]
[]
[]
["Groupe 1","Groupe 2","Groupe 3","Groupe 4","Groupe 5","Groupe 6","Groupe 7","Groupe 8","Groupe 9"]
[{"$f":"IF(D3=\"\",\"\",D3)","v":"D_Dy_C6"},{"$f":"IF(D9=\"\",\"\",D9)","v":"D_St_EQ_D4"},{"$f":"IF(D15=\"\",\"\",D15)","v":"D_St_PV_A1"},{"$f":"IF(D21=\"\",\"\",D21)","v":"D_St_EQ_A4"},{"$f":"IF(D27=\"\",\"\",D27)","v":"D_St_ATR_A2"},{"$f":"IF(D33=\"\",\"\",D33)","v":"D_St_EQ_A1"},{"$f":"IF(D39=\"\",\"\",D39)","v":"D_St_EQ_A4"},{"$f":"IF(D45=\"\",\"\",D45)","v":"D_St_PV_A4"},{"$f":"IF(D51=\"\",\"\",D51)","v":"D_St_ATR_A4"}]
[{"$f":"IF(COUNTIF(A$62,G3)>0,\"\",G3)","v":"D_St_PV_C6"},{"$f":"IF(COUNTIF(B$62,G9)>0,\"\",G9)","v":"D_St_ATR_B2"},{"$f":"IF(COUNTIF(C$62,G15)>0,\"\",G15)","v":""},{"$f":"IF(COUNTIF(D$62,G21)>0,\"\",G21)","v":"D_St_PV_A4"},{"$f":"IF(COUNTIF(E$62,G27)>0,\"\",G27)","v":""},{"$f":"IF(COUNTIF(F$62,G33)>0,\"\",G33)","v":""},{"$f":"IF(COUNTIF(G$62,G39)>0,\"\",G39)","v":""},{"$f":"IF(COUNTIF(H$62,G45)>0,\"\",G45)","v":""},{"$f":"IF(COUNTIF(I$62,G51)>0,\"\",G51)","v":""}]
[{"$f":"IF(COUNTIF(A$62:A63,J3)>0,\"\",J3)","v":"D_St_EQ_B1"},{"$f":"IF(COUNTIF(B$62:B63,J9)>0,\"\",J9)","v":"D_Dy_B2"},{"$f":"IF(COUNTIF(C$62:C63,J15)>0,\"\",J15)","v":""},{"$f":"IF(COUNTIF(D$62:D63,J21)>0,\"\",J21)","v":""},{"$f":"IF(COUNTIF(E$62:E63,J27)>0,\"\",J27)","v":""},{"$f":"IF(COUNTIF(F$62:F63,J33)>0,\"\",J33)","v":""},{"$f":"IF(COUNTIF(G$62:G63,J39)>0,\"\",J39)","v":""},{"$f":"IF(COUNTIF(H$62:H63,J45)>0,\"\",J45)","v":""},{"$f":"IF(COUNTIF(I$62:I63,J51)>0,\"\",J51)","v":""}]
[{"$f":"IF(COUNTIF(A$62:A64,M3)>0,\"\",M3)","v":"El_Sou_C2"},{"$f":"IF(COUNTIF(B$62:B64,M9)>0,\"\",M9)","v":"T_St_PV_B1"},{"$f":"IF(COUNTIF(C$62:C64,M15)>0,\"\",M15)","v":""},{"$f":"IF(COUNTIF(D$62:D64,M21)>0,\"\",M21)","v":""},{"$f":"IF(COUNTIF(E$62:E64,M27)>0,\"\",M27)","v":""},{"$f":"IF(COUNTIF(F$62:F64,M33)>0,\"\",M33)","v":""},{"$f":"IF(COUNTIF(G$62:G64,M39)>0,\"\",M39)","v":""},{"$f":"IF(COUNTIF(H$62:H64,M45)>0,\"\",M45)","v":""},{"$f":"IF(COUNTIF(I$62:I64,M51)>0,\"\",M51)","v":""}]
[{"$f":"IF(COUNTIF(A$62:A65,P3)>0,\"\",P3)","v":"D_St_EQ_B4"},{"$f":"IF(COUNTIF(B$62:B65,P9)>0,\"\",P9)","v":"T_St_EQ_B6"},{"$f":"IF(COUNTIF(C$62:C65,P15)>0,\"\",P15)","v":""},{"$f":"IF(COUNTIF(D$62:D65,P21)>0,\"\",P21)","v":""},{"$f":"IF(COUNTIF(E$62:E65,P27)>0,\"\",P27)","v":""},{"$f":"IF(COUNTIF(F$62:F65,P33)>0,\"\",P33)","v":""},{"$f":"IF(COUNTIF(G$62:G65,P39)>0,\"\",P39)","v":""},{"$f":"IF(COUNTIF(H$62:H65,P45)>0,\"\",P45)","v":""},{"$f":"IF(COUNTIF(I$62:I65,P51)>0,\"\",P51)","v":""}]
[{"$f":"IF(COUNTIF(A$62:A66,S3)>0,\"\",S3)","v":"El_Ag_B1"},{"$f":"IF(COUNTIF(B$62:B66,S9)>0,\"\",S9)","v":"Q_St_ATR_C1"},{"$f":"IF(COUNTIF(C$62:C66,S15)>0,\"\",S15)","v":""},{"$f":"IF(COUNTIF(D$62:D66,S21)>0,\"\",S21)","v":""},{"$f":"IF(COUNTIF(E$62:E66,S27)>0,\"\",S27)","v":""},{"$f":"IF(COUNTIF(F$62:F66,S33)>0,\"\",S33)","v":""},{"$f":"IF(COUNTIF(G$62:G66,S39)>0,\"\",S39)","v":""},{"$f":"IF(COUNTIF(H$62:H66,S45)>0,\"\",S45)","v":""},{"$f":"IF(COUNTIF(I$62:I66,S51)>0,\"\",S51)","v":""}]
[{"$f":"IF(COUNTIF(A$62:A67,D4)>0,\"\",D4)","v":""},{"$f":"IF(COUNTIF(B$62:B67,D10)>0,\"\",D10)","v":"D_Dy_B1"},{"$f":"IF(COUNTIF(C$62:C67,D16)>0,\"\",D16)","v":""},{"$f":"IF(COUNTIF(D$62:D67,D22)>0,\"\",D22)","v":""},{"$f":"IF(COUNTIF(E$62:E67,D28)>0,\"\",D28)","v":""},{"$f":"IF(COUNTIF(F$62:F67,D34)>0,\"\",D34)","v":""},{"$f":"IF(COUNTIF(G$62:G67,D40)>0,\"\",D40)","v":""},{"$f":"IF(COUNTIF(H$62:H67,D46)>0,\"\",D46)","v":""},{"$f":"IF(COUNTIF(I$62:I67,D52)>0,\"\",D52)","v":""}]
[{"$f":"IF(COUNTIF(A$62:A68,G4)>0,\"\",G4)","v":"D_St_ATR_C4"},{"$f":"IF(COUNTIF(B$62:B68,G10)>0,\"\",G10)","v":"D_St_EQ_B1"},{"$f":"IF(COUNTIF(C$62:C68,G16)>0,\"\",G16)","v":""},{"$f":"IF(COUNTIF(D$62:D68,G22)>0,\"\",G22)","v":""},{"$f":"IF(COUNTIF(E$62:E68,G28)>0,\"\",G28)","v":""},{"$f":"IF(COUNTIF(F$62:F68,G34)>0,\"\",G34)","v":""},{"$f":"IF(COUNTIF(G$62:G68,G40)>0,\"\",G40)","v":""},{"$f":"IF(COUNTIF(H$62:H68,G46)>0,\"\",G46)","v":""},{"$f":"IF(COUNTIF(I$62:I68,G52)>0,\"\",G52)","v":""}]
[{"$f":"IF(COUNTIF(A$62:A69,J4)>0,\"\",J4)","v":"T_St_EQ_B6"},{"$f":"IF(COUNTIF(B$62:B69,J10)>0,\"\",J10)","v":""},{"$f":"IF(COUNTIF(C$62:C69,J16)>0,\"\",J16)","v":""},{"$f":"IF(COUNTIF(D$62:D69,J22)>0,\"\",J22)","v":""},{"$f":"IF(COUNTIF(E$62:E69,J28)>0,\"\",J28)","v":""},{"$f":"IF(COUNTIF(F$62:F69,J34)>0,\"\",J34)","v":""},{"$f":"IF(COUNTIF(G$62:G69,J40)>0,\"\",J40)","v":""},{"$f":"IF(COUNTIF(H$62:H69,J46)>0,\"\",J46)","v":""},{"$f":"IF(COUNTIF(I$62:I69,J52)>0,\"\",J52)","v":""}]
[{"$f":"IF(COUNTIF(A$62:A70,M4)>0,\"\",M4)","v":"D_Dy_B2"},{"$f":"IF(COUNTIF(B$62:B70,M10)>0,\"\",M10)","v":"D_St_ATR_B3"},{"$f":"IF(COUNTIF(C$62:C70,M16)>0,\"\",M16)","v":""},{"$f":"IF(COUNTIF(D$62:D70,M22)>0,\"\",M22)","v":""},{"$f":"IF(COUNTIF(E$62:E70,M28)>0,\"\",M28)","v":""},{"$f":"IF(COUNTIF(F$62:F70,M34)>0,\"\",M34)","v":""},{"$f":"IF(COUNTIF(G$62:G70,M40)>0,\"\",M40)","v":""},{"$f":"IF(COUNTIF(H$62:H70,M46)>0,\"\",M46)","v":""},{"$f":"IF(COUNTIF(I$62:I70,M52)>0,\"\",M52)","v":""}]
[{"$f":"IF(COUNTIF(A$62:A71,P4)>0,\"\",P4)","v":"El_Ag_B3"},{"$f":"IF(COUNTIF(B$62:B71,P10)>0,\"\",P10)","v":"D_Dy_A2"},{"$f":"IF(COUNTIF(C$62:C71,P16)>0,\"\",P16)","v":""},{"$f":"IF(COUNTIF(D$62:D71,P22)>0,\"\",P22)","v":""},{"$f":"IF(COUNTIF(E$62:E71,P28)>0,\"\",P28)","v":""},{"$f":"IF(COUNTIF(F$62:F71,P34)>0,\"\",P34)","v":""},{"$f":"IF(COUNTIF(G$62:G71,P40)>0,\"\",P40)","v":""},{"$f":"IF(COUNTIF(H$62:H71,P46)>0,\"\",P46)","v":""},{"$f":"IF(COUNTIF(I$62:I71,P52)>0,\"\",P52)","v":""}]
[{"$f":"IF(COUNTIF(A$62:A72,S4)>0,\"\",S4)","v":""},{"$f":"IF(COUNTIF(B$62:B72,S10)>0,\"\",S10)","v":"T_St_PV_A6"},{"$f":"IF(COUNTIF(C$62:C72,S16)>0,\"\",S16)","v":""},{"$f":"IF(COUNTIF(D$62:D72,S22)>0,\"\",S22)","v":""},{"$f":"IF(COUNTIF(E$62:E72,S28)>0,\"\",S28)","v":""},{"$f":"IF(COUNTIF(F$62:F72,S34)>0,\"\",S34)","v":""},{"$f":"IF(COUNTIF(G$62:G72,S40)>0,\"\",S40)","v":""},{"$f":"IF(COUNTIF(H$62:H72,S46)>0,\"\",S46)","v":""},{"$f":"IF(COUNTIF(I$62:I72,S52)>0,\"\",S52)","v":""}]
[{"$f":"IF(COUNTIF(A$62:A73,D5)>0,\"\",D5)","v":""},{"$f":"IF(COUNTIF(B$62:B73,D11)>0,\"\",D11)","v":""},{"$f":"IF(COUNTIF(C$62:C73,D17)>0,\"\",D17)","v":""},{"$f":"IF(COUNTIF(D$62:D73,D23)>0,\"\",D23)","v":""},{"$f":"IF(COUNTIF(E$62:E73,D29)>0,\"\",D29)","v":""},{"$f":"IF(COUNTIF(F$62:F73,D35)>0,\"\",D35)","v":""},{"$f":"IF(COUNTIF(G$62:G73,D41)>0,\"\",D41)","v":""},{"$f":"IF(COUNTIF(H$62:H73,D47)>0,\"\",D47)","v":""},{"$f":"IF(COUNTIF(I$62:I73,D53)>0,\"\",D53)","v":""}]
[{"$f":"IF(COUNTIF(A$62:A74,G5)>0,\"\",G5)","v":"D_St_ATR_B2"},{"$f":"IF(COUNTIF(B$62:B74,G11)>0,\"\",G11)","v":""},{"$f":"IF(COUNTIF(C$62:C74,G17)>0,\"\",G17)","v":""},{"$f":"IF(COUNTIF(D$62:D74,G23)>0,\"\",G23)","v":""},{"$f":"IF(COUNTIF(E$62:E74,G29)>0,\"\",G29)","v":""},{"$f":"IF(COUNTIF(F$62:F74,G35)>0,\"\",G35)","v":""},{"$f":"IF(COUNTIF(G$62:G74,G41)>0,\"\",G41)","v":""},{"$f":"IF(COUNTIF(H$62:H74,G47)>0,\"\",G47)","v":""},{"$f":"IF(COUNTIF(I$62:I74,G53)>0,\"\",G53)","v":""}]
[{"$f":"IF(COUNTIF(A$62:A75,J5)>0,\"\",J5)","v":"T_Dy_D6"},{"$f":"IF(COUNTIF(B$62:B75,J11)>0,\"\",J11)","v":"Q_St_PV_A1"},{"$f":"IF(COUNTIF(C$62:C75,J17)>0,\"\",J17)","v":""},{"$f":"IF(COUNTIF(D$62:D75,J23)>0,\"\",J23)","v":""},{"$f":"IF(COUNTIF(E$62:E75,J29)>0,\"\",J29)","v":""},{"$f":"IF(COUNTIF(F$62:F75,J35)>0,\"\",J35)","v":""},{"$f":"IF(COUNTIF(G$62:G75,J41)>0,\"\",J41)","v":""},{"$f":"IF(COUNTIF(H$62:H75,J47)>0,\"\",J47)","v":""},{"$f":"IF(COUNTIF(I$62:I75,J53)>0,\"\",J53)","v":""}]
[{"$f":"IF(COUNTIF(A$62:A76,M5)>0,\"\",M5)","v":"El_M_A2"},{"$f":"IF(COUNTIF(B$62:B76,M11)>0,\"\",M11)","v":""},{"$f":"IF(COUNTIF(C$62:C76,M17)>0,\"\",M17)","v":""},{"$f":"IF(COUNTIF(D$62:D76,M23)>0,\"\",M23)","v":""},{"$f":"IF(COUNTIF(E$62:E76,M29)>0,\"\",M29)","v":""},{"$f":"IF(COUNTIF(F$62:F76,M35)>0,\"\",M35)","v":""},{"$f":"IF(COUNTIF(G$62:G76,M41)>0,\"\",M41)","v":""},{"$f":"IF(COUNTIF(H$62:H76,M47)>0,\"\",M47)","v":""},{"$f":"IF(COUNTIF(I$62:I76,M53)>0,\"\",M53)","v":""}]
[{"$f":"IF(COUNTIF(A$62:A77,P5)>0,\"\",P5)","v":"T_St_PV_B1"},{"$f":"IF(COUNTIF(B$62:B77,P11)>0,\"\",P11)","v":"D_Dy_B3"},{"$f":"IF(COUNTIF(C$62:C77,P17)>0,\"\",P17)","v":""},{"$f":"IF(COUNTIF(D$62:D77,P23)>0,\"\",P23)","v":""},{"$f":"IF(COUNTIF(E$62:E77,P29)>0,\"\",P29)","v":""},{"$f":"IF(COUNTIF(F$62:F77,P35)>0,\"\",P35)","v":""},{"$f":"IF(COUNTIF(G$62:G77,P41)>0,\"\",P41)","v":""},{"$f":"IF(COUNTIF(H$62:H77,P47)>0,\"\",P47)","v":""},{"$f":"IF(COUNTIF(I$62:I77,P53)>0,\"\",P53)","v":""}]
[{"$f":"IF(COUNTIF(A$62:A78,S5)>0,\"\",S5)","v":""},{"$f":"IF(COUNTIF(B$62:B78,S11)>0,\"\",S11)","v":"T_St_PV_B4"},{"$f":"IF(COUNTIF(C$62:C78,S17)>0,\"\",S17)","v":""},{"$f":"IF(COUNTIF(D$62:D78,S23)>0,\"\",S23)","v":""},{"$f":"IF(COUNTIF(E$62:E78,S29)>0,\"\",S29)","v":""},{"$f":"IF(COUNTIF(F$62:F78,S35)>0,\"\",S35)","v":""},{"$f":"IF(COUNTIF(G$62:G78,S41)>0,\"\",S41)","v":""},{"$f":"IF(COUNTIF(H$62:H78,S47)>0,\"\",S47)","v":""},{"$f":"IF(COUNTIF(I$62:I78,S53)>0,\"\",S53)","v":""}]
[{"$f":"IF(COUNTIF(A$62:A79,D6)>0,\"\",D6)","v":""},{"$f":"IF(COUNTIF(B$62:B79,D12)>0,\"\",D12)","v":""},{"$f":"IF(COUNTIF(C$62:C79,D18)>0,\"\",D18)","v":""},{"$f":"IF(COUNTIF(D$62:D79,D24)>0,\"\",D24)","v":""},{"$f":"IF(COUNTIF(E$62:E79,D30)>0,\"\",D30)","v":""},{"$f":"IF(COUNTIF(F$62:F79,D35)>0,\"\",D35)","v":""},{"$f":"IF(COUNTIF(G$62:G79,D42)>0,\"\",D42)","v":""},{"$f":"IF(COUNTIF(H$62:H79,D48)>0,\"\",D48)","v":""},{"$f":"IF(COUNTIF(I$62:I79,D54)>0,\"\",D54)","v":""}]
[{"$f":"IF(COUNTIF(A$62:A80,G6)>0,\"\",G6)","v":""},{"$f":"IF(COUNTIF(B$62:B80,G12)>0,\"\",G12)","v":"El_M_B3"},{"$f":"IF(COUNTIF(C$62:C80,G18)>0,\"\",G18)","v":""},{"$f":"IF(COUNTIF(D$62:D80,G24)>0,\"\",G24)","v":""},{"$f":"IF(COUNTIF(E$62:E80,G30)>0,\"\",G30)","v":""},{"$f":"IF(COUNTIF(F$62:F80,G35)>0,\"\",G35)","v":""},{"$f":"IF(COUNTIF(G$62:G80,G42)>0,\"\",G42)","v":""},{"$f":"IF(COUNTIF(H$62:H80,G48)>0,\"\",G48)","v":""},{"$f":"IF(COUNTIF(I$62:I80,G54)>0,\"\",G54)","v":""}]
[{"$f":"IF(COUNTIF(A$62:A81,J6)>0,\"\",J6)","v":""},{"$f":"IF(COUNTIF(B$62:B81,J12)>0,\"\",J12)","v":""},{"$f":"IF(COUNTIF(C$62:C81,J18)>0,\"\",J18)","v":""},{"$f":"IF(COUNTIF(D$62:D81,J24)>0,\"\",J24)","v":""},{"$f":"IF(COUNTIF(E$62:E81,J30)>0,\"\",J30)","v":""},{"$f":"IF(COUNTIF(F$62:F81,J36)>0,\"\",J36)","v":""},{"$f":"IF(COUNTIF(G$62:G81,J42)>0,\"\",J42)","v":""},{"$f":"IF(COUNTIF(H$62:H81,J48)>0,\"\",J48)","v":""},{"$f":"IF(COUNTIF(I$62:I81,J54)>0,\"\",J54)","v":""}]
[{"$f":"IF(COUNTIF(A$62:A82,M6)>0,\"\",M6)","v":""},{"$f":"IF(COUNTIF(B$62:B82,M12)>0,\"\",M12)","v":"El_Ag_B3"},{"$f":"IF(COUNTIF(C$62:C82,M18)>0,\"\",M18)","v":""},{"$f":"IF(COUNTIF(D$62:D82,M24)>0,\"\",M24)","v":""},{"$f":"IF(COUNTIF(E$62:E82,M30)>0,\"\",M30)","v":""},{"$f":"IF(COUNTIF(F$62:F82,M36)>0,\"\",M36)","v":""},{"$f":"IF(COUNTIF(G$62:G82,M42)>0,\"\",M42)","v":""},{"$f":"IF(COUNTIF(H$62:H82,M48)>0,\"\",M48)","v":""},{"$f":"IF(COUNTIF(I$62:I82,M54)>0,\"\",M54)","v":""}]
[{"$f":"IF(COUNTIF(A$62:A83,P6)>0,\"\",P6)","v":""},{"$f":"IF(COUNTIF(B$62:B83,P12)>0,\"\",P12)","v":""},{"$f":"IF(COUNTIF(C$62:C83,P18)>0,\"\",P18)","v":""},{"$f":"IF(COUNTIF(D$62:D83,P24)>0,\"\",P24)","v":""},{"$f":"IF(COUNTIF(E$62:E83,P30)>0,\"\",P30)","v":""},{"$f":"IF(COUNTIF(F$62:F83,P36)>0,\"\",P36)","v":""},{"$f":"IF(COUNTIF(G$62:G83,P42)>0,\"\",P42)","v":""},{"$f":"IF(COUNTIF(H$62:H83,P48)>0,\"\",P48)","v":""},{"$f":"IF(COUNTIF(I$62:I83,P54)>0,\"\",P54)","v":""}]
[{"$f":"IF(COUNTIF(A$62:A84,S6)>0,\"\",S6)","v":""},{"$f":"IF(COUNTIF(B$62:B84,S12)>0,\"\",S12)","v":"El_Ag_C2"},{"$f":"IF(COUNTIF(C$62:C84,S18)>0,\"\",S18)","v":""},{"$f":"IF(COUNTIF(D$62:D84,S24)>0,\"\",S24)","v":""},{"$f":"IF(COUNTIF(E$62:E84,S30)>0,\"\",S30)","v":""},{"$f":"IF(COUNTIF(F$62:F84,S36)>0,\"\",S36)","v":""},{"$f":"IF(COUNTIF(G$62:G84,S42)>0,\"\",S42)","v":""},{"$f":"IF(COUNTIF(H$62:H84,S48)>0,\"\",S48)","v":""},{"$f":"IF(COUNTIF(I$62:I84,S54)>0,\"\",S54)","v":""}]
[{"$f":"IF(COUNTIF(A$62:A85,D7)>0,\"\",D7)","v":""},{"$f":"IF(COUNTIF(B$62:B85,D13)>0,\"\",D13)","v":""},{"$f":"IF(COUNTIF(C$62:C85,D19)>0,\"\",D19)","v":""},{"$f":"IF(COUNTIF(D$62:D85,D25)>0,\"\",D25)","v":""},{"$f":"IF(COUNTIF(E$62:E85,D31)>0,\"\",D31)","v":""},{"$f":"IF(COUNTIF(F$62:F85,D37)>0,\"\",D37)","v":""},{"$f":"IF(COUNTIF(G$62:G85,D43)>0,\"\",D43)","v":""},{"$f":"IF(COUNTIF(H$62:H85,D49)>0,\"\",D49)","v":""},{"$f":"IF(COUNTIF(I$62:I85,D55)>0,\"\",D55)","v":""}]
[{"$f":"IF(COUNTIF(A$62:A86,G7)>0,\"\",G7)","v":""},{"$f":"IF(COUNTIF(B$62:B86,G13)>0,\"\",G13)","v":"T_St_PV_B3"},{"$f":"IF(COUNTIF(C$62:C86,G19)>0,\"\",G19)","v":""},{"$f":"IF(COUNTIF(D$62:D86,G25)>0,\"\",G25)","v":""},{"$f":"IF(COUNTIF(E$62:E86,G31)>0,\"\",G31)","v":""},{"$f":"IF(COUNTIF(F$62:F86,G37)>0,\"\",G37)","v":""},{"$f":"IF(COUNTIF(G$62:G86,G43)>0,\"\",G43)","v":""},{"$f":"IF(COUNTIF(H$62:H86,G49)>0,\"\",G49)","v":""},{"$f":"IF(COUNTIF(I$62:I86,G55)>0,\"\",G55)","v":""}]
[{"$f":"IF(COUNTIF(A$62:A87,J7)>0,\"\",J7)","v":""},{"$f":"IF(COUNTIF(B$62:B87,J13)>0,\"\",J13)","v":"El_Sou_B2"},{"$f":"IF(COUNTIF(C$62:C87,J19)>0,\"\",K19)","v":""},{"$f":"IF(COUNTIF(D$62:D87,J25)>0,\"\",J25)","v":""},{"$f":"IF(COUNTIF(E$62:E87,J31)>0,\"\",J31)","v":""},{"$f":"IF(COUNTIF(F$62:F87,J37)>0,\"\",J37)","v":""},{"$f":"IF(COUNTIF(G$62:G87,J43)>0,\"\",J43)","v":""},{"$f":"IF(COUNTIF(H$62:H87,J49)>0,\"\",J49)","v":""},{"$f":"IF(COUNTIF(I$62:I87,J55)>0,\"\",J55)","v":""}]
[{"$f":"IF(COUNTIF(A$62:A88,M7)>0,\"\",M7)","v":""},{"$f":"IF(COUNTIF(B$62:B88,M13)>0,\"\",M13)","v":""},{"$f":"IF(COUNTIF(C$62:C88,M19)>0,\"\",M19)","v":""},{"$f":"IF(COUNTIF(D$62:D88,M25)>0,\"\",M25)","v":""},{"$f":"IF(COUNTIF(E$62:E88,M31)>0,\"\",M31)","v":""},{"$f":"IF(COUNTIF(F$62:F88,M37)>0,\"\",M37)","v":""},{"$f":"IF(COUNTIF(G$62:G88,M43)>0,\"\",M43)","v":""},{"$f":"IF(COUNTIF(H$62:H88,M49)>0,\"\",M49)","v":""},{"$f":"IF(COUNTIF(I$62:I88,M55)>0,\"\",M55)","v":""}]
[{"$f":"IF(COUNTIF(A$62:A89,P7)>0,\"\",P7)","v":""},{"$f":"IF(COUNTIF(B$62:B89,P13)>0,\"\",P13)","v":"T_St_EQ_B2"},{"$f":"IF(COUNTIF(C$62:C89,P19)>0,\"\",P19)","v":""},{"$f":"IF(COUNTIF(D$62:D89,P25)>0,\"\",P25)","v":""},{"$f":"IF(COUNTIF(E$62:E89,P31)>0,\"\",P31)","v":""},{"$f":"IF(COUNTIF(F$62:F89,P37)>0,\"\",P37)","v":""},{"$f":"IF(COUNTIF(G$62:G89,P43)>0,\"\",P43)","v":""},{"$f":"IF(COUNTIF(H$62:H89,P49)>0,\"\",P49)","v":""},{"$f":"IF(COUNTIF(I$62:I89,P55)>0,\"\",P55)","v":""}]
[{"$f":"IF(COUNTIF(A$62:A90,S7)>0,\"\",S7)","v":""},{"$f":"IF(COUNTIF(B$62:B90,S13)>0,\"\",S13)","v":""},{"$f":"IF(COUNTIF(C$62:C90,S19)>0,\"\",S19)","v":""},{"$f":"IF(COUNTIF(D$62:D90,S25)>0,\"\",S25)","v":""},{"$f":"IF(COUNTIF(E$62:E90,S31)>0,\"\",S31)","v":""},{"$f":"IF(COUNTIF(F$62:F90,S37)>0,\"\",S37)","v":""},{"$f":"IF(COUNTIF(G$62:G90,S43)>0,\"\",S43)","v":""},{"$f":"IF(COUNTIF(H$62:H90,S49)>0,\"\",S49)","v":""},{"$f":"IF(COUNTIF(I$62:I90,S55)>0,\"\",S55)","v":""}]
[{"$f":"IF(COUNTIF(A$62:A91,D8)>0,\"\",D8)","v":""},{"$f":"IF(COUNTIF(B$62:B91,D14)>0,\"\",D14)","v":""},{"$f":"IF(COUNTIF(C$62:C91,D20)>0,\"\",D20)","v":""},{"$f":"IF(COUNTIF(D$62:D91,D26)>0,\"\",D26)","v":""},{"$f":"IF(COUNTIF(E$62:E91,D32)>0,\"\",D32)","v":""},{"$f":"IF(COUNTIF(F$62:F91,D38)>0,\"\",D38)","v":""},{"$f":"IF(COUNTIF(G$62:G91,D44)>0,\"\",D44)","v":""},{"$f":"IF(COUNTIF(H$62:H91,D50)>0,\"\",D50)","v":""},{"$f":"IF(COUNTIF(I$62:I91,D56)>0,\"\",D56)","v":""}]
[{"$f":"IF(COUNTIF(A$62:A92,G8)>0,\"\",G8)","v":""},{"$f":"IF(COUNTIF(B$62:B92,G14)>0,\"\",G14)","v":""},{"$f":"IF(COUNTIF(C$62:C92,G20)>0,\"\",G20)","v":""},{"$f":"IF(COUNTIF(D$62:D92,G26)>0,\"\",G26)","v":""},{"$f":"IF(COUNTIF(E$62:E92,G32)>0,\"\",G32)","v":""},{"$f":"IF(COUNTIF(F$62:F92,G38)>0,\"\",G38)","v":""},{"$f":"IF(COUNTIF(G$62:G92,G44)>0,\"\",G44)","v":""},{"$f":"IF(COUNTIF(H$62:H92,G50)>0,\"\",G50)","v":""},{"$f":"IF(COUNTIF(I$62:I92,G56)>0,\"\",G56)","v":""}]
[{"$f":"IF(COUNTIF(A$62:A93,J8)>0,\"\",J8)","v":""},{"$f":"IF(COUNTIF(B$62:B93,J14)>0,\"\",J14)","v":""},{"$f":"IF(COUNTIF(C$62:C93,J20)>0,\"\",J20)","v":""},{"$f":"IF(COUNTIF(D$62:D93,J26)>0,\"\",J26)","v":""},{"$f":"IF(COUNTIF(E$62:E93,J32)>0,\"\",J32)","v":""},{"$f":"IF(COUNTIF(F$62:F93,J38)>0,\"\",J38)","v":""},{"$f":"IF(COUNTIF(G$62:G93,J44)>0,\"\",J44)","v":""},{"$f":"IF(COUNTIF(H$62:H93,J50)>0,\"\",J50)","v":""},{"$f":"IF(COUNTIF(I$62:I93,J56)>0,\"\",J56)","v":""}]
[{"$f":"IF(COUNTIF(A$62:A94,M8)>0,\"\",M8)","v":""},{"$f":"IF(COUNTIF(B$62:B94,M14)>0,\"\",M14)","v":""},{"$f":"IF(COUNTIF(C$62:C94,M20)>0,\"\",M20)","v":""},{"$f":"IF(COUNTIF(D$62:D94,M26)>0,\"\",M26)","v":""},{"$f":"IF(COUNTIF(E$62:E94,M32)>0,\"\",M32)","v":""},{"$f":"IF(COUNTIF(F$62:F94,M38)>0,\"\",M38)","v":""},{"$f":"IF(COUNTIF(G$62:G94,M44)>0,\"\",M44)","v":""},{"$f":"IF(COUNTIF(H$62:H94,M50)>0,\"\",M50)","v":""},{"$f":"IF(COUNTIF(I$62:I94,M56)>0,\"\",M56)","v":""}]
[{"$f":"IF(COUNTIF(A$62:A95,P8)>0,\"\",P8)","v":""},{"$f":"IF(COUNTIF(B$62:B95,P14)>0,\"\",P14)","v":""},{"$f":"IF(COUNTIF(C$62:C95,P20)>0,\"\",P20)","v":""},{"$f":"IF(COUNTIF(D$62:D95,P26)>0,\"\",P26)","v":""},{"$f":"IF(COUNTIF(E$62:E95,P32)>0,\"\",P32)","v":""},{"$f":"IF(COUNTIF(F$62:F95,P38)>0,\"\",P38)","v":""},{"$f":"IF(COUNTIF(G$62:G95,P44)>0,\"\",P44)","v":""},{"$f":"IF(COUNTIF(H$62:H95,P50)>0,\"\",P50)","v":""},{"$f":"IF(COUNTIF(I$62:I95,P56)>0,\"\",P56)","v":""}]
[{"$f":"IF(COUNTIF(A$62:A96,S8)>0,\"\",S8)","v":""},{"$f":"IF(COUNTIF(B$62:B96,S14)>0,\"\",S14)","v":""},{"$f":"IF(COUNTIF(C$62:C96,S20)>0,\"\",S20)","v":""},{"$f":"IF(COUNTIF(D$62:D96,S26)>0,\"\",S26)","v":""},{"$f":"IF(COUNTIF(E$62:E96,S32)>0,\"\",S32)","v":""},{"$f":"IF(COUNTIF(F$62:F96,S38)>0,\"\",S38)","v":""},{"$f":"IF(COUNTIF(G$62:G96,S44)>0,\"\",S44)","v":""},{"$f":"IF(COUNTIF(H$62:H96,S50)>0,\"\",S50)","v":""},{"$f":"IF(COUNTIF(I$62:I96,S56)>0,\"\",S56)","v":""}]
[]
[]
[]
[]
["Groupe 1",{"$f":"_xlfn.TEXTJOIN(\" / \",TRUE,C3,IF(C4<>C3,C4,\"\"),IF(AND(C5<>C3,C5<>C4),C5,\"\"),IF(AND(C6<>C3,C6<>C4,C6<>C5),C6,\"\"),IF(AND(C7<>C3,C7<>C4,C7<>C5,C7<>C6),C7,\"\"),IF(AND(C8<>C3,C8<>C4,C8<>C5,C8<>C6,C8<>C7),C8,\"\"))","v":"TL / TS"}]
["Groupe 2",{"$f":"_xlfn.TEXTJOIN(\" / \",TRUE,C9,IF(C10<>C9,C10,\"\"),IF(AND(C11<>C9,C11<>C10),C11,\"\"),IF(AND(C12<>C9,C12<>C10,C12<>C11),C12,\"\"),IF(AND(C13<>C9,C13<>C10,C13<>C11,C13<>C12),C13,\"\"),IF(AND(C14<>C9,C14<>C10,C14<>C11,C14<>C12,C14<>C13),C14,\"\"))","v":"TS / TL"}]
["Groupe 3",{"$f":"_xlfn.TEXTJOIN(\" / \",TRUE,C15,IF(C16<>C15,C16,\"\"),IF(AND(C17<>C15,C17<>C16),C17,\"\"),IF(AND(C18<>C15,C18<>C16,C18<>C17),C18,\"\"),IF(AND(C19<>C15,C19<>C16,C19<>C17,C19<>C18),C19,\"\"),IF(AND(C20<>C15,C20<>C16,C20<>C17,C20<>C18,C20<>C19),C20,\"\"))","v":""}]
["Groupe 4",{"$f":"_xlfn.TEXTJOIN(\" / \",TRUE,C21,IF(C22<>C21,C22,\"\"),IF(AND(C23<>C21,C23<>C22),C23,\"\"),IF(AND(C24<>C21,C24<>C22,C24<>C23),C24,\"\"),IF(AND(C25<>C21,C25<>C22,C25<>C23,C25<>C24),C25,\"\"),IF(AND(C26<>C21,C26<>C22,C26<>C23,C26<>C24,C26<>C25),C26,\"\"))","v":""}]
["Groupe 5",{"$f":"_xlfn.TEXTJOIN(\" / \",TRUE,C27,IF(C28<>C27,C28,\"\"),IF(AND(C29<>C27,C29<>C28),C29,\"\"),IF(AND(C30<>C27,C30<>C28,C30<>C29),C30,\"\"),IF(AND(C31<>C27,C31<>C28,C31<>C29,C31<>C30),C31,\"\"),IF(AND(C32<>C27,C32<>C28,C32<>C29,C32<>C30,C32<>C31),C32,\"\"))","v":""}]
["Groupe 6",{"$f":"_xlfn.TEXTJOIN(\" / \",TRUE,C33,IF(C34<>C33,C34,\"\"),IF(AND(C35<>C33,C35<>C34),C35,\"\"),IF(AND(C36<>C33,C36<>C34,C36<>C35),C36,\"\"),IF(AND(C37<>C33,C37<>C34,C37<>C35,C37<>C36),C37,\"\"),IF(AND(C38<>C33,C38<>C34,C38<>C35,C38<>C36,C38<>C37),C38,\"\"))","v":""}]
["Groupe 7",{"$f":"_xlfn.TEXTJOIN(\" / \",TRUE,C39,IF(C40<>C39,C40,\"\"),IF(AND(C41<>C39,C41<>C40),C41,\"\"),IF(AND(C42<>C39,C42<>C40,C42<>C41),C42,\"\"),IF(AND(C43<>C39,C43<>C40,C43<>C41,C43<>C42),C43,\"\"),IF(AND(C44<>C39,C44<>C40,C44<>C41,C44<>C42,C44<>C43),C44,\"\"))","v":""}]
["Groupe 8",{"$f":"_xlfn.TEXTJOIN(\" / \",TRUE,C45,IF(C46<>C45,C46,\"\"),IF(AND(C47<>C45,C47<>C46),C47,\"\"),IF(AND(C48<>C45,C48<>C46,C48<>C47),C48,\"\"),IF(AND(C49<>C45,C49<>C46,C49<>C47,C49<>C48),C49,\"\"),IF(AND(C50<>C45,C50<>C46,C50<>C47,C50<>C48,C50<>C49),C50,\"\"))","v":""}]
["Groupe 9",{"$f":"_xlfn.TEXTJOIN(\" / \",TRUE,C51,IF(C52<>C51,C52,\"\"),IF(AND(C53<>C51,C53<>C52),C53,\"\"),IF(AND(C54<>C51,C54<>C52,C54<>C53),C54,\"\"),IF(AND(C55<>C51,C55<>C52,C55<>C53,C55<>C54),C55,\"\"),IF(AND(C56<>C51,C56<>C52,C56<>C53,C56<>C54,C56<>C55),C56,\"\"))","v":""}]

{"sheet":"Tableau_Collectif","index":28,"n_rows":11,"n_cols":49,"rows_kept":11,"cut":false,"hidden":true,"merged":[]}
["Numéro Groupe","Figure / élément 1","Type","Figure / élément 2","Type","Figure / élément 3","Type","Figure / élément 4","Type","Figure / élément 5","Type","Figure / élément 6","Type","Figure / élément 7","Type","Figure / élément 8","Type","Figure / élément 9","Type","Figure / élément 10","Type","Figure / élément 11","Type","Figure / élément 12","Type","Figure / élément 13","Type","Figure / élément 14","Type","Figure / élément 15","Type","Figure / élément 16","Type","Espace 1","Espace 2","Espace 3","Espace 4","Espace 5","Espace 6","Espace 7","Espace 8","Espace 9","Espace 10","Espace 11","Espace 12","Espace 13","Espace 14","Espace 15","Espace 16"]
[]
[{"$f":"CELL(\"contenu\",G1_C!$A$1)","v":"Groupe 1"},{"$f":"IF((CELL(\"contenu\",G1_C!$A$4))=0,\"\",CELL(\"contenu\",G1_C!$A$4))","v":"D_St_EQ_+"},{"$f":"IF((CELL(\"contenu\",G1_C!$A$3))=0,\"\",CELL(\"contenu\",G1_C!$A$3))","v":"Dynamique"},{"$f":"IF((CELL(\"contenu\",G1_C!$D$4))=0,\"\",CELL(\"contenu\",G1_C!$D$4))","v":"D_St_ATR_C4"},{"$f":"IF((CELL(\"contenu\",G1_C!$D$3))=0,\"\",CELL(\"contenu\",G1_C!$D$3))","v":"Elément Indiv"},{"$f":"IF((CELL(\"contenu\",G1_C!$G$4))=0,\"\",CELL(\"contenu\",G1_C!$G$4))","v":"D_St_EQ_B4"},{"$f":"IF((CELL(\"contenu\",G1_C!$G$3))=0,\"\",CELL(\"contenu\",G1_C!$G$3))","v":"Elément Indiv"},{"$f":"IF((CELL(\"contenu\",G1_C!$J$4))=0,\"\",CELL(\"contenu\",G1_C!$J$4))","v":"El_Ag_B3"},{"$f":"IF((CELL(\"contenu\",G1_C!$J$3))=0,\"\",CELL(\"contenu\",G1_C!$J$3))","v":"Elément Indiv"},{"$f":"IF((CELL(\"contenu\",G1_C!$M$4))=0,\"\",CELL(\"contenu\",G1_C!$M$4))","v":"T_St_EQ_B6"},{"$f":"IF((CELL(\"contenu\",G1_C!$M$3))=0,\"\",CELL(\"contenu\",G1_C!$M$3))","v":"Dynamique"},{"$f":"IF((CELL(\"contenu\",G1_C!$P$4))=0,\"\",CELL(\"contenu\",G1_C!$P$4))","v":"T_St_EQ_B6"},{"$f":"IF((CELL(\"contenu\",G1_C!$P$3))=0,\"\",CELL(\"contenu\",G1_C!$P$3))","v":"Elément Indiv"},{"$f":"IF((CELL(\"contenu\",G1_C!$S$4))=0,\"\",CELL(\"contenu\",G1_C!$S$4))","v":"El_M_A2"},{"$f":"IF((CELL(\"contenu\",G1_C!$S$3))=0,\"\",CELL(\"contenu\",G1_C!$S$3))","v":"Elément Indiv"},{"$f":"IF((CELL(\"contenu\",G1_C!$V$4))=0,\"\",CELL(\"contenu\",G1_C!$V$4))","v":"El_M_A2"},{"$f":"IF((CELL(\"contenu\",G1_C!$V$3))=0,\"\",CELL(\"contenu\",G1_C!$V$3))","v":"Elément Indiv"},{"$f":"IF((CELL(\"contenu\",G1_C!$A$14))=0,\"\",CELL(\"contenu\",G1_C!$A$14))","v":""},{"$f":"IF((CELL(\"contenu\",G1_C!$A$13))=0,\"\",CELL(\"contenu\",G1_C!$A$13))","v":""},{"$f":"IF((CELL(\"contenu\",G1_C!$D$14))=0,\"\",CELL(\"contenu\",G1_C!$D$14))","v":"D_Dy_B2"},{"$f":"IF((CELL(\"contenu\",G1_C!$D$13))=0,\"\",CELL(\"contenu\",G1_C!$D$13))","v":"Dynamique"},{"$f":"IF((CELL(\"contenu\",G1_C!$G$14))=0,\"\",CELL(\"contenu\",G1_C!$G$14))","v":"T_Dy_D6"},{"$f":"IF((CELL(\"contenu\",G1_C!$G$13))=0,\"\",CELL(\"contenu\",G1_C!$G$13))","v":"Statique"},{"$f":"IF((CELL(\"contenu\",G1_C!$J$14))=0,\"\",CELL(\"contenu\",G1_C!$J$14))","v":"D_St_ATR_C4"},{"$f":"IF((CELL(\"contenu\",G1_C!$J$13))=0,\"\",CELL(\"contenu\",G1_C!$J$13))","v":"Statique"},{"$f":"IF((CELL(\"contenu\",G1_C!$M$14))=0,\"\",CELL(\"contenu\",G1_C!$M$14))","v":"El_M_A2"},{"$f":"IF((CELL(\"contenu\",G1_C!$M$13))=0,\"\",CELL(\"contenu\",G1_C!$M$13))","v":"Elément Synchro"},{"$f":"IF((CELL(\"contenu\",G1_C!$P$14))=0,\"\",CELL(\"contenu\",G1_C!$P$14))","v":""},{"$f":"IF((CELL(\"contenu\",G1_C!$P$13))=0,\"\",CELL(\"contenu\",G1_C!$P$13))","v":""},{"$f":"IF((CELL(\"contenu\",G1_C!$S$14))=0,\"\",CELL(\"contenu\",G1_C!$S$14))","v":""},{"$f":"IF((CELL(\"contenu\",G1_C!$S$13))=0,\"\",CELL(\"contenu\",G1_C!$S$13))","v":""},{"$f":"IF((CELL(\"contenu\",G1_C!$V$14))=0,\"\",CELL(\"contenu\",G1_C!$V$14))","v":""},{"$f":"IF((CELL(\"contenu\",G1_C!$V$13))=0,\"\",CELL(\"contenu\",G1_C!$V$13))","v":""},"G1_C!$B$6:B$10","G1_C!$E$6:$E$10","G1_C!$H$6:$H$10","G1_C!$K$6:$K$10","G1_C!$N$6:$N$10","G1_C!$Q$6:$Q$10","G1_C!$T$6:$T$10","G1_C!$W$6:$W$10","G1_C!$B$16:B$20","G1_C!$E$16:$E$20","G1_C!$H$16:$H$20","G1_C!$K$16:$K$20","G1_C!$N$16:$N$20","G1_C!$Q$16:$Q$20","G1_C!$T$16:$T$20","G1_C!$W$16:$W$20"]
[{"$f":"CELL(\"contenu\",G2_C!$A$1)","v":"Groupe 2"},{"$f":"IF((CELL(\"contenu\",G2_C!$A$4))=0,\"\",CELL(\"contenu\",G2_C!$A$4))","v":""},{"$f":"IF((CELL(\"contenu\",G2_C!$A$3))=0,\"\",CELL(\"contenu\",G2_C!$A$3))","v":""},{"$f":"IF((CELL(\"contenu\",G2_C!$D$4))=0,\"\",CELL(\"contenu\",G2_C!$D$4))","v":""},{"$f":"IF((CELL(\"contenu\",G2_C!$D$3))=0,\"\",CELL(\"contenu\",G2_C!$D$3))","v":""},{"$f":"IF((CELL(\"contenu\",G2_C!$G$4))=0,\"\",CELL(\"contenu\",G2_C!$G$4))","v":""},{"$f":"IF((CELL(\"contenu\",G2_C!$G$3))=0,\"\",CELL(\"contenu\",G2_C!$G$3))","v":""},{"$f":"IF((CELL(\"contenu\",G2_C!$J$4))=0,\"\",CELL(\"contenu\",G2_C!$J$4))","v":""},{"$f":"IF((CELL(\"contenu\",G2_C!$J$3))=0,\"\",CELL(\"contenu\",G2_C!$J$3))","v":""},{"$f":"IF((CELL(\"contenu\",G2_C!$M$4))=0,\"\",CELL(\"contenu\",G2_C!$M$4))","v":""},{"$f":"IF((CELL(\"contenu\",G2_C!$M$3))=0,\"\",CELL(\"contenu\",G2_C!$M$3))","v":""},{"$f":"IF((CELL(\"contenu\",G2_C!$P$4))=0,\"\",CELL(\"contenu\",G2_C!$P$4))","v":""},{"$f":"IF((CELL(\"contenu\",G2_C!$P$3))=0,\"\",CELL(\"contenu\",G2_C!$P$3))","v":""},{"$f":"IF((CELL(\"contenu\",G2_C!$S$4))=0,\"\",CELL(\"contenu\",G2_C!$S$4))","v":""},{"$f":"IF((CELL(\"contenu\",G2_C!$S$3))=0,\"\",CELL(\"contenu\",G2_C!$S$3))","v":""},{"$f":"IF((CELL(\"contenu\",G2_C!$V$4))=0,\"\",CELL(\"contenu\",G2_C!$V$4))","v":""},{"$f":"IF((CELL(\"contenu\",G2_C!$V$3))=0,\"\",CELL(\"contenu\",G2_C!$V$3))","v":""},{"$f":"IF((CELL(\"contenu\",G2_C!$A$14))=0,\"\",CELL(\"contenu\",G2_C!$A$14))","v":""},{"$f":"IF((CELL(\"contenu\",G2_C!$A$13))=0,\"\",CELL(\"contenu\",G2_C!$A$13))","v":""},{"$f":"IF((CELL(\"contenu\",G2_C!$D$14))=0,\"\",CELL(\"contenu\",G2_C!$D$14))","v":""},{"$f":"IF((CELL(\"contenu\",G2_C!$D$13))=0,\"\",CELL(\"contenu\",G2_C!$D$13))","v":""},{"$f":"IF((CELL(\"contenu\",G2_C!$G$14))=0,\"\",CELL(\"contenu\",G2_C!$G$14))","v":""},{"$f":"IF((CELL(\"contenu\",G2_C!$G$13))=0,\"\",CELL(\"contenu\",G2_C!$G$13))","v":""},{"$f":"IF((CELL(\"contenu\",G2_C!$J$14))=0,\"\",CELL(\"contenu\",G2_C!$J$14))","v":""},{"$f":"IF((CELL(\"contenu\",G2_C!$J$13))=0,\"\",CELL(\"contenu\",G2_C!$J$13))","v":""},{"$f":"IF((CELL(\"contenu\",G2_C!$M$14))=0,\"\",CELL(\"contenu\",G2_C!$M$14))","v":""},{"$f":"IF((CELL(\"contenu\",G2_C!$M$13))=0,\"\",CELL(\"contenu\",G2_C!$M$13))","v":""},{"$f":"IF((CELL(\"contenu\",G2_C!$P$14))=0,\"\",CELL(\"contenu\",G2_C!$P$14))","v":""},{"$f":"IF((CELL(\"contenu\",G2_C!$P$13))=0,\"\",CELL(\"contenu\",G2_C!$P$13))","v":""},{"$f":"IF((CELL(\"contenu\",G2_C!$S$14))=0,\"\",CELL(\"contenu\",G2_C!$S$14))","v":""},{"$f":"IF((CELL(\"contenu\",G2_C!$S$13))=0,\"\",CELL(\"contenu\",G2_C!$S$13))","v":""},{"$f":"IF((CELL(\"contenu\",G2_C!$V$14))=0,\"\",CELL(\"contenu\",G2_C!$V$14))","v":""},{"$f":"IF((CELL(\"contenu\",G2_C!$V$13))=0,\"\",CELL(\"contenu\",G2_C!$V$13))","v":""},"G2_C!$B$6:B$10","G2_C!$E$6:$E$10","G2_C!$H$6:$H$10","G2_C!$K$6:$K$10","G2_C!$N$6:$N$10","G2_C!$Q$6:$Q$10","G2_C!$T$6:$T$10","G2_C!$W$6:$W$10","G2_C!$B$16:B$20","G2_C!$E$16:$E$20","G2_C!$H$16:$H$20","G2_C!$K$16:$K$20","G2_C!$N$16:$N$20","G2_C!$Q$16:$Q$20","G2_C!$T$16:$T$20","G2_C!$W$16:$W$20"]
[{"$f":"CELL(\"contenu\",G3_C!$A$1)","v":""},{"$f":"IF((CELL(\"contenu\",G3_C!$A$4))=0,\"\",CELL(\"contenu\",G3_C!$A$4))","v":""},{"$f":"IF((CELL(\"contenu\",G3_C!$A$3))=0,\"\",CELL(\"contenu\",G3_C!$A$3))","v":""},{"$f":"IF((CELL(\"contenu\",G3_C!$D$4))=0,\"\",CELL(\"contenu\",G3_C!$D$4))","v":""},{"$f":"IF((CELL(\"contenu\",G3_C!$D$3))=0,\"\",CELL(\"contenu\",G3_C!$D$3))","v":""},{"$f":"IF((CELL(\"contenu\",G3_C!$G$4))=0,\"\",CELL(\"contenu\",G3_C!$G$4))","v":""},{"$f":"IF((CELL(\"contenu\",G3_C!$G$3))=0,\"\",CELL(\"contenu\",G3_C!$G$3))","v":""},{"$f":"IF((CELL(\"contenu\",G3_C!$J$4))=0,\"\",CELL(\"contenu\",G3_C!$J$4))","v":""},{"$f":"IF((CELL(\"contenu\",G3_C!$J$3))=0,\"\",CELL(\"contenu\",G3_C!$J$3))","v":""},{"$f":"IF((CELL(\"contenu\",G3_C!$M$4))=0,\"\",CELL(\"contenu\",G3_C!$M$4))","v":""},{"$f":"IF((CELL(\"contenu\",G3_C!$M$3))=0,\"\",CELL(\"contenu\",G3_C!$M$3))","v":""},{"$f":"IF((CELL(\"contenu\",G3_C!$P$4))=0,\"\",CELL(\"contenu\",G3_C!$P$4))","v":""},{"$f":"IF((CELL(\"contenu\",G3_C!$P$3))=0,\"\",CELL(\"contenu\",G3_C!$P$3))","v":""},{"$f":"IF((CELL(\"contenu\",G3_C!$S$4))=0,\"\",CELL(\"contenu\",G3_C!$S$4))","v":""},{"$f":"IF((CELL(\"contenu\",G3_C!$S$3))=0,\"\",CELL(\"contenu\",G3_C!$S$3))","v":""},{"$f":"IF((CELL(\"contenu\",G3_C!$V$4))=0,\"\",CELL(\"contenu\",G3_C!$V$4))","v":""},{"$f":"IF((CELL(\"contenu\",G3_C!$V$3))=0,\"\",CELL(\"contenu\",G3_C!$V$3))","v":""},{"$f":"IF((CELL(\"contenu\",G3_C!$A$14))=0,\"\",CELL(\"contenu\",G3_C!$A$14))","v":""},{"$f":"IF((CELL(\"contenu\",G3_C!$A$13))=0,\"\",CELL(\"contenu\",G3_C!$A$13))","v":""},{"$f":"IF((CELL(\"contenu\",G3_C!$D$14))=0,\"\",CELL(\"contenu\",G3_C!$D$14))","v":""},{"$f":"IF((CELL(\"contenu\",G3_C!$D$13))=0,\"\",CELL(\"contenu\",G3_C!$D$13))","v":""},{"$f":"IF((CELL(\"contenu\",G3_C!$G$14))=0,\"\",CELL(\"contenu\",G3_C!$G$14))","v":""},{"$f":"IF((CELL(\"contenu\",G3_C!$G$13))=0,\"\",CELL(\"contenu\",G3_C!$G$13))","v":""},{"$f":"IF((CELL(\"contenu\",G3_C!$J$14))=0,\"\",CELL(\"contenu\",G3_C!$J$14))","v":""},{"$f":"IF((CELL(\"contenu\",G3_C!$J$13))=0,\"\",CELL(\"contenu\",G3_C!$J$13))","v":""},{"$f":"IF((CELL(\"contenu\",G3_C!$M$14))=0,\"\",CELL(\"contenu\",G3_C!$M$14))","v":""},{"$f":"IF((CELL(\"contenu\",G3_C!$M$13))=0,\"\",CELL(\"contenu\",G3_C!$M$13))","v":""},{"$f":"IF((CELL(\"contenu\",G3_C!$P$14))=0,\"\",CELL(\"contenu\",G3_C!$P$14))","v":""},{"$f":"IF((CELL(\"contenu\",G3_C!$P$13))=0,\"\",CELL(\"contenu\",G3_C!$P$13))","v":""},{"$f":"IF((CELL(\"contenu\",G3_C!$S$14))=0,\"\",CELL(\"contenu\",G3_C!$S$14))","v":""},{"$f":"IF((CELL(\"contenu\",G3_C!$S$13))=0,\"\",CELL(\"contenu\",G3_C!$S$13))","v":""},{"$f":"IF((CELL(\"contenu\",G3_C!$V$14))=0,\"\",CELL(\"contenu\",G3_C!$V$14))","v":""},{"$f":"IF((CELL(\"contenu\",G3_C!$V$13))=0,\"\",CELL(\"contenu\",G3_C!$V$13))","v":""},"G3_C!$B$6:B$10","G3_C!$E$6:$E$10","G3_C!$H$6:$H$10","G3_C!$K$6:$K$10","G3_C!$N$6:$N$10","G3_C!$Q$6:$Q$10","G3_C!$T$6:$T$10","G3_C!$W$6:$W$10","G3_C!$B$16:B$20","G3_C!$E$16:$E$20","G3_C!$H$16:$H$20","G3_C!$K$16:$K$20","G3_C!$N$16:$N$20","G3_C!$Q$16:$Q$20","G3_C!$T$16:$T$20","G3_C!$W$16:$W$20"]
[{"$f":"CELL(\"contenu\",G4_C!$A$1)","v":""},{"$f":"IF((CELL(\"contenu\",G4_C!$A$4))=0,\"\",CELL(\"contenu\",G4_C!$A$4))","v":""},{"$f":"IF((CELL(\"contenu\",G4_C!$A$3))=0,\"\",CELL(\"contenu\",G4_C!$A$3))","v":""},{"$f":"IF((CELL(\"contenu\",G4_C!$D$4))=0,\"\",CELL(\"contenu\",G4_C!$D$4))","v":""},{"$f":"IF((CELL(\"contenu\",G4_C!$D$3))=0,\"\",CELL(\"contenu\",G4_C!$D$3))","v":""},{"$f":"IF((CELL(\"contenu\",G4_C!$G$4))=0,\"\",CELL(\"contenu\",G4_C!$G$4))","v":""},{"$f":"IF((CELL(\"contenu\",G4_C!$G$3))=0,\"\",CELL(\"contenu\",G4_C!$G$3))","v":""},{"$f":"IF((CELL(\"contenu\",G4_C!$J$4))=0,\"\",CELL(\"contenu\",G4_C!$J$4))","v":""},{"$f":"IF((CELL(\"contenu\",G4_C!$J$3))=0,\"\",CELL(\"contenu\",G4_C!$J$3))","v":""},{"$f":"IF((CELL(\"contenu\",G4_C!$M$4))=0,\"\",CELL(\"contenu\",G4_C!$M$4))","v":""},{"$f":"IF((CELL(\"contenu\",G4_C!$M$3))=0,\"\",CELL(\"contenu\",G4_C!$M$3))","v":""},{"$f":"IF((CELL(\"contenu\",G4_C!$P$4))=0,\"\",CELL(\"contenu\",G4_C!$P$4))","v":""},{"$f":"IF((CELL(\"contenu\",G4_C!$P$3))=0,\"\",CELL(\"contenu\",G4_C!$P$3))","v":""},{"$f":"IF((CELL(\"contenu\",G4_C!$S$4))=0,\"\",CELL(\"contenu\",G4_C!$S$4))","v":""},{"$f":"IF((CELL(\"contenu\",G4_C!$S$3))=0,\"\",CELL(\"contenu\",G4_C!$S$3))","v":""},{"$f":"IF((CELL(\"contenu\",G4_C!$V$4))=0,\"\",CELL(\"contenu\",G4_C!$V$4))","v":""},{"$f":"IF((CELL(\"contenu\",G4_C!$V$3))=0,\"\",CELL(\"contenu\",G4_C!$V$3))","v":""},{"$f":"IF((CELL(\"contenu\",G4_C!$A$14))=0,\"\",CELL(\"contenu\",G4_C!$A$14))","v":""},{"$f":"IF((CELL(\"contenu\",G4_C!$A$13))=0,\"\",CELL(\"contenu\",G4_C!$A$13))","v":""},{"$f":"IF((CELL(\"contenu\",G4_C!$D$14))=0,\"\",CELL(\"contenu\",G4_C!$D$14))","v":""},{"$f":"IF((CELL(\"contenu\",G4_C!$D$13))=0,\"\",CELL(\"contenu\",G4_C!$D$13))","v":""},{"$f":"IF((CELL(\"contenu\",G4_C!$G$14))=0,\"\",CELL(\"contenu\",G4_C!$G$14))","v":""},{"$f":"IF((CELL(\"contenu\",G4_C!$G$13))=0,\"\",CELL(\"contenu\",G4_C!$G$13))","v":""},{"$f":"IF((CELL(\"contenu\",G4_C!$J$14))=0,\"\",CELL(\"contenu\",G4_C!$J$14))","v":""},{"$f":"IF((CELL(\"contenu\",G4_C!$J$13))=0,\"\",CELL(\"contenu\",G4_C!$J$13))","v":""},{"$f":"IF((CELL(\"contenu\",G4_C!$M$14))=0,\"\",CELL(\"contenu\",G4_C!$M$14))","v":""},{"$f":"IF((CELL(\"contenu\",G4_C!$M$13))=0,\"\",CELL(\"contenu\",G4_C!$M$13))","v":""},{"$f":"IF((CELL(\"contenu\",G4_C!$P$14))=0,\"\",CELL(\"contenu\",G4_C!$P$14))","v":""},{"$f":"IF((CELL(\"contenu\",G4_C!$P$13))=0,\"\",CELL(\"contenu\",G4_C!$P$13))","v":""},{"$f":"IF((CELL(\"contenu\",G4_C!$S$14))=0,\"\",CELL(\"contenu\",G4_C!$S$14))","v":""},{"$f":"IF((CELL(\"contenu\",G4_C!$S$13))=0,\"\",CELL(\"contenu\",G4_C!$S$13))","v":""},{"$f":"IF((CELL(\"contenu\",G4_C!$V$14))=0,\"\",CELL(\"contenu\",G4_C!$V$14))","v":""},{"$f":"IF((CELL(\"contenu\",G4_C!$V$13))=0,\"\",CELL(\"contenu\",G4_C!$V$13))","v":""},"G4_C!$B$6:B$10","G4_C!$E$6:$E$10","G4_C!$H$6:$H$10","G4_C!$K$6:$K$10","G4_C!$N$6:$N$10","G4_C!$Q$6:$Q$10","G4_C!$T$6:$T$10","G4_C!$W$6:$W$10","G4_C!$B$16:B$20","G4_C!$E$16:$E$20","G4_C!$H$16:$H$20","G4_C!$K$16:$K$20","G4_C!$N$16:$N$20","G4_C!$Q$16:$Q$20","G4_C!$T$16:$T$20","G4_C!$W$16:$W$20"]
[{"$f":"CELL(\"contenu\",G5_C!$A$1)","v":""},{"$f":"IF((CELL(\"contenu\",G5_C!$A$4))=0,\"\",CELL(\"contenu\",G5_C!$A$4))","v":""},{"$f":"IF((CELL(\"contenu\",G5_C!$A$3))=0,\"\",CELL(\"contenu\",G5_C!$A$3))","v":""},{"$f":"IF((CELL(\"contenu\",G5_C!$D$4))=0,\"\",CELL(\"contenu\",G5_C!$D$4))","v":""},{"$f":"IF((CELL(\"contenu\",G5_C!$D$3))=0,\"\",CELL(\"contenu\",G5_C!$D$3))","v":""},{"$f":"IF((CELL(\"contenu\",G5_C!$G$4))=0,\"\",CELL(\"contenu\",G5_C!$G$4))","v":""},{"$f":"IF((CELL(\"contenu\",G5_C!$G$3))=0,\"\",CELL(\"contenu\",G5_C!$G$3))","v":""},{"$f":"IF((CELL(\"contenu\",G5_C!$J$4))=0,\"\",CELL(\"contenu\",G5_C!$J$4))","v":""},{"$f":"IF((CELL(\"contenu\",G5_C!$J$3))=0,\"\",CELL(\"contenu\",G5_C!$J$3))","v":""},{"$f":"IF((CELL(\"contenu\",G5_C!$M$4))=0,\"\",CELL(\"contenu\",G5_C!$M$4))","v":""},{"$f":"IF((CELL(\"contenu\",G5_C!$M$3))=0,\"\",CELL(\"contenu\",G5_C!$M$3))","v":""},{"$f":"IF((CELL(\"contenu\",G5_C!$P$4))=0,\"\",CELL(\"contenu\",G5_C!$P$4))","v":""},{"$f":"IF((CELL(\"contenu\",G5_C!$P$3))=0,\"\",CELL(\"contenu\",G5_C!$P$3))","v":""},{"$f":"IF((CELL(\"contenu\",G5_C!$S$4))=0,\"\",CELL(\"contenu\",G5_C!$S$4))","v":""},{"$f":"IF((CELL(\"contenu\",G5_C!$S$3))=0,\"\",CELL(\"contenu\",G5_C!$S$3))","v":""},{"$f":"IF((CELL(\"contenu\",G5_C!$V$4))=0,\"\",CELL(\"contenu\",G5_C!$V$4))","v":""},{"$f":"IF((CELL(\"contenu\",G5_C!$V$3))=0,\"\",CELL(\"contenu\",G5_C!$V$3))","v":""},{"$f":"IF((CELL(\"contenu\",G5_C!$A$14))=0,\"\",CELL(\"contenu\",G5_C!$A$14))","v":""},{"$f":"IF((CELL(\"contenu\",G5_C!$A$13))=0,\"\",CELL(\"contenu\",G5_C!$A$13))","v":""},{"$f":"IF((CELL(\"contenu\",G5_C!$D$14))=0,\"\",CELL(\"contenu\",G5_C!$D$14))","v":""},{"$f":"IF((CELL(\"contenu\",G5_C!$D$13))=0,\"\",CELL(\"contenu\",G5_C!$D$13))","v":""},{"$f":"IF((CELL(\"contenu\",G5_C!$G$14))=0,\"\",CELL(\"contenu\",G5_C!$G$14))","v":""},{"$f":"IF((CELL(\"contenu\",G5_C!$G$13))=0,\"\",CELL(\"contenu\",G5_C!$G$13))","v":""},{"$f":"IF((CELL(\"contenu\",G5_C!$J$14))=0,\"\",CELL(\"contenu\",G5_C!$J$14))","v":""},{"$f":"IF((CELL(\"contenu\",G5_C!$J$13))=0,\"\",CELL(\"contenu\",G5_C!$J$13))","v":""},{"$f":"IF((CELL(\"contenu\",G5_C!$M$14))=0,\"\",CELL(\"contenu\",G5_C!$M$14))","v":""},{"$f":"IF((CELL(\"contenu\",G5_C!$M$13))=0,\"\",CELL(\"contenu\",G5_C!$M$13))","v":""},{"$f":"IF((CELL(\"contenu\",G5_C!$P$14))=0,\"\",CELL(\"contenu\",G5_C!$P$14))","v":""},{"$f":"IF((CELL(\"contenu\",G5_C!$P$13))=0,\"\",CELL(\"contenu\",G5_C!$P$13))","v":""},{"$f":"IF((CELL(\"contenu\",G5_C!$S$14))=0,\"\",CELL(\"contenu\",G5_C!$S$14))","v":""},{"$f":"IF((CELL(\"contenu\",G5_C!$S$13))=0,\"\",CELL(\"contenu\",G5_C!$S$13))","v":""},{"$f":"IF((CELL(\"contenu\",G5_C!$V$14))=0,\"\",CELL(\"contenu\",G5_C!$V$14))","v":""},{"$f":"IF((CELL(\"contenu\",G5_C!$V$13))=0,\"\",CELL(\"contenu\",G5_C!$V$13))","v":""},"G5_C!$B$6:B$10","G5_C!$E$6:$E$10","G5_C!$H$6:$H$10","G5_C!$K$6:$K$10","G5_C!$N$6:$N$10","G5_C!$Q$6:$Q$10","G5_C!$T$6:$T$10","G5_C!$W$6:$W$10","G5_C!$B$16:B$20","G5_C!$E$16:$E$20","G5_C!$H$16:$H$20","G5_C!$K$16:$K$20","G5_C!$N$16:$N$20","G5_C!$Q$16:$Q$20","G5_C!$T$16:$T$20","G5_C!$W$16:$W$20"]
[{"$f":"CELL(\"contenu\",G6_C!$A$1)","v":""},{"$f":"IF((CELL(\"contenu\",G6_C!$A$4))=0,\"\",CELL(\"contenu\",G6_C!$A$4))","v":""},{"$f":"IF((CELL(\"contenu\",G6_C!$A$3))=0,\"\",CELL(\"contenu\",G6_C!$A$3))","v":""},{"$f":"IF((CELL(\"contenu\",G6_C!$D$4))=0,\"\",CELL(\"contenu\",G6_C!$D$4))","v":""},{"$f":"IF((CELL(\"contenu\",G6_C!$D$3))=0,\"\",CELL(\"contenu\",G6_C!$D$3))","v":""},{"$f":"IF((CELL(\"contenu\",G6_C!$G$4))=0,\"\",CELL(\"contenu\",G6_C!$G$4))","v":""},{"$f":"IF((CELL(\"contenu\",G6_C!$G$3))=0,\"\",CELL(\"contenu\",G6_C!$G$3))","v":""},{"$f":"IF((CELL(\"contenu\",G6_C!$J$4))=0,\"\",CELL(\"contenu\",G6_C!$J$4))","v":""},{"$f":"IF((CELL(\"contenu\",G6_C!$J$3))=0,\"\",CELL(\"contenu\",G6_C!$J$3))","v":""},{"$f":"IF((CELL(\"contenu\",G6_C!$M$4))=0,\"\",CELL(\"contenu\",G6_C!$M$4))","v":""},{"$f":"IF((CELL(\"contenu\",G6_C!$M$3))=0,\"\",CELL(\"contenu\",G6_C!$M$3))","v":""},{"$f":"IF((CELL(\"contenu\",G6_C!$P$4))=0,\"\",CELL(\"contenu\",G6_C!$P$4))","v":""},{"$f":"IF((CELL(\"contenu\",G6_C!$P$3))=0,\"\",CELL(\"contenu\",G6_C!$P$3))","v":""},{"$f":"IF((CELL(\"contenu\",G6_C!$S$4))=0,\"\",CELL(\"contenu\",G6_C!$S$4))","v":""},{"$f":"IF((CELL(\"contenu\",G6_C!$S$3))=0,\"\",CELL(\"contenu\",G6_C!$S$3))","v":""},{"$f":"IF((CELL(\"contenu\",G6_C!$V$4))=0,\"\",CELL(\"contenu\",G6_C!$V$4))","v":""},{"$f":"IF((CELL(\"contenu\",G6_C!$V$3))=0,\"\",CELL(\"contenu\",G6_C!$V$3))","v":""},{"$f":"IF((CELL(\"contenu\",G6_C!$A$14))=0,\"\",CELL(\"contenu\",G6_C!$A$14))","v":""},{"$f":"IF((CELL(\"contenu\",G6_C!$A$13))=0,\"\",CELL(\"contenu\",G6_C!$A$13))","v":""},{"$f":"IF((CELL(\"contenu\",G6_C!$D$14))=0,\"\",CELL(\"contenu\",G6_C!$D$14))","v":""},{"$f":"IF((CELL(\"contenu\",G6_C!$D$13))=0,\"\",CELL(\"contenu\",G6_C!$D$13))","v":""},{"$f":"IF((CELL(\"contenu\",G6_C!$G$14))=0,\"\",CELL(\"contenu\",G6_C!$G$14))","v":""},{"$f":"IF((CELL(\"contenu\",G6_C!$G$13))=0,\"\",CELL(\"contenu\",G6_C!$G$13))","v":""},{"$f":"IF((CELL(\"contenu\",G6_C!$J$14))=0,\"\",CELL(\"contenu\",G6_C!$J$14))","v":""},{"$f":"IF((CELL(\"contenu\",G6_C!$J$13))=0,\"\",CELL(\"contenu\",G6_C!$J$13))","v":""},{"$f":"IF((CELL(\"contenu\",G6_C!$M$14))=0,\"\",CELL(\"contenu\",G6_C!$M$14))","v":""},{"$f":"IF((CELL(\"contenu\",G6_C!$M$13))=0,\"\",CELL(\"contenu\",G6_C!$M$13))","v":""},{"$f":"IF((CELL(\"contenu\",G6_C!$P$14))=0,\"\",CELL(\"contenu\",G6_C!$P$14))","v":""},{"$f":"IF((CELL(\"contenu\",G6_C!$P$13))=0,\"\",CELL(\"contenu\",G6_C!$P$13))","v":""},{"$f":"IF((CELL(\"contenu\",G6_C!$S$14))=0,\"\",CELL(\"contenu\",G6_C!$S$14))","v":""},{"$f":"IF((CELL(\"contenu\",G6_C!$S$13))=0,\"\",CELL(\"contenu\",G6_C!$S$13))","v":""},{"$f":"IF((CELL(\"contenu\",G6_C!$V$14))=0,\"\",CELL(\"contenu\",G6_C!$V$14))","v":""},{"$f":"IF((CELL(\"contenu\",G6_C!$V$13))=0,\"\",CELL(\"contenu\",G6_C!$V$13))","v":""},"G6_C!$B$6:B$10","G6_C!$E$6:$E$10","G6_C!$H$6:$H$10","G6_C!$K$6:$K$10","G6_C!$N$6:$N$10","G6_C!$Q$6:$Q$10","G6_C!$T$6:$T$10","G6_C!$W$6:$W$10","G6_C!$B$16:B$20","G6_C!$E$16:$E$20","G6_C!$H$16:$H$20","G6_C!$K$16:$K$20","G6_C!$N$16:$N$20","G6_C!$Q$16:$Q$20","G6_C!$T$16:$T$20","G6_C!$W$16:$W$20"]
[{"$f":"CELL(\"contenu\",G7_C!$A$1)","v":""},{"$f":"IF((CELL(\"contenu\",G7_C!$A$4))=0,\"\",CELL(\"contenu\",G7_C!$A$4))","v":""},{"$f":"IF((CELL(\"contenu\",G7_C!$A$3))=0,\"\",CELL(\"contenu\",G7_C!$A$3))","v":""},{"$f":"IF((CELL(\"contenu\",G7_C!$D$4))=0,\"\",CELL(\"contenu\",G7_C!$D$4))","v":""},{"$f":"IF((CELL(\"contenu\",G7_C!$D$3))=0,\"\",CELL(\"contenu\",G7_C!$D$3))","v":""},{"$f":"IF((CELL(\"contenu\",G7_C!$G$4))=0,\"\",CELL(\"contenu\",G7_C!$G$4))","v":""},{"$f":"IF((CELL(\"contenu\",G7_C!$G$3))=0,\"\",CELL(\"contenu\",G7_C!$G$3))","v":""},{"$f":"IF((CELL(\"contenu\",G7_C!$J$4))=0,\"\",CELL(\"contenu\",G7_C!$J$4))","v":""},{"$f":"IF((CELL(\"contenu\",G7_C!$J$3))=0,\"\",CELL(\"contenu\",G7_C!$J$3))","v":""},{"$f":"IF((CELL(\"contenu\",G7_C!$M$4))=0,\"\",CELL(\"contenu\",G7_C!$M$4))","v":""},{"$f":"IF((CELL(\"contenu\",G7_C!$M$3))=0,\"\",CELL(\"contenu\",G7_C!$M$3))","v":""},{"$f":"IF((CELL(\"contenu\",G7_C!$P$4))=0,\"\",CELL(\"contenu\",G7_C!$P$4))","v":""},{"$f":"IF((CELL(\"contenu\",G7_C!$P$3))=0,\"\",CELL(\"contenu\",G7_C!$P$3))","v":""},{"$f":"IF((CELL(\"contenu\",G7_C!$S$4))=0,\"\",CELL(\"contenu\",G7_C!$S$4))","v":""},{"$f":"IF((CELL(\"contenu\",G7_C!$S$3))=0,\"\",CELL(\"contenu\",G7_C!$S$3))","v":""},{"$f":"IF((CELL(\"contenu\",G7_C!$V$4))=0,\"\",CELL(\"contenu\",G7_C!$V$4))","v":""},{"$f":"IF((CELL(\"contenu\",G7_C!$V$3))=0,\"\",CELL(\"contenu\",G7_C!$V$3))","v":""},{"$f":"IF((CELL(\"contenu\",G7_C!$A$14))=0,\"\",CELL(\"contenu\",G7_C!$A$14))","v":""},{"$f":"IF((CELL(\"contenu\",G7_C!$A$13))=0,\"\",CELL(\"contenu\",G7_C!$A$13))","v":""},{"$f":"IF((CELL(\"contenu\",G7_C!$D$14))=0,\"\",CELL(\"contenu\",G7_C!$D$14))","v":""},{"$f":"IF((CELL(\"contenu\",G7_C!$D$13))=0,\"\",CELL(\"contenu\",G7_C!$D$13))","v":""},{"$f":"IF((CELL(\"contenu\",G7_C!$G$14))=0,\"\",CELL(\"contenu\",G7_C!$G$14))","v":""},{"$f":"IF((CELL(\"contenu\",G7_C!$G$13))=0,\"\",CELL(\"contenu\",G7_C!$G$13))","v":""},{"$f":"IF((CELL(\"contenu\",G7_C!$J$14))=0,\"\",CELL(\"contenu\",G7_C!$J$14))","v":""},{"$f":"IF((CELL(\"contenu\",G7_C!$J$13))=0,\"\",CELL(\"contenu\",G7_C!$J$13))","v":""},{"$f":"IF((CELL(\"contenu\",G7_C!$M$14))=0,\"\",CELL(\"contenu\",G7_C!$M$14))","v":""},{"$f":"IF((CELL(\"contenu\",G7_C!$M$13))=0,\"\",CELL(\"contenu\",G7_C!$M$13))","v":""},{"$f":"IF((CELL(\"contenu\",G7_C!$P$14))=0,\"\",CELL(\"contenu\",G7_C!$P$14))","v":""},{"$f":"IF((CELL(\"contenu\",G7_C!$P$13))=0,\"\",CELL(\"contenu\",G7_C!$P$13))","v":""},{"$f":"IF((CELL(\"contenu\",G7_C!$S$14))=0,\"\",CELL(\"contenu\",G7_C!$S$14))","v":""},{"$f":"IF((CELL(\"contenu\",G7_C!$S$13))=0,\"\",CELL(\"contenu\",G7_C!$S$13))","v":""},{"$f":"IF((CELL(\"contenu\",G7_C!$V$14))=0,\"\",CELL(\"contenu\",G7_C!$V$14))","v":""},{"$f":"IF((CELL(\"contenu\",G7_C!$V$13))=0,\"\",CELL(\"contenu\",G7_C!$V$13))","v":""},"G7_C!$B$6:B$10","G7_C!$E$6:$E$10","G7_C!$H$6:$H$10","G7_C!$K$6:$K$10","G7_C!$N$6:$N$10","G7_C!$Q$6:$Q$10","G7_C!$T$6:$T$10","G7_C!$W$6:$W$10","G7_C!$B$16:B$20","G7_C!$E$16:$E$20","G7_C!$H$16:$H$20","G7_C!$K$16:$K$20","G7_C!$N$16:$N$20","G7_C!$Q$16:$Q$20","G7_C!$T$16:$T$20","G7_C!$W$16:$W$20"]
[{"$f":"CELL(\"contenu\",G8_C!$A$1)","v":""},{"$f":"IF((CELL(\"contenu\",G8_C!$A$4))=0,\"\",CELL(\"contenu\",G8_C!$A$4))","v":""},{"$f":"IF((CELL(\"contenu\",G8_C!$A$3))=0,\"\",CELL(\"contenu\",G8_C!$A$3))","v":""},{"$f":"IF((CELL(\"contenu\",G8_C!$D$4))=0,\"\",CELL(\"contenu\",G8_C!$D$4))","v":""},{"$f":"IF((CELL(\"contenu\",G8_C!$D$3))=0,\"\",CELL(\"contenu\",G8_C!$D$3))","v":""},{"$f":"IF((CELL(\"contenu\",G8_C!$G$4))=0,\"\",CELL(\"contenu\",G8_C!$G$4))","v":""},{"$f":"IF((CELL(\"contenu\",G8_C!$G$3))=0,\"\",CELL(\"contenu\",G8_C!$G$3))","v":""},{"$f":"IF((CELL(\"contenu\",G8_C!$J$4))=0,\"\",CELL(\"contenu\",G8_C!$J$4))","v":""},{"$f":"IF((CELL(\"contenu\",G8_C!$J$3))=0,\"\",CELL(\"contenu\",G8_C!$J$3))","v":""},{"$f":"IF((CELL(\"contenu\",G8_C!$M$4))=0,\"\",CELL(\"contenu\",G8_C!$M$4))","v":""},{"$f":"IF((CELL(\"contenu\",G8_C!$M$3))=0,\"\",CELL(\"contenu\",G8_C!$M$3))","v":""},{"$f":"IF((CELL(\"contenu\",G8_C!$P$4))=0,\"\",CELL(\"contenu\",G8_C!$P$4))","v":""},{"$f":"IF((CELL(\"contenu\",G8_C!$P$3))=0,\"\",CELL(\"contenu\",G8_C!$P$3))","v":""},{"$f":"IF((CELL(\"contenu\",G8_C!$S$4))=0,\"\",CELL(\"contenu\",G8_C!$S$4))","v":""},{"$f":"IF((CELL(\"contenu\",G8_C!$S$3))=0,\"\",CELL(\"contenu\",G8_C!$S$3))","v":""},{"$f":"IF((CELL(\"contenu\",G8_C!$V$4))=0,\"\",CELL(\"contenu\",G8_C!$V$4))","v":""},{"$f":"IF((CELL(\"contenu\",G8_C!$V$3))=0,\"\",CELL(\"contenu\",G8_C!$V$3))","v":""},{"$f":"IF((CELL(\"contenu\",G8_C!$A$14))=0,\"\",CELL(\"contenu\",G8_C!$A$14))","v":""},{"$f":"IF((CELL(\"contenu\",G8_C!$A$13))=0,\"\",CELL(\"contenu\",G8_C!$A$13))","v":""},{"$f":"IF((CELL(\"contenu\",G8_C!$D$14))=0,\"\",CELL(\"contenu\",G8_C!$D$14))","v":""},{"$f":"IF((CELL(\"contenu\",G8_C!$D$13))=0,\"\",CELL(\"contenu\",G8_C!$D$13))","v":""},{"$f":"IF((CELL(\"contenu\",G8_C!$G$14))=0,\"\",CELL(\"contenu\",G8_C!$G$14))","v":""},{"$f":"IF((CELL(\"contenu\",G8_C!$G$13))=0,\"\",CELL(\"contenu\",G8_C!$G$13))","v":""},{"$f":"IF((CELL(\"contenu\",G8_C!$J$14))=0,\"\",CELL(\"contenu\",G8_C!$J$14))","v":""},{"$f":"IF((CELL(\"contenu\",G8_C!$J$13))=0,\"\",CELL(\"contenu\",G8_C!$J$13))","v":""},{"$f":"IF((CELL(\"contenu\",G8_C!$M$14))=0,\"\",CELL(\"contenu\",G8_C!$M$14))","v":""},{"$f":"IF((CELL(\"contenu\",G8_C!$M$13))=0,\"\",CELL(\"contenu\",G8_C!$M$13))","v":""},{"$f":"IF((CELL(\"contenu\",G8_C!$P$14))=0,\"\",CELL(\"contenu\",G8_C!$P$14))","v":""},{"$f":"IF((CELL(\"contenu\",G8_C!$P$13))=0,\"\",CELL(\"contenu\",G8_C!$P$13))","v":""},{"$f":"IF((CELL(\"contenu\",G8_C!$S$14))=0,\"\",CELL(\"contenu\",G8_C!$S$14))","v":""},{"$f":"IF((CELL(\"contenu\",G8_C!$S$13))=0,\"\",CELL(\"contenu\",G8_C!$S$13))","v":""},{"$f":"IF((CELL(\"contenu\",G8_C!$V$14))=0,\"\",CELL(\"contenu\",G8_C!$V$14))","v":""},{"$f":"IF((CELL(\"contenu\",G8_C!$V$13))=0,\"\",CELL(\"contenu\",G8_C!$V$13))","v":""},"G8_C!$B$6:B$10","G8_C!$E$6:$E$10","G8_C!$H$6:$H$10","G8_C!$K$6:$K$10","G8_C!$N$6:$N$10","G8_C!$Q$6:$Q$10","G8_C!$T$6:$T$10","G8_C!$W$6:$W$10","G8_C!$B$16:B$20","G8_C!$E$16:$E$20","G8_C!$H$16:$H$20","G8_C!$K$16:$K$20","G8_C!$N$16:$N$20","G8_C!$Q$16:$Q$20","G8_C!$T$16:$T$20","G8_C!$W$16:$W$20"]
[{"$f":"CELL(\"contenu\",G9_C!$A$1)","v":""},{"$f":"IF((CELL(\"contenu\",G9_C!$A$4))=0,\"\",CELL(\"contenu\",G9_C!$A$4))","v":""},{"$f":"IF((CELL(\"contenu\",G9_C!$A$3))=0,\"\",CELL(\"contenu\",G9_C!$A$3))","v":""},{"$f":"IF((CELL(\"contenu\",G9_C!$D$4))=0,\"\",CELL(\"contenu\",G9_C!$D$4))","v":""},{"$f":"IF((CELL(\"contenu\",G9_C!$D$3))=0,\"\",CELL(\"contenu\",G9_C!$D$3))","v":""},{"$f":"IF((CELL(\"contenu\",G9_C!$G$4))=0,\"\",CELL(\"contenu\",G9_C!$G$4))","v":""},{"$f":"IF((CELL(\"contenu\",G9_C!$G$3))=0,\"\",CELL(\"contenu\",G9_C!$G$3))","v":""},{"$f":"IF((CELL(\"contenu\",G9_C!$J$4))=0,\"\",CELL(\"contenu\",G9_C!$J$4))","v":""},{"$f":"IF((CELL(\"contenu\",G9_C!$J$3))=0,\"\",CELL(\"contenu\",G9_C!$J$3))","v":""},{"$f":"IF((CELL(\"contenu\",G9_C!$M$4))=0,\"\",CELL(\"contenu\",G9_C!$M$4))","v":""},{"$f":"IF((CELL(\"contenu\",G9_C!$M$3))=0,\"\",CELL(\"contenu\",G9_C!$M$3))","v":""},{"$f":"IF((CELL(\"contenu\",G9_C!$P$4))=0,\"\",CELL(\"contenu\",G9_C!$P$4))","v":""},{"$f":"IF((CELL(\"contenu\",G9_C!$P$3))=0,\"\",CELL(\"contenu\",G9_C!$P$3))","v":""},{"$f":"IF((CELL(\"contenu\",G9_C!$S$4))=0,\"\",CELL(\"contenu\",G9_C!$S$4))","v":""},{"$f":"IF((CELL(\"contenu\",G9_C!$S$3))=0,\"\",CELL(\"contenu\",G9_C!$S$3))","v":""},{"$f":"IF((CELL(\"contenu\",G9_C!$V$4))=0,\"\",CELL(\"contenu\",G9_C!$V$4))","v":""},{"$f":"IF((CELL(\"contenu\",G9_C!$V$3))=0,\"\",CELL(\"contenu\",G9_C!$V$3))","v":""},{"$f":"IF((CELL(\"contenu\",G9_C!$A$14))=0,\"\",CELL(\"contenu\",G9_C!$A$14))","v":""},{"$f":"IF((CELL(\"contenu\",G9_C!$A$13))=0,\"\",CELL(\"contenu\",G9_C!$A$13))","v":""},{"$f":"IF((CELL(\"contenu\",G9_C!$D$14))=0,\"\",CELL(\"contenu\",G9_C!$D$14))","v":""},{"$f":"IF((CELL(\"contenu\",G9_C!$D$13))=0,\"\",CELL(\"contenu\",G9_C!$D$13))","v":""},{"$f":"IF((CELL(\"contenu\",G9_C!$G$14))=0,\"\",CELL(\"contenu\",G9_C!$G$14))","v":""},{"$f":"IF((CELL(\"contenu\",G9_C!$G$13))=0,\"\",CELL(\"contenu\",G9_C!$G$13))","v":""},{"$f":"IF((CELL(\"contenu\",G9_C!$J$14))=0,\"\",CELL(\"contenu\",G9_C!$J$14))","v":""},{"$f":"IF((CELL(\"contenu\",G9_C!$J$13))=0,\"\",CELL(\"contenu\",G9_C!$J$13))","v":""},{"$f":"IF((CELL(\"contenu\",G9_C!$M$14))=0,\"\",CELL(\"contenu\",G9_C!$M$14))","v":""},{"$f":"IF((CELL(\"contenu\",G9_C!$M$13))=0,\"\",CELL(\"contenu\",G9_C!$M$13))","v":""},{"$f":"IF((CELL(\"contenu\",G9_C!$P$14))=0,\"\",CELL(\"contenu\",G9_C!$P$14))","v":""},{"$f":"IF((CELL(\"contenu\",G9_C!$P$13))=0,\"\",CELL(\"contenu\",G9_C!$P$13))","v":""},{"$f":"IF((CELL(\"contenu\",G9_C!$S$14))=0,\"\",CELL(\"contenu\",G9_C!$S$14))","v":""},{"$f":"IF((CELL(\"contenu\",G9_C!$S$13))=0,\"\",CELL(\"contenu\",G9_C!$S$13))","v":""},{"$f":"IF((CELL(\"contenu\",G9_C!$V$14))=0,\"\",CELL(\"contenu\",G9_C!$V$14))","v":""},{"$f":"IF((CELL(\"contenu\",G9_C!$V$13))=0,\"\",CELL(\"contenu\",G9_C!$V$13))","v":""},"G9_C!$B$6:B$10","G9_C!$E$6:$E$10","G9_C!$H$6:$H$10","G9_C!$K$6:$K$10","G9_C!$N$6:$N$10","G9_C!$Q$6:$Q$10","G9_C!$T$6:$T$10","G9_C!$W$6:$W$10","G9_C!$B$16:B$20","G9_C!$E$16:$E$20","G9_C!$H$16:$H$20","G9_C!$K$16:$K$20","G9_C!$N$16:$N$20","G9_C!$Q$16:$Q$20","G9_C!$T$16:$T$20","G9_C!$W$16:$W$20"]