{"text_format":"1","workbook":"xlsx","n_sheets":6,"sheets":["PERF 50m","PERF 2x25m","NOTEENDIRECT","REFERENTIELS","APPEL","DEBUT"],"not_rendered":{"charts":0,"images":2,"macros":0,"external_links":0,"defined_names":11,"comments":0,"pivot_tables":0},"unopened":[],"bounds":{"document_bytes":16777216,"sheet_cells":100000,"rows_first":2000,"rows_last":500,"rows_between":2000,"halvings":0,"cell_chars":16384,"cell_head_chars":4096},"cells_cut":0,"cells_raw":0,"read":"whole","date_system":"1900"}

{"sheet":"PERF 50m","index":0,"n_rows":36,"n_cols":25,"rows_kept":36,"cut":false,"hidden":false,"merged":[[33,1,33,2],[34,1,34,2],[35,1,35,2],[3,1,3,2],[28,1,28,2],[29,1,29,2],[30,1,30,2],[31,1,31,2],[32,1,32,2],[23,1,23,2],[24,1,24,2],[25,1,25,2],[26,1,26,2],[27,1,27,2],[18,1,18,2],[19,1,19,2],[20,1,20,2],[21,1,21,2],[22,1,22,2],[13,1,13,2],[14,1,14,2],[15,1,15,2],[16,1,16,2],[17,1,17,2],[8,1,8,2],[9,1,9,2],[10,1,10,2],[11,1,11,2],[12,1,12,2],[0,17,2,20],[4,1,4,2],[5,1,5,2],[6,1,6,2],[7,1,7,2],[0,5,2,14]]}
[null,"Classe ",null,null,null,"PERFORMANCES SUR 50 m plat",null,null,null,null,null,null,null,null,null,null,null,"PERFORMANCES LORS DU 2C1"]
[null,"1COMELEC",null,null,"N4"]
[]
[null,"Elèves",null,"Meilleure perf / 50m","Note /5","50 m ","50 m ","50 m ","50 m ","50 m ","50 m ","50 m ","50 m ","50 m ","50 m",null,null,"50m","50m","50m","50m","50m","50m","50m","50m"]
[{"$f":"IF($B$2=APPEL!$B$1,VLOOKUP(B5,APPEL!$C$3:$D$38,2,FALSE),IF($B$2=APPEL!$E$1,VLOOKUP(B5,APPEL!$F$3:$G$38,2,FALSE),IF($B$2=APPEL!$H$1,VLOOKUP(B5,APPEL!$I$3:$J$38,2,FALSE),IF($B$2=APPEL!$K$1,VLOOKUP(B5,APPEL!$L$3:$M$38,2,FALSE),IF($B$2=APPEL!$N$1,VLOOKUP(B5,APPEL!$O$3:$P$38,2,FALSE),IF($B$2=APPEL!$Q$1,VLOOKUP(B5,APPEL!$R$3:$S$38,2,FALSE),IF($B$2=APPEL!$T$1,VLOOKUP(B5,APPEL!$U$3:$V$38,2,FALSE),IF($B$2=APPEL!$W$1,VLOOKUP(B5,APPEL!$X$3:$Y$38,2,FALSE),IF($B$2=APPEL!$Z$1,VLOOKUP(B5,APPEL!$AA$3:$AB$38,2,FALSE))))))))))","v":"g"},{"$f":"IF($B$2=APPEL!$B$1,APPEL!C3,IF($B$2=APPEL!$E$1,APPEL!F3,IF($B$2=APPEL!$H$1,APPEL!I3,IF($B$2=APPEL!$K$1,APPEL!L3,IF($B$2=APPEL!$N$1,APPEL!O3,IF($B$2=APPEL!$Q$1,APPEL!R3,IF($B$2=APPEL!$T$1,APPEL!U3,IF($B$2=APPEL!$W$1,APPEL!X3,IF($B$2=APPEL!$Z$1,APPEL!AA3)))))))))","v":"Abdelmalik"},null,{"$f":"IFERROR(SMALL(F5:Y5,1),\"\")","v":6},{"$f":"IFERROR(IF(AND($E$2=DEBUT!$F$5,A5=\"G\"),VLOOKUP(D5,DEBUT!$H$5:$J$99,3,1),IF(AND($E$2=DEBUT!$F$6,A5=\"G\"),VLOOKUP(D5,DEBUT!$AI$5:$AK$70,3,1),IF(AND($E$2=DEBUT!$F$5,$A$5,A5=\"F\"),VLOOKUP(D5,DEBUT!$I$5:$J$99,2,1),IF(AND($E$2=DEBUT!$F$6,A5=\"F\"),VLOOKUP(D5,DEBUT!$AJ$5:$AK$70,2,1))))),\" perf-sexe?\")","v":5},6,null,null,null,null,null,null,null,null,null,null,null,{"$f":"IF(ROWS($1:$1)<=COUNTIF(sprinteur,$B5),INDEX(metre,SMALL(IF(sprinteur=$B5,ROW(INDIRECT(\"1:\"&ROWS(metre)))),ROWS($1:$1))),\"\")","v":""},{"$f":"IF(ROWS($1:$2)<=COUNTIF(sprinteur,$B5),INDEX(metre,SMALL(IF(sprinteur=$B5,ROW(INDIRECT(\"1:\"&ROWS(metre)))),ROWS($1:$2))),\"\")","v":""},{"$f":"IF(ROWS($1:$3)<=COUNTIF(sprinteur,$B5),INDEX(metre,SMALL(IF(sprinteur=$B5,ROW(INDIRECT(\"1:\"&ROWS(metre)))),ROWS($1:$3))),\"\")","v":""},{"$f":"IF(ROWS($1:$4)<=COUNTIF(sprinteur,$B5),INDEX(metre,SMALL(IF(sprinteur=$B5,ROW(INDIRECT(\"1:\"&ROWS(metre)))),ROWS($1:$4))),\"\")","v":""},{"$f":"IF(ROWS($1:$5)<=COUNTIF(sprinteur,$B5),INDEX(metre,SMALL(IF(sprinteur=$B5,ROW(INDIRECT(\"1:\"&ROWS(metre)))),ROWS($1:$5))),\"\")","v":""},{"$f":"IF(ROWS($1:$6)<=COUNTIF(sprinteur,$B5),INDEX(metre,SMALL(IF(sprinteur=$B5,ROW(INDIRECT(\"1:\"&ROWS(metre)))),ROWS($1:$6))),\"\")","v":""},{"$f":"IF(ROWS($1:$7)<=COUNTIF(sprinteur,$B5),INDEX(metre,SMALL(IF(sprinteur=$B5,ROW(INDIRECT(\"1:\"&ROWS(metre)))),ROWS($1:$7))),\"\")","v":""},{"$f":"IF(ROWS($1:$8)<=COUNTIF(sprinteur,$B5),INDEX(metre,SMALL(IF(sprinteur=$B5,ROW(INDIRECT(\"1:\"&ROWS(metre)))),ROWS($1:$8))),\"\")","v":""}]
[{"$f":"IF($B$2=APPEL!$B$1,VLOOKUP(B6,APPEL!$C$3:$D$38,2,FALSE),IF($B$2=APPEL!$E$1,VLOOKUP(B6,APPEL!$F$3:$G$38,2,FALSE),IF($B$2=APPEL!$H$1,VLOOKUP(B6,APPEL!$I$3:$J$38,2,FALSE),IF($B$2=APPEL!$K$1,VLOOKUP(B6,APPEL!$L$3:$M$38,2,FALSE),IF($B$2=APPEL!$N$1,VLOOKUP(B6,APPEL!$O$3:$P$38,2,FALSE),IF($B$2=APPEL!$Q$1,VLOOKUP(B6,APPEL!$R$3:$S$38,2,FALSE),IF($B$2=APPEL!$T$1,VLOOKUP(B6,APPEL!$U$3:$V$38,2,FALSE),IF($B$2=APPEL!$W$1,VLOOKUP(B6,APPEL!$X$3:$Y$38,2,FALSE),IF($B$2=APPEL!$Z$1,VLOOKUP(B6,APPEL!$AA$3:$AB$38,2,FALSE))))))))))","v":"g"},{"$f":"IF($B$2=APPEL!$B$1,APPEL!C4,IF($B$2=APPEL!$E$1,APPEL!F4,IF($B$2=APPEL!$H$1,APPEL!I4,IF($B$2=APPEL!$K$1,APPEL!L4,IF($B$2=APPEL!$N$1,APPEL!O4,IF($B$2=APPEL!$Q$1,APPEL!R4,IF($B$2=APPEL!$T$1,APPEL!U4,IF($B$2=APPEL!$W$1,APPEL!X4,IF($B$2=APPEL!$Z$1,APPEL!AA4)))))))))","v":"Hamza"},null,{"$f":"IFERROR(SMALL(F6:Y6,1),\"\")","v":5.8},{"$f":"IFERROR(IF(AND($E$2=DEBUT!$F$5,A6=\"G\"),VLOOKUP(D6,DEBUT!$H$5:$J$99,3,1),IF(AND($E$2=DEBUT!$F$6,A6=\"G\"),VLOOKUP(D6,DEBUT!$AI$5:$AK$70,3,1),IF(AND($E$2=DEBUT!$F$5,$A$5,A6=\"F\"),VLOOKUP(D6,DEBUT!$I$5:$J$99,2,1),IF(AND($E$2=DEBUT!$F$6,A6=\"F\"),VLOOKUP(D6,DEBUT!$AJ$5:$AK$70,2,1))))),\" perf-sexe?\")","v":5},5.8,null,null,null,null,null,null,null,null,null,null,null,{"$f":"IF(ROWS($1:$1)<=COUNTIF(sprinteur,$B6),INDEX(metre,SMALL(IF(sprinteur=$B6,ROW(INDIRECT(\"1:\"&ROWS(metre)))),ROWS($1:$1))),\"\")","v":""},{"$f":"IF(ROWS($1:$2)<=COUNTIF(sprinteur,$B6),INDEX(metre,SMALL(IF(sprinteur=$B6,ROW(INDIRECT(\"1:\"&ROWS(metre)))),ROWS($1:$2))),\"\")","v":""},{"$f":"IF(ROWS($1:$3)<=COUNTIF(sprinteur,$B6),INDEX(metre,SMALL(IF(sprinteur=$B6,ROW(INDIRECT(\"1:\"&ROWS(metre)))),ROWS($1:$3))),\"\")","v":""},{"$f":"IF(ROWS($1:$4)<=COUNTIF(sprinteur,$B6),INDEX(metre,SMALL(IF(sprinteur=$B6,ROW(INDIRECT(\"1:\"&ROWS(metre)))),ROWS($1:$4))),\"\")","v":""},"","","",""]
{"$rows_left_out":31}
{"sheet":"PERF 2x25m","index":1,"n_rows":63,"n_cols":9,"rows_kept":63,"cut":false,"hidden":false,"merged":[[30,4,31,4],[32,4,33,4],[34,4,35,4],[36,4,37,4],[38,4,39,4],[40,4,41,4],[42,4,43,4],[44,4,45,4],[46,4,47,4],[0,3,2,3],[6,0,7,0],[8,0,9,0],[10,0,11,0],[12,0,13,0],[14,0,15,0],[28,0,29,0],[30,0,31,0],[32,0,33,0],[36,0,37,0],[38,0,39,0],[16,0,17,0],[18,0,19,0],[12,3,13,3],[3,1,3,2],[4,1,4,2],[5,1,5,2],[6,1,6,2],[7,1,7,2],[38,1,38,2],[38,3,39,3],[22,3,23,3],[14,3,15,3],[4,3,5,3],[34,1,34,2],[35,1,35,2],[20,0,21,0],[22,0,23,0],[24,0,25,0],[26,0,27,0],[4,0,5,0],[34,0,35,0],[0,6,2,7],[34,3,35,3],[34,6,35,7],[34,8,35,8],[36,1,36,2],[36,3,37,3],[36,6,37,7],[36,8,37,8],[37,1,37,2],[30,3,31,3],[30,6,31,7],[30,8,31,8],[32,3,33,3],[32,6,33,7],[32,8,33,8],[26,3,27,3],[26,6,27,7],[26,8,27,8],[28,3,29,3],[28,6,29,7],[28,8,29,8],[24,8,25,8],[18,3,19,3],[18,6,19,7],[38,8,39,8],[39,1,39,2],[4,8,5,8],[4,6,5,7],[6,3,7,3],[6,6,7,7],[6,8,7,8],[8,3,9,3],[8,6,9,7],[32,1,32,2],[33,1,33,2],[13,1,13,2],[14,8,15,8],[16,3,17,3],[16,6,17,7],[16,8,17,8],[8,8,9,8],[10,3,11,3],[10,6,11,7],[10,8,11,8],[38,6,39,7],[22,6,23,7],[14,6,15,7],[12,6,13,7],[12,8,13,8],[22,8,23,8],[24,3,25,3],[24,6,25,7],[29,1,29,2],[30,1,30,2],[31,1,31,2],[20,1,20,2],[21,1,21,2],[22,1,22,2],[23,1,23,2],[24,1,24,2],[25,1,25,2],[18,8,19,8],[20,3,21,3],[20,6,21,7],[20,8,21,8],[12,4,13,4],[14,4,15,4],[16,4,17,4],[18,4,19,4],[20,4,21,4],[22,4,23,4],[24,4,25,4],[3,6,3,7],[26,1,26,2],[27,1,27,2],[28,1,28,2],[14,1,14,2],[15,1,15,2],[16,1,16,2],[17,1,17,2],[18,1,18,2],[19,1,19,2],[8,1,8,2],[9,1,9,2],[10,1,10,2],[11,1,11,2],[12,1,12,2],[4,4,5,4],[6,4,7,4],[8,4,9,4],[10,4,11,4],[26,4,27,4],[28,4,29,4],[40,0,41,0],[40,1,40,2],[40,3,41,3],[40,6,41,7],[40,8,41,8],[41,1,41,2],[42,0,43,0],[42,1,42,2],[42,3,43,3],[42,6,43,7],[42,8,43,8],[43,1,43,2],[44,0,45,0],[44,1,44,2],[44,3,45,3],[44,6,45,7],[44,8,45,8],[45,1,45,2],[46,0,47,0],[46,1,46,2],[46,3,47,3],[46,6,47,7],[46,8,47,8],[47,1,47,2],[48,0,49,0],[48,1,48,2],[48,3,49,3],[48,6,49,7],[48,8,49,8],[49,1,49,2],[50,0,51,0],[50,1,50,2],[50,3,51,3],[50,6,51,7],[50,8,51,8],[51,1,51,2],[48,4,49,4],[50,4,51,4],[52,0,53,0],[52,1,52,2],[52,3,53,3],[52,6,53,7],[52,8,53,8],[53,1,53,2],[54,0,55,0],[54,1,54,2],[54,3,55,3],[54,6,55,7],[54,8,55,8],[55,1,55,2],[52,4,53,4],[54,4,55,4],[56,0,57,0],[56,1,56,2],[56,3,57,3],[56,6,57,7],[56,8,57,8],[57,1,57,2],[58,0,59,0],[58,1,58,2],[58,3,59,3],[58,6,59,7],[58,8,59,8],[59,1,59,2],[56,4,57,4],[58,4,59,4],[60,0,61,0],[60,1,60,2],[60,3,61,3],[60,6,61,7],[60,8,61,8],[61,1,61,2],[62,0,63,0],[62,1,62,2],[62,3,63,3],[62,6,63,7],[62,8,63,8],[63,1,63,2],[60,4,61,4],[62,4,63,4]]}
[null,"Classe ",null,2,null,null,1]
[null,{"$f":"'PERF 50m'!B2","v":"1COMELEC"},null,null,null,"contre"]
[]
[null,"RELAIS",null,"2x25 m","Marques ",null,"SPRINTEUR",null,"50 m "]
[1,"Jairzhino",null,5.9,null,null,"Anthony",null,6.4]
[null,"Fatima-Zohra"]
{"$rows_left_out":58}
{"sheet":"NOTEENDIRECT","index":2,"n_rows":18,"n_cols":100,"rows_kept":18,"cut":false,"hidden":false,"merged":[[8,74,8,75],[12,72,12,75],[13,72,13,75],[3,76,4,76],[3,77,4,77],[6,74,6,75],[6,76,6,77],[7,76,7,77],[8,60,8,61],[12,58,12,61],[13,58,13,61],[3,69,4,69],[3,70,4,70],[6,67,6,68],[6,69,6,70],[7,69,7,70],[8,67,8,68],[12,65,12,68],[13,65,13,68],[3,62,4,62],[3,63,4,63],[6,60,6,61],[6,62,6,63],[7,62,7,63],[8,46,8,47],[12,44,12,47],[13,44,13,47],[3,55,4,55],[3,56,4,56],[6,53,6,54],[6,55,6,56],[7,55,7,56],[8,53,8,54],[12,51,12,54],[13,51,13,54],[3,48,4,48],[3,49,4,49],[6,46,6,47],[6,48,6,49],[7,48,7,49],[8,32,8,33],[12,30,12,33],[13,30,13,33],[3,41,4,41],[3,42,4,42],[6,39,6,40],[6,41,6,42],[7,41,7,42],[8,39,8,40],[12,37,12,40],[13,37,13,40],[3,34,4,34],[3,35,4,35],[6,32,6,33],[6,34,6,35],[7,34,7,35],[8,18,8,19],[12,16,12,19],[13,16,13,19],[3,27,4,27],[3,28,4,28],[6,25,6,26],[6,27,6,28],[7,27,7,28],[8,25,8,26],[12,23,12,26],[13,23,13,26],[3,20,4,20],[3,21,4,21],[6,18,6,19],[6,20,6,21],[7,20,7,21],[8,11,8,12],[12,9,12,12],[13,9,13,12],[3,13,4,13],[3,14,4,14],[6,11,6,12],[6,13,6,14],[7,13,7,14],[12,2,12,5],[13,2,13,5],[3,6,4,6],[3,7,4,7],[6,6,6,7],[7,6,7,7],[6,4,6,5],[8,4,8,5],[8,95,8,96],[12,93,12,96],[13,93,13,96],[3,97,4,97],[3,98,4,98],[6,95,6,96],[6,97,6,98],[7,97,7,98],[8,81,8,82],[12,79,12,82],[13,79,13,82],[3,90,4,90],[3,91,4,91],[6,88,6,89],[6,90,6,91],[7,90,7,91],[8,88,8,89],[12,86,12,89],[13,86,13,89],[3,83,4,83],[3,84,4,84],[6,81,6,82],[6,83,6,84],[7,83,7,84]]}
[null,"Classe"]
[null,{"$f":"'PERF 50m'!B2","v":"1COMELEC"},null,null,null,null,"N3","F",null,null,null,null,null,"N3","F",null,null,null,null,null,"N3","F",null,null,null,null,null,"N3","F",null,null,null,null,null,"N3","F",null,null,null,null,null,"N3","F",null,null,null,null,null,"N3","F",null,null,null,null,null,"N3","F",null,null,null,null,null,"N3","F",null,null,null,null,null,"N3","F",null,null,null,null,null,"N3","F",null,null,null,null,null,"N3","F",null,null,null,null,null,"N3","F",null,null,null,null,null,"N3","F"]
[]
[null,"Coureurs","Coureur 1","Coureur 2","Coureur 3","Coureur 4","4x50m(1)","4x50m(2)",null,"Coureur 1","Coureur 2","Coureur 3","Coureur 4","4x50m(1)","4x50m(2)",null,"Coureur 1","Coureur 2","Coureur 3","Coureur 4","4x50m(1)","4x50m(2)",null,"Coureur 1","Coureur 2","Coureur 3","Coureur 4","4x50m(1)","4x50m(2)",null,"Coureur 1","Coureur 2","Coureur 3","Coureur 4","4x50m(1)","4x50m(2)",null,"Coureur 1","Coureur 2","Coureur 3","Coureur 4","4x50m(1)","4x50m(2)",null,"Coureur 1","Coureur 2","Coureur 3","Coureur 4","4x50m(1)","4x50m(2)",null,"Coureur 1","Coureur 2","Coureur 3","Coureur 4","4x50m(1)","4x50m(2)",null,"Coureur 1","Coureur 2","Coureur 3","Coureur 4","4x50m(1)","4x50m(2)",null,"Coureur 1","Coureur 2","Coureur 3","Coureur 4","4x50m(1)","4x50m(2)",null,"Coureur 1","Coureur 2","Coureur 3","Coureur 4","4x50m(1)","4x50m(2)",null,"Coureur 1","Coureur 2","Coureur 3","Coureur 4","4x50m(1)","4x50m(2)",null,"Coureur 1","Coureur 2","Coureur 3","Coureur 4","4x50m(1)","4x50m(2)",null,"Coureur 1","Coureur 2","Coureur 3","Coureur 4","4x50m(1)","4x50m(2)"]
[null,"Prénoms","Hamza","Hamza","Hamza","Hamza"]
[null,"Temps",{"$f":"VLOOKUP(C5,'PERF 50m'!$B$5:$D$36,3,FALSE)","v":5.8},{"$f":"VLOOKUP(D5,'PERF 50m'!$B$5:$D$36,3,FALSE)","v":5.8},{"$f":"VLOOKUP(E5,'PERF 50m'!$B$5:$D$36,3,FALSE)","v":5.8},{"$f":"VLOOKUP(F5,'PERF 50m'!$B$5:$D$36,3,FALSE)","v":5.8},22.2,39.299999999999997,null,{"$f":"VLOOKUP(J5,'PERF 50m'!$B$5:$D$36,3,FALSE)","v":""},{"$f":"VLOOKUP(K5,'PERF 50m'!$B$5:$D$36,3,FALSE)","v":""},{"$f":"VLOOKUP(L5,'PERF 50m'!$B$5:$D$36,3,FALSE)","v":""},{"$f":"VLOOKUP(M5,'PERF 50m'!$B$5:$D$36,3,FALSE)","v":""},null,null,null,{"$f":"VLOOKUP(Q5,'PERF 50m'!$B$5:$D$36,3,FALSE)","v":""},{"$f":"VLOOKUP(R5,'PERF 50m'!$B$5:$D$36,3,FALSE)","v":""},{"$f":"VLOOKUP(S5,'PERF 50m'!$B$5:$D$36,3,FALSE)","v":""},{"$f":"VLOOKUP(T5,'PERF 50m'!$B$5:$D$36,3,FALSE)","v":""},null,null,null,{"$f":"VLOOKUP(X5,'PERF 50m'!$B$5:$D$36,3,FALSE)","v":""},{"$f":"VLOOKUP(Y5,'PERF 50m'!$B$5:$D$36,3,FALSE)","v":""},{"$f":"VLOOKUP(Z5,'PERF 50m'!$B$5:$D$36,3,FALSE)","v":""},{"$f":"VLOOKUP(AA5,'PERF 50m'!$B$5:$D$36,3,FALSE)","v":""},null,null,null,{"$f":"VLOOKUP(AE5,'PERF 50m'!$B$5:$D$36,3,FALSE)","v":""},{"$f":"VLOOKUP(AF5,'PERF 50m'!$B$5:$D$36,3,FALSE)","v":""},{"$f":"VLOOKUP(AG5,'PERF 50m'!$B$5:$D$36,3,FALSE)","v":""},{"$f":"VLOOKUP(AH5,'PERF 50m'!$B$5:$D$36,3,FALSE)","v":""},null,null,null,{"$f":"VLOOKUP(AL5,'PERF 50m'!$B$5:$D$36,3,FALSE)","v":""},{"$f":"VLOOKUP(AM5,'PERF 50m'!$B$5:$D$36,3,FALSE)","v":""},{"$f":"VLOOKUP(AN5,'PERF 50m'!$B$5:$D$36,3,FALSE)","v":""},{"$f":"VLOOKUP(AO5,'PERF 50m'!$B$5:$D$36,3,FALSE)","v":""},null,null,null,{"$f":"VLOOKUP(AS5,'PERF 50m'!$B$5:$D$36,3,FALSE)","v":""},{"$f":"VLOOKUP(AT5,'PERF 50m'!$B$5:$D$36,3,FALSE)","v":""},{"$f":"VLOOKUP(AU5,'PERF 50m'!$B$5:$D$36,3,FALSE)","v":""},{"$f":"VLOOKUP(AV5,'PERF 50m'!$B$5:$D$36,3,FALSE)","v":""},null,null,null,{"$f":"VLOOKUP(AZ5,'PERF 50m'!$B$5:$D$36,3,FALSE)","v":""},{"$f":"VLOOKUP(BA5,'PERF 50m'!$B$5:$D$36,3,FALSE)","v":""},{"$f":"VLOOKUP(BB5,'PERF 50m'!$B$5:$D$36,3,FALSE)","v":""},{"$f":"VLOOKUP(BC5,'PERF 50m'!$B$5:$D$36,3,FALSE)","v":""},null,null,null,{"$f":"VLOOKUP(BG5,'PERF 50m'!$B$5:$D$36,3,FALSE)","v":""},{"$f":"VLOOKUP(BH5,'PERF 50m'!$B$5:$D$36,3,FALSE)","v":""},{"$f":"VLOOKUP(BI5,'PERF 50m'!$B$5:$D$36,3,FALSE)","v":""},{"$f":"VLOOKUP(BJ5,'PERF 50m'!$B$5:$D$36,3,FALSE)","v":""},null,null,null,{"$f":"VLOOKUP(BN5,'PERF 50m'!$B$5:$D$36,3,FALSE)","v":""},{"$f":"VLOOKUP(BO5,'PERF 50m'!$B$5:$D$36,3,FALSE)","v":""},{"$f":"VLOOKUP(BP5,'PERF 50m'!$B$5:$D$36,3,FALSE)","v":""},{"$f":"VLOOKUP(BQ5,'PERF 50m'!$B$5:$D$36,3,FALSE)","v":""},null,null,null,{"$f":"VLOOKUP(BU5,'PERF 50m'!$B$5:$D$36,3,FALSE)","v":""},{"$f":"VLOOKUP(BV5,'PERF 50m'!$B$5:$D$36,3,FALSE)","v":""},{"$f":"VLOOKUP(BW5,'PERF 50m'!$B$5:$D$36,3,FALSE)","v":""},{"$f":"VLOOKUP(BX5,'PERF 50m'!$B$5:$D$36,3,FALSE)","v":""},null,null,null,{"$f":"VLOOKUP(CB5,'PERF 50m'!$B$5:$D$36,3,FALSE)","v":""},{"$f":"VLOOKUP(CC5,'PERF 50m'!$B$5:$D$36,3,FALSE)","v":""},{"$f":"VLOOKUP(CD5,'PERF 50m'!$B$5:$D$36,3,FALSE)","v":""},{"$f":"VLOOKUP(CE5,'PERF 50m'!$B$5:$D$36,3,FALSE)","v":""},null,null,null,{"$f":"VLOOKUP(CI5,'PERF 50m'!$B$5:$D$36,3,FALSE)","v":""},{"$f":"VLOOKUP(CJ5,'PERF 50m'!$B$5:$D$36,3,FALSE)","v":""},{"$f":"VLOOKUP(CK5,'PERF 50m'!$B$5:$D$36,3,FALSE)","v":""},{"$f":"VLOOKUP(CL5,'PERF 50m'!$B$5:$D$36,3,FALSE)","v":""},null,null,null,{"$f":"VLOOKUP(CP5,'PERF 50m'!$B$5:$D$36,3,FALSE)","v":""},{"$f":"VLOOKUP(CQ5,'PERF 50m'!$B$5:$D$36,3,FALSE)","v":""},{"$f":"VLOOKUP(CR5,'PERF 50m'!$B$5:$D$36,3,FALSE)","v":""},{"$f":"VLOOKUP(CS5,'PERF 50m'!$B$5:$D$36,3,FALSE)","v":""}]
{"$rows_left_out":13}
{"sheet":"REFERENTIELS","index":3,"n_rows":86,"n_cols":25,"rows_kept":86,"cut":false,"hidden":false,"merged":[[10,21,10,22],[11,12,11,13],[11,14,11,15],[11,17,11,18],[11,19,11,20],[11,21,11,22],[3,2,3,7],[3,8,3,24],[4,2,4,7],[4,8,4,24],[5,4,5,11],[5,12,5,24],[8,21,8,22],[9,12,9,13],[9,14,9,15],[9,17,9,18],[9,19,9,20],[9,21,9,22],[6,21,6,22],[7,12,7,13],[7,14,7,15],[7,17,7,18],[7,19,7,20],[7,21,7,22],[6,12,6,13],[6,14,6,15],[6,17,6,18],[6,19,6,20],[8,12,8,13],[8,14,8,15],[16,13,16,14],[16,15,16,17],[16,18,16,19],[8,17,8,18],[8,19,8,20],[10,12,10,13],[10,14,10,15],[10,17,10,18],[10,19,10,20],[20,17,20,18],[20,19,20,20],[20,21,20,22],[12,12,12,13],[12,14,12,15],[12,17,12,18],[12,19,12,20],[12,21,12,22],[13,3,18,3],[13,4,18,7],[13,10,13,11],[13,13,13,14],[13,15,13,17],[6,3,12,3],[13,18,13,19],[13,20,13,21],[13,22,13,24],[14,10,14,11],[14,13,14,14],[14,15,14,17],[14,18,14,19],[14,20,14,21],[14,22,14,24],[16,10,16,11],[19,17,19,18],[19,19,19,20],[19,21,19,22],[17,10,17,11],[17,13,17,14],[17,15,17,17],[17,18,17,19],[17,20,17,21],[17,22,17,24],[21,12,21,13],[21,14,21,15],[21,17,21,18],[21,19,21,20],[21,21,21,22],[18,10,18,11],[18,12,18,17],[18,18,18,24],[6,2,12,2],[13,2,18,2],[20,12,20,13],[20,14,20,15],[16,20,16,21],[16,22,16,24],[15,10,15,11],[15,13,15,14],[15,15,15,17],[15,18,15,19],[15,20,15,21],[15,22,15,24],[19,2,25,2],[19,3,25,3],[19,12,19,13],[19,14,19,15],[24,12,24,13],[24,14,24,15],[24,17,24,18],[24,19,24,20],[24,21,24,22],[25,12,25,13],[25,14,25,15],[25,17,25,18],[25,19,25,20],[25,21,25,22],[22,12,22,13],[22,14,22,15],[22,17,22,18],[22,19,22,20],[22,21,22,22],[23,12,23,13],[23,14,23,15],[23,17,23,18],[23,19,23,20],[23,21,23,22],[35,2,35,7],[35,8,35,24],[36,2,36,7],[36,8,36,24],[37,4,37,11],[37,12,37,24],[26,4,26,7],[26,8,26,11],[26,12,26,17],[26,18,26,24],[40,21,40,22],[41,12,41,13],[41,14,41,15],[41,17,41,18],[41,19,41,20],[41,21,41,22],[38,21,38,22],[39,12,39,13],[39,14,39,15],[39,17,39,18],[39,19,39,20],[39,21,39,22],[38,12,38,13],[38,14,38,15],[38,17,38,18],[38,19,38,20],[40,12,40,13],[40,14,40,15],[40,17,40,18],[40,19,40,20],[42,12,42,13],[42,14,42,15],[42,17,42,18],[42,19,42,20],[42,21,42,22],[43,12,43,13],[43,14,43,15],[43,17,43,18],[43,19,43,20],[43,21,43,22],[44,12,44,13],[44,14,44,15],[44,17,44,18],[44,19,44,20],[44,21,44,22],[45,3,50,3],[45,4,50,7],[45,10,45,11],[45,13,45,14],[45,15,45,17],[38,3,44,3],[47,10,47,11],[47,13,47,14],[47,15,47,17],[47,18,47,19],[47,20,47,21],[47,22,47,24],[45,18,45,19],[45,20,45,21],[45,22,45,24],[46,10,46,11],[46,13,46,14],[46,15,46,17],[46,18,46,19],[46,20,46,21],[46,22,46,24],[49,10,49,11],[49,13,49,14],[49,15,49,17],[49,18,49,19],[49,20,49,21],[49,22,49,24],[48,10,48,11],[48,13,48,14],[48,15,48,17],[48,18,48,19],[48,20,48,21],[48,22,48,24],[51,3,57,3],[51,12,51,13],[51,14,51,15],[51,17,51,18],[51,19,51,20],[51,21,51,22],[55,19,55,20],[55,21,55,22],[52,12,52,13],[52,14,52,15],[52,17,52,18],[52,19,52,20],[52,21,52,22],[53,12,53,13],[53,14,53,15],[53,17,53,18],[53,19,53,20],[53,21,53,22],[38,2,44,2],[45,2,50,2],[56,12,56,13],[56,14,56,15],[56,17,56,18],[56,19,56,20],[56,21,56,22],[57,12,57,13],[57,14,57,15],[57,17,57,18],[57,19,57,20],[57,21,57,22],[54,12,54,13],[54,14,54,15],[54,17,54,18],[54,19,54,20],[54,21,54,22],[55,12,55,13],[55,14,55,15],[55,17,55,18],[50,10,50,11],[50,12,50,17],[50,18,50,24],[51,2,57,2],[63,2,63,7],[63,8,63,24],[64,4,64,11],[64,12,64,24],[65,2,71,2],[65,3,71,3],[58,4,58,7],[58,8,58,11],[58,12,58,17],[58,18,58,24],[65,4,65,5],[65,6,65,7],[65,8,65,9],[65,10,65,11],[65,12,65,15],[65,16,65,18],[65,19,65,22],[65,23,65,24],[66,4,71,5],[66,6,71,7],[66,8,71,9],[66,12,71,15],[66,10,71,11],[66,16,71,18],[72,4,77,7],[72,10,72,11],[72,13,72,14],[72,15,72,17],[72,18,72,19],[72,20,72,21],[72,22,72,24],[73,10,73,11],[73,13,73,14],[73,15,73,17],[73,18,73,19],[73,20,73,21],[73,22,73,24],[74,10,74,11],[74,13,74,14],[74,15,74,17],[74,18,74,19],[74,20,74,21],[74,22,74,24],[75,10,75,11],[75,13,75,14],[75,15,75,17],[75,18,75,19],[75,20,75,21],[78,17,78,18],[78,19,78,20],[78,21,78,22],[79,12,79,13],[79,14,79,15],[79,17,79,18],[79,19,79,20],[79,21,79,22],[80,12,80,13],[80,14,80,15],[80,17,80,18],[80,19,80,20],[80,21,80,22],[81,12,81,13],[81,14,81,15],[81,17,81,18],[81,19,81,20],[72,2,77,2],[72,3,77,3],[66,19,71,22],[66,23,71,24],[81,21,81,22],[77,10,77,11],[77,12,77,17],[75,22,75,24],[76,10,76,11],[76,13,76,14],[76,15,76,17],[76,18,76,19],[76,20,76,21],[76,22,76,24],[77,18,77,24],[78,2,84,2],[78,3,84,3],[78,12,78,13],[78,14,78,15],[84,12,84,13],[84,14,84,15],[84,17,84,18],[84,19,84,20],[84,21,84,22],[85,4,85,7],[85,8,85,11],[85,12,85,17],[85,18,85,24],[82,12,82,13],[82,14,82,15],[82,17,82,18],[82,19,82,20],[82,21,82,22],[83,12,83,13],[83,14,83,15],[83,17,83,18],[83,19,83,20],[83,21,83,22]]}
[]
[]
[null,null,"RELAIS-VITESSE N3"]
[null,null,"COMPETENCES ATTENDUES",null,null,null,null,null,"PRINCIPES D’ELABORATION DE L’EPREUVE"]
[null,null,"NIVEAU 3 :\nPour produire la meilleure performance, coordonner les vitesses de course du donneur et du receveur et assurer une transmission valide dans une course sécurisée.",null,null,null,null,null,"1. Chaque élève réalise un 50 mètres départ en starting-blocks commandé par un signal extérieur (2 essais sont possibles).\n2. Les équipes de relais (1) effectuent chacune 2 parcours de 4 x 50 mètres, départ en starting-blocks  commandé. Lors de la 2ième tentative les coureurs changent de place de la façon suivante :le poste 1passe au 2 , le poste 4 passe au 3 et réciproquement. Lorsque le témoin ne franchit pas la ligne d’arrivée, un essai supplémentaire est accordé afin de pouvoir comparer les 2  tentatives (et ceci  dans chacun des cas).\nLes zones de transmissions et d’élan sont les zones conventionnelles fédérales (10 m d’élan, 20 m de transmission). Chaque élève est noté selon les critères suivants :\nPour 25 % sur sa performance sur 50 mètres individuel.\nPour 25 % sur la différence entre la somme des temps réalisés sur 50 m. des 4 relayeurs, et le meilleur  temps des 2 relais effectués. Pour 25 % sur la somme des 2  performances réalisées lors des 2 parcours de relais, dont l’un avec changement des postes 1-2/3-4. Pour 25 % sur l’échauffement avant l’épreuve,  la récupération après l’effort, et  la validation des zones de transmission."]
[null,null,"POINTS A AFFECTER","ELEMENTS A EVALUER","COMPETENCE DE NIVEAU 3 EN COURS D’ACQUISITION\nDe 0 à 09 pts",null,null,null,null,null,null,null,"COMPETENCE DE NIVEAU 3 ACQUISE\nDe 10 à 20 pts"]
{"$rows_left_out":81}
{"sheet":"APPEL","index":4,"n_rows":38,"n_cols":28,"rows_kept":38,"cut":false,"hidden":false,"merged":[[0,19,0,20],[0,22,0,23],[0,25,0,26],[0,1,0,2],[0,4,0,5],[0,7,0,8],[0,10,0,11],[0,13,0,14],[0,16,0,17]]}
[null,"1TU-GA",null,null,"1TU-GA2",null,null,"1COMELEC",null,null,"TTU TELEC",null,null,"1GA",null,null,"1TU",null,null,"STAGE"]
[null,"NOMS","PRENOMS","sexe","NOMS","PRENOMS","sexe","NOMS","PRENOMS","sexe","NOMS","PRENOMS","sexe","NOMS","PRENOMS","sexe","NOMS","PRENOMS","sexe","NOMS","PRENOMS","sexe","NOMS","PRENOMS","sexe","NOMS","PRENOMS","sexe"]
[1,null,"Abraham","g",null,"Ali Malek","g",null,"Abdelmalik","g",null,"Amir","g"]
[2,null,"Aimane","f",null,"Aline","f",null,"Hamza","g",null,"Yacine","g"]
[3,null,"Amel","f",null,"Alya","f",null,"Wassim","g",null,"Emre","g"]
[4,null,"Amira","f",null,"Amine","g",null,"Erol","g",null,"Emin","g"]
{"$rows_left_out":33}
{"sheet":"DEBUT","index":5,"n_rows":305,"n_cols":51,"rows_kept":305,"cut":false,"hidden":false,"merged":[]}
[]
[]
[]
[null,"Sexe",null,"PERF /50m",null,"Niveau",null,"Temps G","Temps F","Note","/","Indice transmission","Note IT","x","1 seule Perf 4x50","Perf cumulées 4x50 G","Perf cumulées 4x50 F","Note 4x50 F","*","Echauffement","Note Echauffement","-","Transmission valide","Note transmission",null,"MARQUES","TRANSMISSION","POSTE",null,"PIEDS",null,"PERF",null,null,"Temps G","Temps F","Note","/","Indice transmission","Note IT","x","1 seule Perf 4x50","Perf cumulées 4x50 G","Perf cumulées 4x50 F","Note 4x50","*","Echauffement","Note Echauffement","-","Transmission valide","Note transmission"]
[null,"F",null,null,null,"N3",null,null,null,null,null,-30,5,null,20,38,38,5,null,"Echauffement progressif, étirements appropriés, vérification des marques de passages. Récupération active après les efforts (étirements, trottin).",2.5,null,"Chaque coureur concerné par trois charnières de relais réalise trois transmissions valides",2.5,null,"aucune","Ratée","aucune position",null,0,null,0,null,null,null,null,null,null,-30,5,null,null,30,30,5,null,"Echauffement progressif, étirements appropriés, vérification des marques de passages. Récupération active après les efforts (étirements, trottin).",2.5,null,"Chaque coureur concerné par trois charnières de relais réalise trois transmissions valides",2.5]
[null,"G",null,5.8,null,"N4",null,4,4,5,null,-2,5,null,20.100000000000001,43.5,null,5,null,"Echauffement pertinent, étirements présents mais succincts, peu de vérification de marques. Récupération après l’effort sous forme de trotting léger.",1.5,null,"Chaque coureur concerné par trois charnières de relais réalise deux transmissions valides",1.5,null,"inadaptées","Tamponne ou double","Position indéquate",null,1,null,1,null,null,4,4,5,null,-2,5,null,20.100000000000001,51.6,58.399999999999899,5,null,"Echauffement pertinent, étirements présents mais succincts, peu de vérification de marques. Récupération après l’effort sous forme de trotting léger.",1.5,null,"Chaque coureur concerné par trois charnières de relais réalise deux transmissions valides",1.5]
{"$rows_left_out":299}