{"text_format":"1","workbook":"xlsx","n_sheets":3,"sheets":["Explications","Gestion","appel"],"not_rendered":{"charts":0,"images":2,"macros":1,"external_links":1,"defined_names":6,"comments":1,"pivot_tables":0},"unopened":[],"bounds":{"document_bytes":16777216,"sheet_cells":100000,"rows_first":2000,"rows_last":500,"rows_between":2000,"halvings":0,"cell_chars":16384,"cell_head_chars":4096},"cells_cut":0,"cells_raw":0,"read":"whole","date_system":"1900"}

{"sheet":"Explications","index":0,"n_rows":19,"n_cols":5,"rows_kept":19,"cut":false,"hidden":false,"merged":[[0,0,1,7],[21,2,21,3],[18,2,18,3]]}
["Ce document permet de gérer plus efficacement les joueurs de l'AS"]
[]
[]
["Vous devez utiliser la feuille \"Gestion\" pour remplir les données de vos joueurs"]
[]
[]
["1) Vous ne pouvez remplir que les cellules colorées, les autres sont protégées."]
[]
["2) Rentrer \"2012\" pour la période scolaire 2012 / 2013."]
[]
["2) Saisisser les noms, prénoms, sexe etc.. ou faire un \"copier coller\" de votre liste."]
[]
["3) Utiliser le bouton \"trier\" pour classer vos licenciés."]
[]
["4) Attention le bouton \"gomme\" efface toutes les données."]
[]
["5) Pour imprimer, sélectionner la feuille et appuyez sur \" ctrl + P \"."]
[]
[null,null,"Contacter l'auteur:",null,"cleaut@free.fr"]

{"sheet":"Gestion","index":1,"n_rows":74,"n_cols":19,"rows_kept":74,"cut":false,"hidden":false,"merged":[[1,0,1,11],[3,3,3,6],[10,13,10,17]]}
[]
["LISTE DES JOUEURS DE --??--"]
[null,null,null,2012]
[null,null,null,"Nombre de licenciés",null,null,null,{"$f":"COUNT($I$12:$I62)","v":9},{"$f":"COUNTA($C$12:$C$61)","v":11}]
[null,null,null,"BF",{"$f":"COUNTIF($J$12:$J$74,\"Benj F\")","v":4},{"$f":"COUNTIF($S$12:$S$73,\"Cbenj F\")+COUNTIF($S$12:$S$73,\".SSVBbenj F\") & \" BF\"","v":"2 BF"},"BG",{"$f":"COUNTIF($J$12:$J$74,\"Benj G\")","v":1},{"$f":"COUNTIF($S$12:$S$73,\"cBenj G\")+COUNTIF($S$12:$S$73,\".SSVBBenj G\")& \" BG\"","v":"0 BG"}]
[null,null,null,"MF",{"$f":"COUNTIF($J$12:$J$74,\"Minime F\")","v":1},{"$f":"COUNTIF($S$12:$S$73,\"cMinime F\")+COUNTIF($S$12:$S$73,\".SSVBMinime F\")&\" MF\"","v":"1 MF"},"MG",{"$f":"COUNTIF($J$12:$J$74,\"Minime G\")","v":3},{"$f":"COUNTIF($S$12:$S$73,\"cMinime G\")+COUNTIF($S$12:$S$73,\".SSVBMinime G\")& \" MG\"","v":"2 MG"}]
[null,null,null,"CF",{"$f":"COUNTIF($J$12:$J$74,\"Cadette\")","v":0},{"$f":"COUNTIF($S$12:$S$73,\"cCadette\")+COUNTIF($S$12:$S$73,\".SSVBCadette\")& \" CF\"","v":"0 CF"},"CG",{"$f":"COUNTIF($J$12:$J$74,\"Cadet\")","v":0},{"$f":"COUNTIF($S$12:$S$73,\"cCadet G\")+COUNTIF($S$12:$S$73,\".SSVBCadet G\")& \" CG\"","v":"0 CG"}]
[null,null,null,"JF",{"$f":"COUNTIF($J$12:$J$74,\"Junior F\")","v":0},{"$f":"COUNTIF($S$12:$S$73,\"cJunior F\")+COUNTIF($S$12:$S$73,\".SSVBJunior F\")& \" JF\"","v":"0 JF"},"JG",{"$f":"COUNTIF($J$12:$J$74,\"Junior G\")","v":0},{"$f":"COUNTIF($S$12:$S$73,\"cJunior G\")+COUNTIF($S$12:$S$73,\".SSVBJunior G\")& \" JG\"","v":"0 JG"}]
[null,null,null,"SF",{"$f":"COUNTIF($J$12:$J$74,\"Senior F\")","v":0},{"$f":"COUNTIF($S$12:$S$73,\"cSenior F\")+COUNTIF($S$12:$S$73,\".SSVBSenior F\")& \" SF\"","v":"0 SF"},"SG",{"$f":"COUNTIF($J$12:$J$74,\"Senior G\")","v":0},{"$f":"COUNTIF($S$12:$S$73,\"cSenior G\")+COUNTIF($S$12:$S$73,\".SSVBSenior G\")& \" SG\"","v":"0 SG"}]
[]
[null,"Loisir\nou\nCompét","Sexe","Nom","Prénom","classe","Date nais","age","N° DE LICENCE","CAT","*","tel",null,"CATEGORIES D'AGE"]
[1,"c","F","RAMON","Aurélia",61,"2001-10-21",{"$f":"IF(G12=\"\",\"\",$D$3-YEAR(G12))","v":11},74,{"$f":"IF($G12=\"\",\"\",IF($I12=\"\",\"\",IF(C12=\"f\",LOOKUP($H12,$N$12:$N$23,$P$12:$P$23),LOOKUP($H12,$N$12:$N$23,$O$12:$O$23))))","v":"Benj F"},{"$f":"IF(H12=\"\",\"\",IF(H12=12,\"*M\",IF(H12=14,\"*C\",IF(H12=16,\"*J\",\"\"))))","v":""},null,null,9,"Poussin G","Poussin F",null,null,{"$f":"$B12&$J12","v":"cBenj F"}]
[2,"C","F","OUERTAI","Shaïma",51,"2000-04-21",{"$f":"IF(G13=\"\",\"\",$D$3-YEAR(G13))","v":12},6,{"$f":"IF($G13=\"\",\"\",IF($I13=\"\",\"\",IF(C13=\"f\",LOOKUP($H13,$N$12:$N$23,$P$12:$P$23),LOOKUP($H13,$N$12:$N$23,$O$12:$O$23))))","v":"Benj F"},{"$f":"IF(H13=\"\",\"\",IF(H13=12,\"*M\",IF(H13=14,\"*C\",IF(H13=16,\"*J\",\"\"))))","v":"*M"},null,null,10,"Benj G","Benj F",null,null,{"$f":"$B13&$J13","v":"CBenj F"}]
[3,"C","F","ABDODU","Nouslati",51,"1999-12-27",{"$f":"IF(G14=\"\",\"\",$D$3-YEAR(G14))","v":13},8,{"$f":"IF($G14=\"\",\"\",IF($I14=\"\",\"\",IF(C14=\"f\",LOOKUP($H14,$N$12:$N$23,$P$12:$P$23),LOOKUP($H14,$N$12:$N$23,$O$12:$O$23))))","v":"Minime F"},{"$f":"IF(H14=\"\",\"\",IF(H14=12,\"*M\",IF(H14=14,\"*C\",IF(H14=16,\"*J\",\"\"))))","v":""},601020304,null,11,"Benj G","Benj F",null,null,"CMinime F"]
[4,"C","G","POLO","Tristan",41,"1999-03-18",{"$f":"IF(G15=\"\",\"\",$D$3-YEAR(G15))","v":13},null,{"$f":"IF($G15=\"\",\"\",IF($I15=\"\",\"\",IF(C15=\"f\",LOOKUP($H15,$N$12:$N$23,$P$12:$P$23),LOOKUP($H15,$N$12:$N$23,$O$12:$O$23))))","v":""},{"$f":"IF(H15=\"\",\"\",IF(H15=12,\"*M\",IF(H15=14,\"*C\",IF(H15=16,\"*J\",\"\"))))","v":""},null,null,12,"Benj G","Benj F","Surclassement possible",null,"C"]
[5,"C","G","LEROUSA","Nicolas",41,"1998-05-08",{"$f":"IF(G16=\"\",\"\",$D$3-YEAR(G16))","v":14},null,{"$f":"IF($G16=\"\",\"\",IF($I16=\"\",\"\",IF(C16=\"f\",LOOKUP($H16,$N$12:$N$23,$P$12:$P$23),LOOKUP($H16,$N$12:$N$23,$O$12:$O$23))))","v":""},{"$f":"IF(H16=\"\",\"\",IF(H16=12,\"*M\",IF(H16=14,\"*C\",IF(H16=16,\"*J\",\"\"))))","v":"*C"},null,null,13,"Minime G","Minime F",null,null,"C"]
[6,"C","G","CARDINO","Mathis",null,"1999-05-11",{"$f":"IF(G17=\"\",\"\",$D$3-YEAR(G17))","v":13},1,{"$f":"IF($G17=\"\",\"\",IF($I17=\"\",\"\",IF(C17=\"f\",LOOKUP($H17,$N$12:$N$23,$P$12:$P$23),LOOKUP($H17,$N$12:$N$23,$O$12:$O$23))))","v":"Minime G"},{"$f":"IF(H17=\"\",\"\",IF(H17=12,\"*M\",IF(H17=14,\"*C\",IF(H17=16,\"*J\",\"\"))))","v":""},null,null,14,"Minime G","Minime F","Surclassement possible",null,"CMinime G"]
[7,"c","g","SANSAI","Pablo",53,"1999-04-13",{"$f":"IF(G18=\"\",\"\",$D$3-YEAR(G18))","v":13},66,{"$f":"IF($G18=\"\",\"\",IF($I18=\"\",\"\",IF(C18=\"f\",LOOKUP($H18,$N$12:$N$23,$P$12:$P$23),LOOKUP($H18,$N$12:$N$23,$O$12:$O$23))))","v":"Minime G"},{"$f":"IF(H18=\"\",\"\",IF(H18=12,\"*M\",IF(H18=14,\"*C\",IF(H18=16,\"*J\",\"\"))))","v":""},null,null,15,"Cadet","Cadette",null,null,"cMinime G"]
[8,"l","F","DRADON","Kenza",61,"2001-01-21",{"$f":"IF(G19=\"\",\"\",$D$3-YEAR(G19))","v":11},75,{"$f":"IF($G19=\"\",\"\",IF($I19=\"\",\"\",IF(C19=\"f\",LOOKUP($H19,$N$12:$N$23,$P$12:$P$23),LOOKUP($H19,$N$12:$N$23,$O$12:$O$23))))","v":"Benj F"},{"$f":"IF(H19=\"\",\"\",IF(H19=12,\"*M\",IF(H19=14,\"*C\",IF(H19=16,\"*J\",\"\"))))","v":""},null,null,16,"Cadet","Cadette","Surclassement possible",null,"lBenj F"]
[9,"L","F","MANGIN","Mercedes",61,"2001-02-27",{"$f":"IF(G20=\"\",\"\",$D$3-YEAR(G20))","v":11},81,{"$f":"IF($G20=\"\",\"\",IF($I20=\"\",\"\",IF(C20=\"f\",LOOKUP($H20,$N$12:$N$23,$P$12:$P$23),LOOKUP($H20,$N$12:$N$23,$O$12:$O$23))))","v":"Benj F"},{"$f":"IF(H20=\"\",\"\",IF(H20=12,\"*M\",IF(H20=14,\"*C\",IF(H20=16,\"*J\",\"\"))))","v":""},null,null,17,"Junior G","Junior F",null,null,"LBenj F"]
[10,"L","G","MAURA","Pierrick",61,"2000-11-06",{"$f":"IF(G21=\"\",\"\",$D$3-YEAR(G21))","v":12},999999999,{"$f":"IF($G21=\"\",\"\",IF($I21=\"\",\"\",IF(C21=\"f\",LOOKUP($H21,$N$12:$N$23,$P$12:$P$23),LOOKUP($H21,$N$12:$N$23,$O$12:$O$23))))","v":"Benj G"},{"$f":"IF(H21=\"\",\"\",IF(H21=12,\"*M\",IF(H21=14,\"*C\",IF(H21=16,\"*J\",\"\"))))","v":"*M"},null,null,18,"Junior G","Junior F",null,null,"LBenj G"]
[11,"L","G","FALLINSZE","Alasan",41,"1998-07-04",{"$f":"IF(G22=\"\",\"\",$D$3-YEAR(G22))","v":14},64,{"$f":"IF($G22=\"\",\"\",IF($I22=\"\",\"\",IF(C22=\"f\",LOOKUP($H22,$N$12:$N$23,$P$12:$P$23),LOOKUP($H22,$N$12:$N$23,$O$12:$O$23))))","v":"Minime G"},{"$f":"IF(H22=\"\",\"\",IF(H22=12,\"*M\",IF(H22=14,\"*C\",IF(H22=16,\"*J\",\"\"))))","v":"*C"},null,null,19,"Senior G","Senior F",null,null,"LMinime G"]
[12,null,null,null,null,null,null,{"$f":"IF(G23=\"\",\"\",$D$3-YEAR(G23))","v":""},null,{"$f":"IF($G23=\"\",\"\",IF($I23=\"\",\"\",IF(C23=\"f\",LOOKUP($H23,$N$12:$N$23,$P$12:$P$23),LOOKUP($H23,$N$12:$N$23,$O$12:$O$23))))","v":""},{"$f":"IF(H23=\"\",\"\",IF(H23=12,\"*M\",IF(H23=14,\"*C\",IF(H23=16,\"*J\",\"\"))))","v":""},null,null,20,"Senior G","Senior F",null,null,""]
[13,null,null,null,null,null,null,{"$f":"IF(G24=\"\",\"\",$D$3-YEAR(G24))","v":""},null,{"$f":"IF($G24=\"\",\"\",IF($I24=\"\",\"\",IF(C24=\"f\",LOOKUP($H24,$N$12:$N$23,$P$12:$P$23),LOOKUP($H24,$N$12:$N$23,$O$12:$O$23))))","v":""},{"$f":"IF(H24=\"\",\"\",IF(H24=12,\"*M\",IF(H24=14,\"*C\",IF(H24=16,\"*J\",\"\"))))","v":""},null,null,null,null,null,null,null,""]
[14,null,null,null,null,null,null,{"$f":"IF(G25=\"\",\"\",$D$3-YEAR(G25))","v":""},null,{"$f":"IF($G25=\"\",\"\",IF($I25=\"\",\"\",IF(C25=\"f\",LOOKUP($H25,$N$12:$N$23,$P$12:$P$23),LOOKUP($H25,$N$12:$N$23,$O$12:$O$23))))","v":""},{"$f":"IF(H25=\"\",\"\",IF(H25=12,\"*M\",IF(H25=14,\"*C\",IF(H25=16,\"*J\",\"\"))))","v":""},null,null,null,null,null,null,null,""]
[15,null,null,null,null,null,null,{"$f":"IF(G26=\"\",\"\",$D$3-YEAR(G26))","v":""},null,{"$f":"IF($G26=\"\",\"\",IF($I26=\"\",\"\",IF(C26=\"f\",LOOKUP($H26,$N$12:$N$23,$P$12:$P$23),LOOKUP($H26,$N$12:$N$23,$O$12:$O$23))))","v":""},{"$f":"IF(H26=\"\",\"\",IF(H26=12,\"*M\",IF(H26=14,\"*C\",IF(H26=16,\"*J\",\"\"))))","v":""},null,null,null,null,null,null,null,""]
[16,null,null,null,null,null,null,{"$f":"IF(G27=\"\",\"\",$D$3-YEAR(G27))","v":""},null,{"$f":"IF($G27=\"\",\"\",IF($I27=\"\",\"\",IF(C27=\"f\",LOOKUP($H27,$N$12:$N$23,$P$12:$P$23),LOOKUP($H27,$N$12:$N$23,$O$12:$O$23))))","v":""},{"$f":"IF(H27=\"\",\"\",IF(H27=12,\"*M\",IF(H27=14,\"*C\",IF(H27=16,\"*J\",\"\"))))","v":""},null,null,null,".SSVBBenj F",null,null,null,""]
[17,null,null,null,null,null,null,{"$f":"IF(G28=\"\",\"\",$D$3-YEAR(G28))","v":""},null,{"$f":"IF($G28=\"\",\"\",IF($I28=\"\",\"\",IF(C28=\"f\",LOOKUP($H28,$N$12:$N$23,$P$12:$P$23),LOOKUP($H28,$N$12:$N$23,$O$12:$O$23))))","v":""},{"$f":"IF(H28=\"\",\"\",IF(H28=12,\"*M\",IF(H28=14,\"*C\",IF(H28=16,\"*J\",\"\"))))","v":""},null,null,null,null,null,null,null,""]
[18,null,null,null,null,null,null,{"$f":"IF(G29=\"\",\"\",$D$3-YEAR(G29))","v":""},null,{"$f":"IF($G29=\"\",\"\",IF($I29=\"\",\"\",IF(C29=\"f\",LOOKUP($H29,$N$12:$N$23,$P$12:$P$23),LOOKUP($H29,$N$12:$N$23,$O$12:$O$23))))","v":""},{"$f":"IF(H29=\"\",\"\",IF(H29=12,\"*M\",IF(H29=14,\"*C\",IF(H29=16,\"*J\",\"\"))))","v":""},null,null,null,null,null,null,null,""]
[19,null,null,null,null,null,null,{"$f":"IF(G30=\"\",\"\",$D$3-YEAR(G30))","v":""},null,{"$f":"IF($G30=\"\",\"\",IF($I30=\"\",\"\",IF(C30=\"f\",LOOKUP($H30,$N$12:$N$23,$P$12:$P$23),LOOKUP($H30,$N$12:$N$23,$O$12:$O$23))))","v":""},{"$f":"IF(H30=\"\",\"\",IF(H30=12,\"*M\",IF(H30=14,\"*C\",IF(H30=16,\"*J\",\"\"))))","v":""},null,null,null,null,null,null,null,""]
[20,null,null,null,null,null,null,{"$f":"IF(G31=\"\",\"\",$D$3-YEAR(G31))","v":""},null,{"$f":"IF($G31=\"\",\"\",IF($I31=\"\",\"\",IF(C31=\"f\",LOOKUP($H31,$N$12:$N$23,$P$12:$P$23),LOOKUP($H31,$N$12:$N$23,$O$12:$O$23))))","v":""},{"$f":"IF(H31=\"\",\"\",IF(H31=12,\"*M\",IF(H31=14,\"*C\",IF(H31=16,\"*J\",\"\"))))","v":""},null,null,null,null,null,null,null,""]
[21,null,null,null,null,null,null,{"$f":"IF(G32=\"\",\"\",$D$3-YEAR(G32))","v":""},null,{"$f":"IF($G32=\"\",\"\",IF($I32=\"\",\"\",IF(C32=\"f\",LOOKUP($H32,$N$12:$N$23,$P$12:$P$23),LOOKUP($H32,$N$12:$N$23,$O$12:$O$23))))","v":""},{"$f":"IF(H32=\"\",\"\",IF(H32=12,\"*M\",IF(H32=14,\"*C\",IF(H32=16,\"*J\",\"\"))))","v":""},null,null,null,null,null,null,null,""]
[22,null,null,null,null,null,null,{"$f":"IF(G33=\"\",\"\",$D$3-YEAR(G33))","v":""},null,{"$f":"IF($G33=\"\",\"\",IF($I33=\"\",\"\",IF(C33=\"f\",LOOKUP($H33,$N$12:$N$23,$P$12:$P$23),LOOKUP($H33,$N$12:$N$23,$O$12:$O$23))))","v":""},{"$f":"IF(H33=\"\",\"\",IF(H33=12,\"*M\",IF(H33=14,\"*C\",IF(H33=16,\"*J\",\"\"))))","v":""},null,null,null,null,null,null,null,""]
[23,null,null,null,null,null,null,{"$f":"IF(G34=\"\",\"\",$D$3-YEAR(G34))","v":""},null,{"$f":"IF($G34=\"\",\"\",IF($I34=\"\",\"\",IF(C34=\"f\",LOOKUP($H34,$N$10:$N$21,$P$10:$P$21),LOOKUP($H34,$N$10:$N$21,$O$10:$O$21))))","v":""},{"$f":"IF(H34=\"\",\"\",IF(H34=12,\"*M\",IF(H34=14,\"*C\",IF(H34=16,\"*J\",\"\"))))","v":""},null,null,null,null,null,null,null,""]
[24,null,null,null,null,null,null,{"$f":"IF(G35=\"\",\"\",$D$3-YEAR(G35))","v":""},null,{"$f":"IF($G35=\"\",\"\",IF($I35=\"\",\"\",IF(C35=\"f\",LOOKUP($H35,$N$12:$N$23,$P$12:$P$23),LOOKUP($H35,$N$12:$N$23,$O$12:$O$23))))","v":""},{"$f":"IF(H35=\"\",\"\",IF(H35=12,\"*M\",IF(H35=14,\"*C\",IF(H35=16,\"*J\",\"\"))))","v":""},null,null,null,null,null,null,null,""]
[25,null,null,null,null,null,null,{"$f":"IF(G36=\"\",\"\",$D$3-YEAR(G36))","v":""},null,{"$f":"IF($G36=\"\",\"\",IF($I36=\"\",\"\",IF(C36=\"f\",LOOKUP($H36,$N$12:$N$23,$P$12:$P$23),LOOKUP($H36,$N$12:$N$23,$O$12:$O$23))))","v":""},{"$f":"IF(H36=\"\",\"\",IF(H36=12,\"*M\",IF(H36=14,\"*C\",IF(H36=16,\"*J\",\"\"))))","v":""},null,null,null,null,null,null,null,""]
[26,null,null,null,null,null,null,{"$f":"IF(G37=\"\",\"\",$D$3-YEAR(G37))","v":""},null,{"$f":"IF($G37=\"\",\"\",IF($I37=\"\",\"\",IF(C37=\"f\",LOOKUP($H37,$N$12:$N$23,$P$12:$P$23),LOOKUP($H37,$N$12:$N$23,$O$12:$O$23))))","v":""},{"$f":"IF(H37=\"\",\"\",IF(H37=12,\"*M\",IF(H37=14,\"*C\",IF(H37=16,\"*J\",\"\"))))","v":""},null,null,null,null,null,null,null,""]
[27,null,null,null,null,null,null,{"$f":"IF(G38=\"\",\"\",$D$3-YEAR(G38))","v":""},null,{"$f":"IF($G38=\"\",\"\",IF($I38=\"\",\"\",IF(C38=\"f\",LOOKUP($H38,$N$12:$N$23,$P$12:$P$23),LOOKUP($H38,$N$12:$N$23,$O$12:$O$23))))","v":""},{"$f":"IF(H38=\"\",\"\",IF(H38=12,\"*M\",IF(H38=14,\"*C\",IF(H38=16,\"*J\",\"\"))))","v":""},null,null,null,null,null,null,null,""]
[28,null,null,null,null,null,null,{"$f":"IF(G39=\"\",\"\",$D$3-YEAR(G39))","v":""},null,{"$f":"IF($G39=\"\",\"\",IF($I39=\"\",\"\",IF(C39=\"f\",LOOKUP($H39,$N$12:$N$23,$P$12:$P$23),LOOKUP($H39,$N$12:$N$23,$O$12:$O$23))))","v":""},{"$f":"IF(H39=\"\",\"\",IF(H39=12,\"*M\",IF(H39=14,\"*C\",IF(H39=16,\"*J\",\"\"))))","v":""},null,null,null,null,null,null,null,""]
[29,null,null,null,null,null,null,{"$f":"IF(G40=\"\",\"\",$D$3-YEAR(G40))","v":""},null,{"$f":"IF($G40=\"\",\"\",IF($I40=\"\",\"\",IF(C40=\"f\",LOOKUP($H40,$N$12:$N$23,$P$12:$P$23),LOOKUP($H40,$N$12:$N$23,$O$12:$O$23))))","v":""},{"$f":"IF(H40=\"\",\"\",IF(H40=12,\"*M\",IF(H40=14,\"*C\",IF(H40=16,\"*J\",\"\"))))","v":""},null,null,null,null,null,null,null,""]
[30,null,null,null,null,null,null,{"$f":"IF(G41=\"\",\"\",$D$3-YEAR(G41))","v":""},null,{"$f":"IF($G41=\"\",\"\",IF($I41=\"\",\"\",IF(C41=\"f\",LOOKUP($H41,$N$12:$N$23,$P$12:$P$23),LOOKUP($H41,$N$12:$N$23,$O$12:$O$23))))","v":""},{"$f":"IF(H41=\"\",\"\",IF(H41=12,\"*M\",IF(H41=14,\"*C\",IF(H41=16,\"*J\",\"\"))))","v":""},null,null,null,null,null,null,null,""]
[31,null,null,null,null,null,null,{"$f":"IF(G42=\"\",\"\",$D$3-YEAR(G42))","v":""},null,{"$f":"IF($G42=\"\",\"\",IF($I42=\"\",\"\",IF(C42=\"f\",LOOKUP($H42,$N$12:$N$23,$P$12:$P$23),LOOKUP($H42,$N$12:$N$23,$O$12:$O$23))))","v":""},{"$f":"IF(H42=\"\",\"\",IF(H42=12,\"*M\",IF(H42=14,\"*C\",IF(H42=16,\"*J\",\"\"))))","v":""},null,null,null,null,null,null,null,""]
[32,null,null,null,null,null,null,{"$f":"IF(G43=\"\",\"\",$D$3-YEAR(G43))","v":""},null,{"$f":"IF($G43=\"\",\"\",IF($I43=\"\",\"\",IF(C43=\"f\",LOOKUP($H43,$N$12:$N$23,$P$12:$P$23),LOOKUP($H43,$N$12:$N$23,$O$12:$O$23))))","v":""},{"$f":"IF(H43=\"\",\"\",IF(H43=12,\"*M\",IF(H43=14,\"*C\",IF(H43=16,\"*J\",\"\"))))","v":""},null,null,null,null,null,null,null,""]
[33,null,null,null,null,null,null,{"$f":"IF(G44=\"\",\"\",$D$3-YEAR(G44))","v":""},null,{"$f":"IF($G44=\"\",\"\",IF($I44=\"\",\"\",IF(C44=\"f\",LOOKUP($H44,$N$12:$N$23,$P$12:$P$23),LOOKUP($H44,$N$12:$N$23,$O$12:$O$23))))","v":""},{"$f":"IF(H44=\"\",\"\",IF(H44=12,\"*M\",IF(H44=14,\"*C\",IF(H44=16,\"*J\",\"\"))))","v":""},null,null,null,null,null,null,null,""]
[34,null,null,null,null,null,null,{"$f":"IF(G45=\"\",\"\",$D$3-YEAR(G45))","v":""},null,{"$f":"IF($G45=\"\",\"\",IF($I45=\"\",\"\",IF(C45=\"f\",LOOKUP($H45,$N$12:$N$23,$P$12:$P$23),LOOKUP($H45,$N$12:$N$23,$O$12:$O$23))))","v":""},{"$f":"IF(H45=\"\",\"\",IF(H45=12,\"*M\",IF(H45=14,\"*C\",IF(H45=16,\"*J\",\"\"))))","v":""},null,null,null,null,null,null,null,""]
[35,null,null,null,null,null,null,{"$f":"IF(G46=\"\",\"\",$D$3-YEAR(G46))","v":""},null,{"$f":"IF($G46=\"\",\"\",IF($I46=\"\",\"\",IF(C46=\"f\",LOOKUP($H46,$N$12:$N$23,$P$12:$P$23),LOOKUP($H46,$N$12:$N$23,$O$12:$O$23))))","v":""},{"$f":"IF(H46=\"\",\"\",IF(H46=12,\"*M\",IF(H46=14,\"*C\",IF(H46=16,\"*J\",\"\"))))","v":""},null,null,null,null,null,null,null,""]
[36,null,null,null,null,null,null,{"$f":"IF(G47=\"\",\"\",$D$3-YEAR(G47))","v":""},null,{"$f":"IF($G47=\"\",\"\",IF($I47=\"\",\"\",IF(C47=\"f\",LOOKUP($H47,$N$12:$N$23,$P$12:$P$23),LOOKUP($H47,$N$12:$N$23,$O$12:$O$23))))","v":""},{"$f":"IF(H47=\"\",\"\",IF(H47=12,\"*M\",IF(H47=14,\"*C\",IF(H47=16,\"*J\",\"\"))))","v":""},null,null,null,null,null,null,null,""]
[37,null,null,null,null,null,null,{"$f":"IF(G48=\"\",\"\",$D$3-YEAR(G48))","v":""},null,{"$f":"IF($G48=\"\",\"\",IF($I48=\"\",\"\",IF(C48=\"f\",LOOKUP($H48,$N$12:$N$23,$P$12:$P$23),LOOKUP($H48,$N$12:$N$23,$O$12:$O$23))))","v":""},{"$f":"IF(H48=\"\",\"\",IF(H48=12,\"*M\",IF(H48=14,\"*C\",IF(H48=16,\"*J\",\"\"))))","v":""},null,null,null,null,null,null,null,""]
[38,null,null,null,null,null,null,{"$f":"IF(G49=\"\",\"\",$D$3-YEAR(G49))","v":""},null,{"$f":"IF($G49=\"\",\"\",IF($I49=\"\",\"\",IF(C49=\"f\",LOOKUP($H49,$N$12:$N$23,$P$12:$P$23),LOOKUP($H49,$N$12:$N$23,$O$12:$O$23))))","v":""},{"$f":"IF(H49=\"\",\"\",IF(H49=12,\"*M\",IF(H49=14,\"*C\",IF(H49=16,\"*J\",\"\"))))","v":""},null,null,null,null,null,null,null,""]
[39,null,null,null,null,null,null,{"$f":"IF(G50=\"\",\"\",$D$3-YEAR(G50))","v":""},null,{"$f":"IF($G50=\"\",\"\",IF($I50=\"\",\"\",IF(C50=\"f\",LOOKUP($H50,$N$12:$N$23,$P$12:$P$23),LOOKUP($H50,$N$12:$N$23,$O$12:$O$23))))","v":""},{"$f":"IF(H50=\"\",\"\",IF(H50=12,\"*M\",IF(H50=14,\"*C\",IF(H50=16,\"*J\",\"\"))))","v":""},null,null,null,null,null,null,null,""]
[40,null,null,null,null,null,null,{"$f":"IF(G51=\"\",\"\",$D$3-YEAR(G51))","v":""},null,{"$f":"IF($G51=\"\",\"\",IF($I51=\"\",\"\",IF(C51=\"f\",LOOKUP($H51,$N$12:$N$23,$P$12:$P$23),LOOKUP($H51,$N$12:$N$23,$O$12:$O$23))))","v":""},{"$f":"IF(H51=\"\",\"\",IF(H51=12,\"*M\",IF(H51=14,\"*C\",IF(H51=16,\"*J\",\"\"))))","v":""},null,null,null,null,null,null,null,""]
[41,null,null,null,null,null,null,{"$f":"IF(G52=\"\",\"\",$D$3-YEAR(G52))","v":""},null,{"$f":"IF($G52=\"\",\"\",IF($I52=\"\",\"\",IF(C52=\"f\",LOOKUP($H52,$N$12:$N$23,$P$12:$P$23),LOOKUP($H52,$N$12:$N$23,$O$12:$O$23))))","v":""},{"$f":"IF(H52=\"\",\"\",IF(H52=12,\"*M\",IF(H52=14,\"*C\",IF(H52=16,\"*J\",\"\"))))","v":""},null,null,null,null,null,null,null,""]
[42,null,null,null,null,null,null,{"$f":"IF(G53=\"\",\"\",$D$3-YEAR(G53))","v":""},null,{"$f":"IF($G53=\"\",\"\",IF($I53=\"\",\"\",IF(C53=\"f\",LOOKUP($H53,$N$12:$N$23,$P$12:$P$23),LOOKUP($H53,$N$12:$N$23,$O$12:$O$23))))","v":""},{"$f":"IF(H53=\"\",\"\",IF(H53=12,\"*M\",IF(H53=14,\"*C\",IF(H53=16,\"*J\",\"\"))))","v":""},null,null,null,null,null,null,null,""]
[43,null,null,null,null,null,null,{"$f":"IF(G54=\"\",\"\",$D$3-YEAR(G54))","v":""},null,{"$f":"IF($G54=\"\",\"\",IF($I54=\"\",\"\",IF(C54=\"f\",LOOKUP($H54,$N$12:$N$23,$P$12:$P$23),LOOKUP($H54,$N$12:$N$23,$O$12:$O$23))))","v":""},{"$f":"IF(H54=\"\",\"\",IF(H54=12,\"*M\",IF(H54=14,\"*C\",IF(H54=16,\"*J\",\"\"))))","v":""},null,null,null,null,null,null,null,""]
[44,null,null,null,null,null,null,{"$f":"IF(G55=\"\",\"\",$D$3-YEAR(G55))","v":""},null,{"$f":"IF($G55=\"\",\"\",IF($I55=\"\",\"\",IF(C55=\"f\",LOOKUP($H55,$N$12:$N$23,$P$12:$P$23),LOOKUP($H55,$N$12:$N$23,$O$12:$O$23))))","v":""},{"$f":"IF(H55=\"\",\"\",IF(H55=12,\"*M\",IF(H55=14,\"*C\",IF(H55=16,\"*J\",\"\"))))","v":""},null,null,null,null,null,null,null,""]
[45,null,null,null,null,null,null,{"$f":"IF(G56=\"\",\"\",$D$3-YEAR(G56))","v":""},null,{"$f":"IF($G56=\"\",\"\",IF($I56=\"\",\"\",IF(C56=\"f\",LOOKUP($H56,$N$12:$N$23,$P$12:$P$23),LOOKUP($H56,$N$12:$N$23,$O$12:$O$23))))","v":""},{"$f":"IF(H56=\"\",\"\",IF(H56=12,\"*M\",IF(H56=14,\"*C\",IF(H56=16,\"*J\",\"\"))))","v":""},null,null,null,null,null,null,null,""]
[46,null,null,null,null,null,null,{"$f":"IF(G57=\"\",\"\",$D$3-YEAR(G57))","v":""},null,{"$f":"IF($G57=\"\",\"\",IF($I57=\"\",\"\",IF(C57=\"f\",LOOKUP($H57,$N$12:$N$23,$P$12:$P$23),LOOKUP($H57,$N$12:$N$23,$O$12:$O$23))))","v":""},{"$f":"IF(H57=\"\",\"\",IF(H57=12,\"*M\",IF(H57=14,\"*C\",IF(H57=16,\"*J\",\"\"))))","v":""},null,null,null,null,null,null,null,""]
[47,null,null,null,null,null,null,{"$f":"IF(G58=\"\",\"\",$D$3-YEAR(G58))","v":""},null,{"$f":"IF($G58=\"\",\"\",IF($I58=\"\",\"\",IF(C58=\"f\",LOOKUP($H58,$N$12:$N$23,$P$12:$P$23),LOOKUP($H58,$N$12:$N$23,$O$12:$O$23))))","v":""},{"$f":"IF(H58=\"\",\"\",IF(H58=12,\"*M\",IF(H58=14,\"*C\",IF(H58=16,\"*J\",\"\"))))","v":""},null,null,null,null,null,null,null,""]
[48,null,null,null,null,null,null,{"$f":"IF(G59=\"\",\"\",$D$3-YEAR(G59))","v":""},null,{"$f":"IF($G59=\"\",\"\",IF($I59=\"\",\"\",IF(C59=\"f\",LOOKUP($H59,$N$12:$N$23,$P$12:$P$23),LOOKUP($H59,$N$12:$N$23,$O$12:$O$23))))","v":""},{"$f":"IF(H59=\"\",\"\",IF(H59=12,\"*M\",IF(H59=14,\"*C\",IF(H59=16,\"*J\",\"\"))))","v":""},null,null,null,null,null,null,null,""]
[49,null,null,null,null,null,null,{"$f":"IF(G60=\"\",\"\",$D$3-YEAR(G60))","v":""},null,{"$f":"IF($G60=\"\",\"\",IF($I60=\"\",\"\",IF(C60=\"f\",LOOKUP($H60,$N$12:$N$23,$P$12:$P$23),LOOKUP($H60,$N$12:$N$23,$O$12:$O$23))))","v":""},{"$f":"IF(H60=\"\",\"\",IF(H60=12,\"*M\",IF(H60=14,\"*C\",IF(H60=16,\"*J\",\"\"))))","v":""},null,null,null,null,null,null,null,""]
[50,null,null,null,null,null,null,{"$f":"IF(G61=\"\",\"\",$D$3-YEAR(G61))","v":""},null,{"$f":"IF($G61=\"\",\"\",IF($I61=\"\",\"\",IF(C61=\"f\",LOOKUP($H61,$N$12:$N$23,$P$12:$P$23),LOOKUP($H61,$N$12:$N$23,$O$12:$O$23))))","v":""},{"$f":"IF(H61=\"\",\"\",IF(H61=12,\"*M\",IF(H61=14,\"*C\",IF(H61=16,\"*J\",\"\"))))","v":""},null,null,null,null,null,null,null,""]
[null,null,null,null,null,null,null,null,null,null,null,null,null,null,null,null,null,null,""]
[null,null,null,null,null,null,null,null,null,null,null,null,null,null,null,null,null,null,""]
[null,null,null,null,null,null,null,null,null,null,null,null,null,null,null,null,null,null,""]
[null,null,null,null,null,null,null,null,null,null,null,null,null,null,null,null,null,null,""]
[null,null,null,null,null,null,null,null,null,null,null,null,null,null,null,null,null,null,""]
[null,null,null,null,null,null,null,null,null,null,null,null,null,null,null,null,null,null,""]
[null,null,null,null,null,null,null,null,null,null,null,null,null,null,null,null,null,null,""]
[null,null,null,null,null,null,null,null,null,null,null,null,null,null,null,null,null,null,""]
[null,null,null,null,null,null,null,null,null,null,null,null,null,null,null,null,null,null,""]
[null,null,null,null,null,null,null,null,null,null,null,null,null,null,null,null,null,null,""]
[null,null,null,null,null,null,null,null,null,null,null,null,null,null,null,null,null,null,""]
[null,null,null,null,null,null,null,null,null,null,null,null,null,null,null,null,null,null,""]
[null,null,null,null,null,null,null,null,null,null,null,null,null,null,null,null,null,null,""]

{"sheet":"appel","index":2,"n_rows":100,"n_cols":4,"rows_kept":100,"cut":false,"hidden":false,"merged":[[0,1,0,25]]}
[null," AS  VOLLEY  AS  VOLLEY  AS  VOLLEY  AS  VOLLEY"]
[]
[]
[]
[null,"classe","Nom","Prénom"]
[1,{"$f":"IF(Gestion!$F12=\"\",\"\",Gestion!$F12)","v":61},{"$f":"IF(Gestion!$D12=\"\",\"\",Gestion!$D12)","v":"RAMON"},{"$f":"IF(Gestion!$E12=\"\",\"\",Gestion!$E12)","v":"Aurélia"}]
[2,{"$f":"IF(Gestion!$F13=\"\",\"\",Gestion!$F13)","v":51},{"$f":"IF(Gestion!$D13=\"\",\"\",Gestion!$D13)","v":"OUERTAI"},{"$f":"IF(Gestion!$E13=\"\",\"\",Gestion!$E13)","v":"Shaïma"}]
[3,{"$f":"IF(Gestion!$F14=\"\",\"\",Gestion!$F14)","v":51},{"$f":"IF(Gestion!$D14=\"\",\"\",Gestion!$D14)","v":"ABDODU"},{"$f":"IF(Gestion!$E14=\"\",\"\",Gestion!$E14)","v":"Nouslati"}]
[4,{"$f":"IF(Gestion!$F15=\"\",\"\",Gestion!$F15)","v":41},{"$f":"IF(Gestion!$D15=\"\",\"\",Gestion!$D15)","v":"POLO"},{"$f":"IF(Gestion!$E15=\"\",\"\",Gestion!$E15)","v":"Tristan"}]
[5,{"$f":"IF(Gestion!$F16=\"\",\"\",Gestion!$F16)","v":41},{"$f":"IF(Gestion!$D16=\"\",\"\",Gestion!$D16)","v":"LEROUSA"},{"$f":"IF(Gestion!$E16=\"\",\"\",Gestion!$E16)","v":"Nicolas"}]
[6,{"$f":"IF(Gestion!$F17=\"\",\"\",Gestion!$F17)","v":""},{"$f":"IF(Gestion!$D17=\"\",\"\",Gestion!$D17)","v":"CARDINO"},{"$f":"IF(Gestion!$E17=\"\",\"\",Gestion!$E17)","v":"Mathis"}]
[7,{"$f":"IF(Gestion!$F18=\"\",\"\",Gestion!$F18)","v":53},{"$f":"IF(Gestion!$D18=\"\",\"\",Gestion!$D18)","v":"SANSAI"},{"$f":"IF(Gestion!$E18=\"\",\"\",Gestion!$E18)","v":"Pablo"}]
[8,{"$f":"IF(Gestion!$F19=\"\",\"\",Gestion!$F19)","v":61},{"$f":"IF(Gestion!$D19=\"\",\"\",Gestion!$D19)","v":"DRADON"},{"$f":"IF(Gestion!$E19=\"\",\"\",Gestion!$E19)","v":"Kenza"}]
[9,{"$f":"IF(Gestion!$F20=\"\",\"\",Gestion!$F20)","v":61},{"$f":"IF(Gestion!$D20=\"\",\"\",Gestion!$D20)","v":"MANGIN"},{"$f":"IF(Gestion!$E20=\"\",\"\",Gestion!$E20)","v":"Mercedes"}]
[10,{"$f":"IF(Gestion!$F21=\"\",\"\",Gestion!$F21)","v":61},{"$f":"IF(Gestion!$D21=\"\",\"\",Gestion!$D21)","v":"MAURA"},{"$f":"IF(Gestion!$E21=\"\",\"\",Gestion!$E21)","v":"Pierrick"}]
[11,{"$f":"IF(Gestion!$F22=\"\",\"\",Gestion!$F22)","v":41},{"$f":"IF(Gestion!$D22=\"\",\"\",Gestion!$D22)","v":"FALLINSZE"},{"$f":"IF(Gestion!$E22=\"\",\"\",Gestion!$E22)","v":"Alasan"}]
[12,{"$f":"IF(Gestion!$F23=\"\",\"\",Gestion!$F23)","v":""},{"$f":"IF(Gestion!$D23=\"\",\"\",Gestion!$D23)","v":""},{"$f":"IF(Gestion!$E23=\"\",\"\",Gestion!$E23)","v":""}]
[13,{"$f":"IF(Gestion!$F24=\"\",\"\",Gestion!$F24)","v":""},{"$f":"IF(Gestion!$D24=\"\",\"\",Gestion!$D24)","v":""},{"$f":"IF(Gestion!$E24=\"\",\"\",Gestion!$E24)","v":""}]
[14,{"$f":"IF(Gestion!$F25=\"\",\"\",Gestion!$F25)","v":""},{"$f":"IF(Gestion!$D25=\"\",\"\",Gestion!$D25)","v":""},{"$f":"IF(Gestion!$E25=\"\",\"\",Gestion!$E25)","v":""}]
[15,{"$f":"IF(Gestion!$F26=\"\",\"\",Gestion!$F26)","v":""},{"$f":"IF(Gestion!$D26=\"\",\"\",Gestion!$D26)","v":""},{"$f":"IF(Gestion!$E26=\"\",\"\",Gestion!$E26)","v":""}]
[16,{"$f":"IF(Gestion!$F27=\"\",\"\",Gestion!$F27)","v":""},{"$f":"IF(Gestion!$D27=\"\",\"\",Gestion!$D27)","v":""},{"$f":"IF(Gestion!$E27=\"\",\"\",Gestion!$E27)","v":""}]
[17,{"$f":"IF(Gestion!$F28=\"\",\"\",Gestion!$F28)","v":""},{"$f":"IF(Gestion!$D28=\"\",\"\",Gestion!$D28)","v":""},{"$f":"IF(Gestion!$E28=\"\",\"\",Gestion!$E28)","v":""}]
[18,{"$f":"IF(Gestion!$F29=\"\",\"\",Gestion!$F29)","v":""},{"$f":"IF(Gestion!$D29=\"\",\"\",Gestion!$D29)","v":""},{"$f":"IF(Gestion!$E29=\"\",\"\",Gestion!$E29)","v":""}]
[19,{"$f":"IF(Gestion!$F30=\"\",\"\",Gestion!$F30)","v":""},{"$f":"IF(Gestion!$D30=\"\",\"\",Gestion!$D30)","v":""},{"$f":"IF(Gestion!$E30=\"\",\"\",Gestion!$E30)","v":""}]
[20,{"$f":"IF(Gestion!$F31=\"\",\"\",Gestion!$F31)","v":""},{"$f":"IF(Gestion!$D31=\"\",\"\",Gestion!$D31)","v":""},{"$f":"IF(Gestion!$E31=\"\",\"\",Gestion!$E31)","v":""}]
[21,{"$f":"IF(Gestion!$F32=\"\",\"\",Gestion!$F32)","v":""},{"$f":"IF(Gestion!$D32=\"\",\"\",Gestion!$D32)","v":""},{"$f":"IF(Gestion!$E32=\"\",\"\",Gestion!$E32)","v":""}]
[22,{"$f":"IF(Gestion!$F33=\"\",\"\",Gestion!$F33)","v":""},{"$f":"IF(Gestion!$D33=\"\",\"\",Gestion!$D33)","v":""},{"$f":"IF(Gestion!$E33=\"\",\"\",Gestion!$E33)","v":""}]
[23,{"$f":"IF(Gestion!$F34=\"\",\"\",Gestion!$F34)","v":""},{"$f":"IF(Gestion!$D34=\"\",\"\",Gestion!$D34)","v":""},{"$f":"IF(Gestion!$E34=\"\",\"\",Gestion!$E34)","v":""}]
[24,{"$f":"IF(Gestion!$F35=\"\",\"\",Gestion!$F35)","v":""},{"$f":"IF(Gestion!$D35=\"\",\"\",Gestion!$D35)","v":""},{"$f":"IF(Gestion!$E35=\"\",\"\",Gestion!$E35)","v":""}]
[25,{"$f":"IF(Gestion!$F36=\"\",\"\",Gestion!$F36)","v":""},{"$f":"IF(Gestion!$D36=\"\",\"\",Gestion!$D36)","v":""},{"$f":"IF(Gestion!$E36=\"\",\"\",Gestion!$E36)","v":""}]
[26,{"$f":"IF(Gestion!$F37=\"\",\"\",Gestion!$F37)","v":""},{"$f":"IF(Gestion!$D37=\"\",\"\",Gestion!$D37)","v":""},{"$f":"IF(Gestion!$E37=\"\",\"\",Gestion!$E37)","v":""}]
[27,{"$f":"IF(Gestion!$F38=\"\",\"\",Gestion!$F38)","v":""},{"$f":"IF(Gestion!$D38=\"\",\"\",Gestion!$D38)","v":""},{"$f":"IF(Gestion!$E38=\"\",\"\",Gestion!$E38)","v":""}]
[28,{"$f":"IF(Gestion!$F39=\"\",\"\",Gestion!$F39)","v":""},{"$f":"IF(Gestion!$D39=\"\",\"\",Gestion!$D39)","v":""},{"$f":"IF(Gestion!$E39=\"\",\"\",Gestion!$E39)","v":""}]
[29,{"$f":"IF(Gestion!$F40=\"\",\"\",Gestion!$F40)","v":""},{"$f":"IF(Gestion!$D40=\"\",\"\",Gestion!$D40)","v":""},{"$f":"IF(Gestion!$E40=\"\",\"\",Gestion!$E40)","v":""}]
[30,{"$f":"IF(Gestion!$F41=\"\",\"\",Gestion!$F41)","v":""},{"$f":"IF(Gestion!$D41=\"\",\"\",Gestion!$D41)","v":""},{"$f":"IF(Gestion!$E41=\"\",\"\",Gestion!$E41)","v":""}]
[31,{"$f":"IF(Gestion!$F42=\"\",\"\",Gestion!$F42)","v":""},{"$f":"IF(Gestion!$D42=\"\",\"\",Gestion!$D42)","v":""},{"$f":"IF(Gestion!$E42=\"\",\"\",Gestion!$E42)","v":""}]
[32,{"$f":"IF(Gestion!$F43=\"\",\"\",Gestion!$F43)","v":""},{"$f":"IF(Gestion!$D43=\"\",\"\",Gestion!$D43)","v":""},{"$f":"IF(Gestion!$E43=\"\",\"\",Gestion!$E43)","v":""}]
[33,{"$f":"IF(Gestion!$F44=\"\",\"\",Gestion!$F44)","v":""},{"$f":"IF(Gestion!$D44=\"\",\"\",Gestion!$D44)","v":""},{"$f":"IF(Gestion!$E44=\"\",\"\",Gestion!$E44)","v":""}]
[34,{"$f":"IF(Gestion!$F45=\"\",\"\",Gestion!$F45)","v":""},{"$f":"IF(Gestion!$D45=\"\",\"\",Gestion!$D45)","v":""},{"$f":"IF(Gestion!$E45=\"\",\"\",Gestion!$E45)","v":""}]
[35,{"$f":"IF(Gestion!$F46=\"\",\"\",Gestion!$F46)","v":""},{"$f":"IF(Gestion!$D46=\"\",\"\",Gestion!$D46)","v":""},{"$f":"IF(Gestion!$E46=\"\",\"\",Gestion!$E46)","v":""}]
[36,{"$f":"IF(Gestion!$F47=\"\",\"\",Gestion!$F47)","v":""},{"$f":"IF(Gestion!$D47=\"\",\"\",Gestion!$D47)","v":""},{"$f":"IF(Gestion!$E47=\"\",\"\",Gestion!$E47)","v":""}]
[37,{"$f":"IF(Gestion!$F48=\"\",\"\",Gestion!$F48)","v":""},{"$f":"IF(Gestion!$D48=\"\",\"\",Gestion!$D48)","v":""},{"$f":"IF(Gestion!$E48=\"\",\"\",Gestion!$E48)","v":""}]
[38,{"$f":"IF(Gestion!$F49=\"\",\"\",Gestion!$F49)","v":""},{"$f":"IF(Gestion!$D49=\"\",\"\",Gestion!$D49)","v":""},{"$f":"IF(Gestion!$E49=\"\",\"\",Gestion!$E49)","v":""}]
[39,{"$f":"IF(Gestion!$F50=\"\",\"\",Gestion!$F50)","v":""},{"$f":"IF(Gestion!$D50=\"\",\"\",Gestion!$D50)","v":""},{"$f":"IF(Gestion!$E50=\"\",\"\",Gestion!$E50)","v":""}]
[40,{"$f":"IF(Gestion!$F51=\"\",\"\",Gestion!$F51)","v":""},{"$f":"IF(Gestion!$D51=\"\",\"\",Gestion!$D51)","v":""},{"$f":"IF(Gestion!$E51=\"\",\"\",Gestion!$E51)","v":""}]
[41,{"$f":"IF(Gestion!$F52=\"\",\"\",Gestion!$F52)","v":""},{"$f":"IF(Gestion!$D52=\"\",\"\",Gestion!$D52)","v":""},{"$f":"IF(Gestion!$E52=\"\",\"\",Gestion!$E52)","v":""}]
[42,{"$f":"IF(Gestion!$F53=\"\",\"\",Gestion!$F53)","v":""},{"$f":"IF(Gestion!$D53=\"\",\"\",Gestion!$D53)","v":""},{"$f":"IF(Gestion!$E53=\"\",\"\",Gestion!$E53)","v":""}]
[43,{"$f":"IF(Gestion!$F54=\"\",\"\",Gestion!$F54)","v":""},{"$f":"IF(Gestion!$D54=\"\",\"\",Gestion!$D54)","v":""},{"$f":"IF(Gestion!$E54=\"\",\"\",Gestion!$E54)","v":""}]
[44,{"$f":"IF(Gestion!$F55=\"\",\"\",Gestion!$F55)","v":""},{"$f":"IF(Gestion!$D55=\"\",\"\",Gestion!$D55)","v":""},{"$f":"IF(Gestion!$E55=\"\",\"\",Gestion!$E55)","v":""}]
[45,{"$f":"IF(Gestion!$F56=\"\",\"\",Gestion!$F56)","v":""},{"$f":"IF(Gestion!$D56=\"\",\"\",Gestion!$D56)","v":""},{"$f":"IF(Gestion!$E56=\"\",\"\",Gestion!$E56)","v":""}]
[null,{"$f":"IF(Gestion!$F57=\"\",\"\",Gestion!$F57)","v":""},{"$f":"IF(Gestion!$D57=\"\",\"\",Gestion!$D57)","v":""},{"$f":"IF(Gestion!$E57=\"\",\"\",Gestion!$E57)","v":""}]
[null,{"$f":"IF(Gestion!$F58=\"\",\"\",Gestion!$F58)","v":""},{"$f":"IF(Gestion!$D58=\"\",\"\",Gestion!$D58)","v":""},{"$f":"IF(Gestion!$E58=\"\",\"\",Gestion!$E58)","v":""}]
[null,{"$f":"IF(Gestion!$F59=\"\",\"\",Gestion!$F59)","v":""},{"$f":"IF(Gestion!$D59=\"\",\"\",Gestion!$D59)","v":""},{"$f":"IF(Gestion!$E59=\"\",\"\",Gestion!$E59)","v":""}]
[null,{"$f":"IF(Gestion!$F60=\"\",\"\",Gestion!$F60)","v":""},{"$f":"IF(Gestion!$D60=\"\",\"\",Gestion!$D60)","v":""},{"$f":"IF(Gestion!$E60=\"\",\"\",Gestion!$E60)","v":""}]
[null,{"$f":"IF(Gestion!$F61=\"\",\"\",Gestion!$F61)","v":""},{"$f":"IF(Gestion!$D61=\"\",\"\",Gestion!$D61)","v":""},{"$f":"IF(Gestion!$E61=\"\",\"\",Gestion!$E61)","v":""}]
[null,{"$f":"IF(Gestion!$F62=\"\",\"\",Gestion!$F62)","v":""},{"$f":"IF(Gestion!$D62=\"\",\"\",Gestion!$D62)","v":""},{"$f":"IF(Gestion!$E62=\"\",\"\",Gestion!$E62)","v":""}]
[null,{"$f":"IF(Gestion!$F63=\"\",\"\",Gestion!$F63)","v":""},{"$f":"IF(Gestion!$D63=\"\",\"\",Gestion!$D63)","v":""},{"$f":"IF(Gestion!$E63=\"\",\"\",Gestion!$E63)","v":""}]
[null,{"$f":"IF(Gestion!$F64=\"\",\"\",Gestion!$F64)","v":""},{"$f":"IF(Gestion!$D64=\"\",\"\",Gestion!$D64)","v":""},{"$f":"IF(Gestion!$E64=\"\",\"\",Gestion!$E64)","v":""}]
[null,{"$f":"IF(Gestion!$F65=\"\",\"\",Gestion!$F65)","v":""},{"$f":"IF(Gestion!$D65=\"\",\"\",Gestion!$D65)","v":""},{"$f":"IF(Gestion!$E65=\"\",\"\",Gestion!$E65)","v":""}]
[null,{"$f":"IF(Gestion!$F66=\"\",\"\",Gestion!$F66)","v":""},{"$f":"IF(Gestion!$D66=\"\",\"\",Gestion!$D66)","v":""},{"$f":"IF(Gestion!$E66=\"\",\"\",Gestion!$E66)","v":""}]
[null,{"$f":"IF(Gestion!$F67=\"\",\"\",Gestion!$F67)","v":""},{"$f":"IF(Gestion!$D67=\"\",\"\",Gestion!$D67)","v":""},{"$f":"IF(Gestion!$E67=\"\",\"\",Gestion!$E67)","v":""}]
[null,{"$f":"IF(Gestion!$F68=\"\",\"\",Gestion!$F68)","v":""},{"$f":"IF(Gestion!$D68=\"\",\"\",Gestion!$D68)","v":""},{"$f":"IF(Gestion!$E68=\"\",\"\",Gestion!$E68)","v":""}]
[null,{"$f":"IF(Gestion!$F69=\"\",\"\",Gestion!$F69)","v":""},{"$f":"IF(Gestion!$D69=\"\",\"\",Gestion!$D69)","v":""},{"$f":"IF(Gestion!$E69=\"\",\"\",Gestion!$E69)","v":""}]
[null,{"$f":"IF(Gestion!$F70=\"\",\"\",Gestion!$F70)","v":""},{"$f":"IF(Gestion!$D70=\"\",\"\",Gestion!$D70)","v":""},{"$f":"IF(Gestion!$E70=\"\",\"\",Gestion!$E70)","v":""}]
[null,{"$f":"IF(Gestion!$F71=\"\",\"\",Gestion!$F71)","v":""},{"$f":"IF(Gestion!$D71=\"\",\"\",Gestion!$D71)","v":""},{"$f":"IF(Gestion!$E71=\"\",\"\",Gestion!$E71)","v":""}]
[null,{"$f":"IF(Gestion!$F72=\"\",\"\",Gestion!$F72)","v":""},{"$f":"IF(Gestion!$D72=\"\",\"\",Gestion!$D72)","v":""},{"$f":"IF(Gestion!$E72=\"\",\"\",Gestion!$E72)","v":""}]
[null,{"$f":"IF(Gestion!$F73=\"\",\"\",Gestion!$F73)","v":""},{"$f":"IF(Gestion!$D73=\"\",\"\",Gestion!$D73)","v":""},{"$f":"IF(Gestion!$E73=\"\",\"\",Gestion!$E73)","v":""}]
[null,{"$f":"IF(Gestion!$F74=\"\",\"\",Gestion!$F74)","v":""},{"$f":"IF(Gestion!$D74=\"\",\"\",Gestion!$D74)","v":""},{"$f":"IF(Gestion!$E74=\"\",\"\",Gestion!$E74)","v":""}]
[null,{"$f":"IF(Gestion!$F75=\"\",\"\",Gestion!$F75)","v":""},{"$f":"IF(Gestion!$D75=\"\",\"\",Gestion!$D75)","v":""},{"$f":"IF(Gestion!$E75=\"\",\"\",Gestion!$E75)","v":""}]
[null,{"$f":"IF(Gestion!$F76=\"\",\"\",Gestion!$F76)","v":""},{"$f":"IF(Gestion!$D76=\"\",\"\",Gestion!$D76)","v":""},{"$f":"IF(Gestion!$E76=\"\",\"\",Gestion!$E76)","v":""}]
[null,{"$f":"IF(Gestion!$F77=\"\",\"\",Gestion!$F77)","v":""},{"$f":"IF(Gestion!$D77=\"\",\"\",Gestion!$D77)","v":""},{"$f":"IF(Gestion!$E77=\"\",\"\",Gestion!$E77)","v":""}]
[null,{"$f":"IF(Gestion!$F78=\"\",\"\",Gestion!$F78)","v":""},{"$f":"IF(Gestion!$D78=\"\",\"\",Gestion!$D78)","v":""},{"$f":"IF(Gestion!$E78=\"\",\"\",Gestion!$E78)","v":""}]
[null,{"$f":"IF(Gestion!$F79=\"\",\"\",Gestion!$F79)","v":""},{"$f":"IF(Gestion!$D79=\"\",\"\",Gestion!$D79)","v":""},{"$f":"IF(Gestion!$E79=\"\",\"\",Gestion!$E79)","v":""}]
[null,{"$f":"IF(Gestion!$F80=\"\",\"\",Gestion!$F80)","v":""},{"$f":"IF(Gestion!$D80=\"\",\"\",Gestion!$D80)","v":""},{"$f":"IF(Gestion!$E80=\"\",\"\",Gestion!$E80)","v":""}]
[null,{"$f":"IF(Gestion!$F81=\"\",\"\",Gestion!$F81)","v":""},{"$f":"IF(Gestion!$D81=\"\",\"\",Gestion!$D81)","v":""},{"$f":"IF(Gestion!$E81=\"\",\"\",Gestion!$E81)","v":""}]
[null,{"$f":"IF(Gestion!$F82=\"\",\"\",Gestion!$F82)","v":""},{"$f":"IF(Gestion!$D82=\"\",\"\",Gestion!$D82)","v":""},{"$f":"IF(Gestion!$E82=\"\",\"\",Gestion!$E82)","v":""}]
[null,{"$f":"IF(Gestion!$F83=\"\",\"\",Gestion!$F83)","v":""},{"$f":"IF(Gestion!$D83=\"\",\"\",Gestion!$D83)","v":""},{"$f":"IF(Gestion!$E83=\"\",\"\",Gestion!$E83)","v":""}]
[null,{"$f":"IF(Gestion!$F84=\"\",\"\",Gestion!$F84)","v":""},{"$f":"IF(Gestion!$D84=\"\",\"\",Gestion!$D84)","v":""},{"$f":"IF(Gestion!$E84=\"\",\"\",Gestion!$E84)","v":""}]
[null,{"$f":"IF(Gestion!$F85=\"\",\"\",Gestion!$F85)","v":""},{"$f":"IF(Gestion!$D85=\"\",\"\",Gestion!$D85)","v":""},{"$f":"IF(Gestion!$E85=\"\",\"\",Gestion!$E85)","v":""}]
[null,{"$f":"IF(Gestion!$F86=\"\",\"\",Gestion!$F86)","v":""},{"$f":"IF(Gestion!$D86=\"\",\"\",Gestion!$D86)","v":""},{"$f":"IF(Gestion!$E86=\"\",\"\",Gestion!$E86)","v":""}]
[null,{"$f":"IF(Gestion!$F87=\"\",\"\",Gestion!$F87)","v":""},{"$f":"IF(Gestion!$D87=\"\",\"\",Gestion!$D87)","v":""},{"$f":"IF(Gestion!$E87=\"\",\"\",Gestion!$E87)","v":""}]
[null,{"$f":"IF(Gestion!$F88=\"\",\"\",Gestion!$F88)","v":""},{"$f":"IF(Gestion!$D88=\"\",\"\",Gestion!$D88)","v":""},{"$f":"IF(Gestion!$E88=\"\",\"\",Gestion!$E88)","v":""}]
[null,{"$f":"IF(Gestion!$F89=\"\",\"\",Gestion!$F89)","v":""},{"$f":"IF(Gestion!$D89=\"\",\"\",Gestion!$D89)","v":""},{"$f":"IF(Gestion!$E89=\"\",\"\",Gestion!$E89)","v":""}]
[null,{"$f":"IF(Gestion!$F90=\"\",\"\",Gestion!$F90)","v":""},{"$f":"IF(Gestion!$D90=\"\",\"\",Gestion!$D90)","v":""},{"$f":"IF(Gestion!$E90=\"\",\"\",Gestion!$E90)","v":""}]
[null,{"$f":"IF(Gestion!$F91=\"\",\"\",Gestion!$F91)","v":""},{"$f":"IF(Gestion!$D91=\"\",\"\",Gestion!$D91)","v":""},{"$f":"IF(Gestion!$E91=\"\",\"\",Gestion!$E91)","v":""}]
[null,{"$f":"IF(Gestion!$F92=\"\",\"\",Gestion!$F92)","v":""},{"$f":"IF(Gestion!$D92=\"\",\"\",Gestion!$D92)","v":""},{"$f":"IF(Gestion!$E92=\"\",\"\",Gestion!$E92)","v":""}]
[null,{"$f":"IF(Gestion!$F93=\"\",\"\",Gestion!$F93)","v":""},{"$f":"IF(Gestion!$D93=\"\",\"\",Gestion!$D93)","v":""},{"$f":"IF(Gestion!$E93=\"\",\"\",Gestion!$E93)","v":""}]
[null,{"$f":"IF(Gestion!$F94=\"\",\"\",Gestion!$F94)","v":""},{"$f":"IF(Gestion!$D94=\"\",\"\",Gestion!$D94)","v":""},{"$f":"IF(Gestion!$E94=\"\",\"\",Gestion!$E94)","v":""}]
[null,{"$f":"IF(Gestion!$F95=\"\",\"\",Gestion!$F95)","v":""},{"$f":"IF(Gestion!$D95=\"\",\"\",Gestion!$D95)","v":""},{"$f":"IF(Gestion!$E95=\"\",\"\",Gestion!$E95)","v":""}]
[null,{"$f":"IF(Gestion!$F96=\"\",\"\",Gestion!$F96)","v":""},{"$f":"IF(Gestion!$D96=\"\",\"\",Gestion!$D96)","v":""},{"$f":"IF(Gestion!$E96=\"\",\"\",Gestion!$E96)","v":""}]
[null,{"$f":"IF(Gestion!$F97=\"\",\"\",Gestion!$F97)","v":""},{"$f":"IF(Gestion!$D97=\"\",\"\",Gestion!$D97)","v":""},{"$f":"IF(Gestion!$E97=\"\",\"\",Gestion!$E97)","v":""}]
[null,{"$f":"IF(Gestion!$F98=\"\",\"\",Gestion!$F98)","v":""},{"$f":"IF(Gestion!$D98=\"\",\"\",Gestion!$D98)","v":""},{"$f":"IF(Gestion!$E98=\"\",\"\",Gestion!$E98)","v":""}]
[null,{"$f":"IF(Gestion!$F99=\"\",\"\",Gestion!$F99)","v":""},{"$f":"IF(Gestion!$D99=\"\",\"\",Gestion!$D99)","v":""},{"$f":"IF(Gestion!$E99=\"\",\"\",Gestion!$E99)","v":""}]
[null,{"$f":"IF(Gestion!$F100=\"\",\"\",Gestion!$F100)","v":""},{"$f":"IF(Gestion!$D100=\"\",\"\",Gestion!$D100)","v":""},{"$f":"IF(Gestion!$E100=\"\",\"\",Gestion!$E100)","v":""}]
[null,{"$f":"IF(Gestion!$F101=\"\",\"\",Gestion!$F101)","v":""},{"$f":"IF(Gestion!$D101=\"\",\"\",Gestion!$D101)","v":""},{"$f":"IF(Gestion!$E101=\"\",\"\",Gestion!$E101)","v":""}]
[null,{"$f":"IF(Gestion!$F102=\"\",\"\",Gestion!$F102)","v":""},{"$f":"IF(Gestion!$D102=\"\",\"\",Gestion!$D102)","v":""},{"$f":"IF(Gestion!$E102=\"\",\"\",Gestion!$E102)","v":""}]
[null,{"$f":"IF(Gestion!$F103=\"\",\"\",Gestion!$F103)","v":""},{"$f":"IF(Gestion!$D103=\"\",\"\",Gestion!$D103)","v":""},{"$f":"IF(Gestion!$E103=\"\",\"\",Gestion!$E103)","v":""}]
[null,{"$f":"IF(Gestion!$F104=\"\",\"\",Gestion!$F104)","v":""},{"$f":"IF(Gestion!$D104=\"\",\"\",Gestion!$D104)","v":""},{"$f":"IF(Gestion!$E104=\"\",\"\",Gestion!$E104)","v":""}]
[null,{"$f":"IF(Gestion!$F105=\"\",\"\",Gestion!$F105)","v":""},{"$f":"IF(Gestion!$D105=\"\",\"\",Gestion!$D105)","v":""},{"$f":"IF(Gestion!$E105=\"\",\"\",Gestion!$E105)","v":""}]
[null,{"$f":"IF(Gestion!$F106=\"\",\"\",Gestion!$F106)","v":""},{"$f":"IF(Gestion!$D106=\"\",\"\",Gestion!$D106)","v":""},{"$f":"IF(Gestion!$E106=\"\",\"\",Gestion!$E106)","v":""}]