{"text_format":"1","workbook":"xlsx","n_sheets":9,"sheets":["Titre","ACCUEIL","6ème","5ème","BarêmeModifiable","Barème 6ème","Barème 5ème","Barème libre","explication"],"not_rendered":{"charts":0,"images":8,"macros":1,"external_links":0,"defined_names":19,"comments":0,"pivot_tables":0},"unopened":[],"bounds":{"document_bytes":16777216,"sheet_cells":100000,"rows_first":2000,"rows_last":500,"rows_between":2000,"halvings":0,"cell_chars":16384,"cell_head_chars":4096},"cells_cut":0,"cells_raw":0,"read":"whole","date_system":"1900"}

{"sheet":"Titre","index":0,"n_rows":0,"n_cols":0,"rows_kept":0,"cut":false,"hidden":false,"merged":[]}

{"sheet":"ACCUEIL","index":1,"n_rows":0,"n_cols":0,"rows_kept":0,"cut":false,"hidden":false,"merged":[]}

{"sheet":"6ème","index":2,"n_rows":39,"n_cols":13,"rows_kept":39,"cut":false,"hidden":false,"merged":[[1,1,1,5],[38,3,38,4]]}
[]
[null,"Notes Temps/coup de bras des sixièmes",null,null,null,null,null,null,null,"NB col","temps6ème","NB lignes"]
[null,"Nom","Prénom","Temps","CB","Notes",null,null,"CB6ème",null,1,1,"Barême\ntemps6ème"]
[null,"Belhadj","jean",21,35,{"$f":"IF(AND(D4=\"\",E4=\"\"),\"\",IF(AND(B4=\"\",C4=\"\"),\"\",IF(OR(D4=\"a\",E4=\"a\"),\"Certif ?\",IF(COUNTBLANK(D4:E4)=1,\"incomplet\",INDEX(TableauCBTPS6,LOOKUP(D4,temps6ème:NB_ligne6ème),LOOKUP(E4,CB6ème,Nb_col6ème))))))","v":16.5},null,null,1,1,{"$f":"M4+0.1","v":22.1},2,22]
[null,"Durand","Paul",22,null,{"$f":"IF(AND(D5=\"\",E5=\"\"),\"\",IF(AND(B5=\"\",C5=\"\"),\"\",IF(OR(D5=\"a\",E5=\"a\"),\"Certif ?\",IF(COUNTBLANK(D5:E5)=1,\"incomplet\",INDEX(TableauCBTPS6,LOOKUP(D5,temps6ème:NB_ligne6ème),LOOKUP(E5,CB6ème,Nb_col6ème))))))","v":"incomplet"},null,null,22.01,2,22.8,3,22.7]
[null,"Ficus","Marie",33,"a",{"$f":"IF(AND(D6=\"\",E6=\"\"),\"\",IF(AND(B6=\"\",C6=\"\"),\"\",IF(OR(D6=\"a\",E6=\"a\"),\"Certif ?\",IF(COUNTBLANK(D6:E6)=1,\"incomplet\",INDEX(TableauCBTPS6,LOOKUP(D6,temps6ème:NB_ligne6ème),LOOKUP(E6,CB6ème,Nb_col6ème))))))","v":"Certif ?"},null,null,23.01,3,23.5,4,23.4]
[null,"Gouder","Isabelle","A","A",{"$f":"IF(AND(D7=\"\",E7=\"\"),\"\",IF(AND(B7=\"\",C7=\"\"),\"\",IF(OR(D7=\"a\",E7=\"a\"),\"Certif ?\",IF(COUNTBLANK(D7:E7)=1,\"incomplet\",INDEX(TableauCBTPS6,LOOKUP(D7,temps6ème:NB_ligne6ème),LOOKUP(E7,CB6ème,Nb_col6ème))))))","v":"Certif ?"},null,null,25.01,4,24.200000000000003,5,24.1]
[null,null,null,null,null,{"$f":"IF(AND(D8=\"\",E8=\"\"),\"\",IF(AND(B8=\"\",C8=\"\"),\"\",IF(OR(D8=\"a\",E8=\"a\"),\"Certif ?\",IF(COUNTBLANK(D8:E8)=1,\"incomplet\",INDEX(TableauCBTPS6,LOOKUP(D8,temps6ème:NB_ligne6ème),LOOKUP(E8,CB6ème,Nb_col6ème))))))","v":""},null,null,27.01,5,24.900000000000002,6,24.8]
[null,null,null,null,null,{"$f":"IF(AND(D9=\"\",E9=\"\"),\"\",IF(AND(B9=\"\",C9=\"\"),\"\",IF(OR(D9=\"a\",E9=\"a\"),\"Certif ?\",IF(COUNTBLANK(D9:E9)=1,\"incomplet\",INDEX(TableauCBTPS6,LOOKUP(D9,temps6ème:NB_ligne6ème),LOOKUP(E9,CB6ème,Nb_col6ème))))))","v":""},null,null,29.01,6,25.6,7,25.5]
[null,null,null,null,null,{"$f":"IF(AND(D10=\"\",E10=\"\"),\"\",IF(AND(B10=\"\",C10=\"\"),\"\",IF(OR(D10=\"a\",E10=\"a\"),\"Certif ?\",IF(COUNTBLANK(D10:E10)=1,\"incomplet\",INDEX(TableauCBTPS6,LOOKUP(D10,temps6ème:NB_ligne6ème),LOOKUP(E10,CB6ème,Nb_col6ème))))))","v":""},null,null,31.01,7,26.400000000000002,8,26.3]
[null,null,null,null,null,{"$f":"IF(AND(D11=\"\",E11=\"\"),\"\",IF(AND(B11=\"\",C11=\"\"),\"\",IF(OR(D11=\"a\",E11=\"a\"),\"Certif ?\",IF(COUNTBLANK(D11:E11)=1,\"incomplet\",INDEX(TableauCBTPS6,LOOKUP(D11,temps6ème:NB_ligne6ème),LOOKUP(E11,CB6ème,Nb_col6ème))))))","v":""},null,null,33.01,8,27.200000000000003,9,27.1]
[null,null,null,null,null,{"$f":"IF(AND(D12=\"\",E12=\"\"),\"\",IF(AND(B12=\"\",C12=\"\"),\"\",IF(OR(D12=\"a\",E12=\"a\"),\"Certif ?\",IF(COUNTBLANK(D12:E12)=1,\"incomplet\",INDEX(TableauCBTPS6,LOOKUP(D12,temps6ème:NB_ligne6ème),LOOKUP(E12,CB6ème,Nb_col6ème))))))","v":""},null,null,35.01,9,28,10,27.9]
[null,null,null,null,null,{"$f":"IF(AND(D13=\"\",E13=\"\"),\"\",IF(AND(B13=\"\",C13=\"\"),\"\",IF(OR(D13=\"a\",E13=\"a\"),\"Certif ?\",IF(COUNTBLANK(D13:E13)=1,\"incomplet\",INDEX(TableauCBTPS6,LOOKUP(D13,temps6ème:NB_ligne6ème),LOOKUP(E13,CB6ème,Nb_col6ème))))))","v":""},null,null,37.01,10,28.8,11,28.7]
[null,null,null,null,null,{"$f":"IF(AND(D14=\"\",E14=\"\"),\"\",IF(AND(B14=\"\",C14=\"\"),\"\",IF(OR(D14=\"a\",E14=\"a\"),\"Certif ?\",IF(COUNTBLANK(D14:E14)=1,\"incomplet\",INDEX(TableauCBTPS6,LOOKUP(D14,temps6ème:NB_ligne6ème),LOOKUP(E14,CB6ème,Nb_col6ème))))))","v":""},null,null,39.01,11,29.6,12,29.5]
[null,null,null,null,null,{"$f":"IF(AND(D15=\"\",E15=\"\"),\"\",IF(AND(B15=\"\",C15=\"\"),\"\",IF(OR(D15=\"a\",E15=\"a\"),\"Certif ?\",IF(COUNTBLANK(D15:E15)=1,\"incomplet\",INDEX(TableauCBTPS6,LOOKUP(D15,temps6ème:NB_ligne6ème),LOOKUP(E15,CB6ème,Nb_col6ème))))))","v":""},null,null,40.01,12,30.400000000000002,13,30.3]
[null,null,null,null,null,{"$f":"IF(AND(D16=\"\",E16=\"\"),\"\",IF(AND(B16=\"\",C16=\"\"),\"\",IF(OR(D16=\"a\",E16=\"a\"),\"Certif ?\",IF(COUNTBLANK(D16:E16)=1,\"incomplet\",INDEX(TableauCBTPS6,LOOKUP(D16,temps6ème:NB_ligne6ème),LOOKUP(E16,CB6ème,Nb_col6ème))))))","v":""},null,null,41.01,13,31.200000000000003,14,31.1]
[null,null,null,null,null,{"$f":"IF(AND(D17=\"\",E17=\"\"),\"\",IF(AND(B17=\"\",C17=\"\"),\"\",IF(OR(D17=\"a\",E17=\"a\"),\"Certif ?\",IF(COUNTBLANK(D17:E17)=1,\"incomplet\",INDEX(TableauCBTPS6,LOOKUP(D17,temps6ème:NB_ligne6ème),LOOKUP(E17,CB6ème,Nb_col6ème))))))","v":""},null,null,42.01,14,32,15,31.9]
[null,null,null,null,null,{"$f":"IF(AND(D18=\"\",E18=\"\"),\"\",IF(AND(B18=\"\",C18=\"\"),\"\",IF(OR(D18=\"a\",E18=\"a\"),\"Certif ?\",IF(COUNTBLANK(D18:E18)=1,\"incomplet\",INDEX(TableauCBTPS6,LOOKUP(D18,temps6ème:NB_ligne6ème),LOOKUP(E18,CB6ème,Nb_col6ème))))))","v":""},null,null,43.01,15,32.800000000000004,16,32.700000000000003]
[null,null,null,null,null,{"$f":"IF(AND(D19=\"\",E19=\"\"),\"\",IF(AND(B19=\"\",C19=\"\"),\"\",IF(OR(D19=\"a\",E19=\"a\"),\"Certif ?\",IF(COUNTBLANK(D19:E19)=1,\"incomplet\",INDEX(TableauCBTPS6,LOOKUP(D19,temps6ème:NB_ligne6ème),LOOKUP(E19,CB6ème,Nb_col6ème))))))","v":""},null,null,44.01,16,33.6,17,33.5]
[null,null,null,null,null,{"$f":"IF(AND(D20=\"\",E20=\"\"),\"\",IF(AND(B20=\"\",C20=\"\"),\"\",IF(OR(D20=\"a\",E20=\"a\"),\"Certif ?\",IF(COUNTBLANK(D20:E20)=1,\"incomplet\",INDEX(TableauCBTPS6,LOOKUP(D20,temps6ème:NB_ligne6ème),LOOKUP(E20,CB6ème,Nb_col6ème))))))","v":""},null,null,45.01,17,35.1,18,35]
[null,null,null,null,null,{"$f":"IF(AND(D21=\"\",E21=\"\"),\"\",IF(AND(B21=\"\",C21=\"\"),\"\",IF(OR(D21=\"a\",E21=\"a\"),\"Certif ?\",IF(COUNTBLANK(D21:E21)=1,\"incomplet\",INDEX(TableauCBTPS6,LOOKUP(D21,temps6ème:NB_ligne6ème),LOOKUP(E21,CB6ème,Nb_col6ème))))))","v":""},null,null,46.01,18,36.6,19,36.5]
[null,null,null,null,null,{"$f":"IF(AND(D22=\"\",E22=\"\"),\"\",IF(AND(B22=\"\",C22=\"\"),\"\",IF(OR(D22=\"a\",E22=\"a\"),\"Certif ?\",IF(COUNTBLANK(D22:E22)=1,\"incomplet\",INDEX(TableauCBTPS6,LOOKUP(D22,temps6ème:NB_ligne6ème),LOOKUP(E22,CB6ème,Nb_col6ème))))))","v":""},null,null,47.01,19,38.1,20,38]
[null,null,null,null,null,{"$f":"IF(AND(D23=\"\",E23=\"\"),\"\",IF(AND(B23=\"\",C23=\"\"),\"\",IF(OR(D23=\"a\",E23=\"a\"),\"Certif ?\",IF(COUNTBLANK(D23:E23)=1,\"incomplet\",INDEX(TableauCBTPS6,LOOKUP(D23,temps6ème:NB_ligne6ème),LOOKUP(E23,CB6ème,Nb_col6ème))))))","v":""},null,null,48.01,20,39.6,21,39.5]
[null,null,null,null,null,{"$f":"IF(AND(D24=\"\",E24=\"\"),\"\",IF(AND(B24=\"\",C24=\"\"),\"\",IF(OR(D24=\"a\",E24=\"a\"),\"Certif ?\",IF(COUNTBLANK(D24:E24)=1,\"incomplet\",INDEX(TableauCBTPS6,LOOKUP(D24,temps6ème:NB_ligne6ème),LOOKUP(E24,CB6ème,Nb_col6ème))))))","v":""},null,null,49.01,21,{"$f":"M24+25","v":65},22,40]
[null,null,null,null,null,{"$f":"IF(AND(D25=\"\",E25=\"\"),\"\",IF(AND(B25=\"\",C25=\"\"),\"\",IF(OR(D25=\"a\",E25=\"a\"),\"Certif ?\",IF(COUNTBLANK(D25:E25)=1,\"incomplet\",INDEX(TableauCBTPS6,LOOKUP(D25,temps6ème:NB_ligne6ème),LOOKUP(E25,CB6ème,Nb_col6ème))))))","v":""}]
[null,null,null,null,null,{"$f":"IF(AND(D26=\"\",E26=\"\"),\"\",IF(AND(B26=\"\",C26=\"\"),\"\",IF(OR(D26=\"a\",E26=\"a\"),\"Certif ?\",IF(COUNTBLANK(D26:E26)=1,\"incomplet\",INDEX(TableauCBTPS6,LOOKUP(D26,temps6ème:NB_ligne6ème),LOOKUP(E26,CB6ème,Nb_col6ème))))))","v":""}]
[null,null,null,null,null,{"$f":"IF(AND(D27=\"\",E27=\"\"),\"\",IF(AND(B27=\"\",C27=\"\"),\"\",IF(OR(D27=\"a\",E27=\"a\"),\"Certif ?\",IF(COUNTBLANK(D27:E27)=1,\"incomplet\",INDEX(TableauCBTPS6,LOOKUP(D27,temps6ème:NB_ligne6ème),LOOKUP(E27,CB6ème,Nb_col6ème))))))","v":""}]
[null,null,null,null,null,{"$f":"IF(AND(D28=\"\",E28=\"\"),\"\",IF(AND(B28=\"\",C28=\"\"),\"\",IF(OR(D28=\"a\",E28=\"a\"),\"Certif ?\",IF(COUNTBLANK(D28:E28)=1,\"incomplet\",INDEX(TableauCBTPS6,LOOKUP(D28,temps6ème:NB_ligne6ème),LOOKUP(E28,CB6ème,Nb_col6ème))))))","v":""}]
[null,null,null,null,null,{"$f":"IF(AND(D29=\"\",E29=\"\"),\"\",IF(AND(B29=\"\",C29=\"\"),\"\",IF(OR(D29=\"a\",E29=\"a\"),\"Certif ?\",IF(COUNTBLANK(D29:E29)=1,\"incomplet\",INDEX(TableauCBTPS6,LOOKUP(D29,temps6ème:NB_ligne6ème),LOOKUP(E29,CB6ème,Nb_col6ème))))))","v":""}]
[null,null,null,null,null,{"$f":"IF(AND(D30=\"\",E30=\"\"),\"\",IF(AND(B30=\"\",C30=\"\"),\"\",IF(OR(D30=\"a\",E30=\"a\"),\"Certif ?\",IF(COUNTBLANK(D30:E30)=1,\"incomplet\",INDEX(TableauCBTPS6,LOOKUP(D30,temps6ème:NB_ligne6ème),LOOKUP(E30,CB6ème,Nb_col6ème))))))","v":""}]
[null,null,null,null,null,{"$f":"IF(AND(D31=\"\",E31=\"\"),\"\",IF(AND(B31=\"\",C31=\"\"),\"\",IF(OR(D31=\"a\",E31=\"a\"),\"Certif ?\",IF(COUNTBLANK(D31:E31)=1,\"incomplet\",INDEX(TableauCBTPS6,LOOKUP(D31,temps6ème:NB_ligne6ème),LOOKUP(E31,CB6ème,Nb_col6ème))))))","v":""}]
[null,null,null,null,null,{"$f":"IF(AND(D32=\"\",E32=\"\"),\"\",IF(AND(B32=\"\",C32=\"\"),\"\",IF(OR(D32=\"a\",E32=\"a\"),\"Certif ?\",IF(COUNTBLANK(D32:E32)=1,\"incomplet\",INDEX(TableauCBTPS6,LOOKUP(D32,temps6ème:NB_ligne6ème),LOOKUP(E32,CB6ème,Nb_col6ème))))))","v":""}]
[null,null,null,null,null,{"$f":"IF(AND(D33=\"\",E33=\"\"),\"\",IF(AND(B33=\"\",C33=\"\"),\"\",IF(OR(D33=\"a\",E33=\"a\"),\"Certif ?\",IF(COUNTBLANK(D33:E33)=1,\"incomplet\",INDEX(TableauCBTPS6,LOOKUP(D33,temps6ème:NB_ligne6ème),LOOKUP(E33,CB6ème,Nb_col6ème))))))","v":""}]
[null,null,null,null,null,{"$f":"IF(AND(D34=\"\",E34=\"\"),\"\",IF(AND(B34=\"\",C34=\"\"),\"\",IF(OR(D34=\"a\",E34=\"a\"),\"Certif ?\",IF(COUNTBLANK(D34:E34)=1,\"incomplet\",INDEX(TableauCBTPS6,LOOKUP(D34,temps6ème:NB_ligne6ème),LOOKUP(E34,CB6ème,Nb_col6ème))))))","v":""}]
[null,null,null,null,null,{"$f":"IF(AND(D35=\"\",E35=\"\"),\"\",IF(AND(B35=\"\",C35=\"\"),\"\",IF(OR(D35=\"a\",E35=\"a\"),\"Certif ?\",IF(COUNTBLANK(D35:E35)=1,\"incomplet\",INDEX(TableauCBTPS6,LOOKUP(D35,temps6ème:NB_ligne6ème),LOOKUP(E35,CB6ème,Nb_col6ème))))))","v":""}]
[null,null,null,null,null,{"$f":"IF(AND(D36=\"\",E36=\"\"),\"\",IF(AND(B36=\"\",C36=\"\"),\"\",IF(OR(D36=\"a\",E36=\"a\"),\"Certif ?\",IF(COUNTBLANK(D36:E36)=1,\"incomplet\",INDEX(TableauCBTPS6,LOOKUP(D36,temps6ème:NB_ligne6ème),LOOKUP(E36,CB6ème,Nb_col6ème))))))","v":""}]
[null,null,null,null,null,{"$f":"IF(AND(D37=\"\",E37=\"\"),\"\",IF(AND(B37=\"\",C37=\"\"),\"\",IF(OR(D37=\"a\",E37=\"a\"),\"Certif ?\",IF(COUNTBLANK(D37:E37)=1,\"incomplet\",INDEX(TableauCBTPS6,LOOKUP(D37,temps6ème:NB_ligne6ème),LOOKUP(E37,CB6ème,Nb_col6ème))))))","v":""}]
[null,null,null,null,null,{"$f":"IF(AND(D38=\"\",E38=\"\"),\"\",IF(AND(B38=\"\",C38=\"\"),\"\",IF(OR(D38=\"a\",E38=\"a\"),\"Certif ?\",IF(COUNTBLANK(D38:E38)=1,\"incomplet\",INDEX(TableauCBTPS6,LOOKUP(D38,temps6ème:NB_ligne6ème),LOOKUP(E38,CB6ème,Nb_col6ème))))))","v":""}]
[null,"Nom","Prénom","Moyenne",null,{"$f":"IF(COUNT(F4:F38)=0,\"\",AVERAGE(F4:F38))","v":16.5}]

{"sheet":"5ème","index":3,"n_rows":39,"n_cols":13,"rows_kept":39,"cut":false,"hidden":false,"merged":[[1,1,1,5],[38,3,38,4]]}
[]
[null,"Notes Temps/coup de bras des cinquièmes",null,null,null,null,null,null,null,null,"temps5ème","NB lignes"]
[null,"Nom","Prénom","Temps","CB","Notes",null,null,"CB5ème","NB col",1,1,"barême\ntemps5ème"]
[null,"Belhadj","jean",25.2,35,{"$f":"IF(AND(D4=\"\",E4=\"\"),\"\",IF(AND(B4=\"\",C4=\"\"),\"\",IF(OR(D4=\"a\",E4=\"a\"),\"Certif ?\",IF(COUNTBLANK(D4:E4)=1,\"incomplet\",INDEX(TableauCBTPS5,LOOKUP(D4,temps5ème:NB_ligne5ème),LOOKUP(E4,CB5ème,nb_col5ème))))))","v":13},null,null,1,1,{"$f":"M4+0.1","v":20.100000000000001},2,20]
[null,"Durand","Paul",22,null,{"$f":"IF(AND(D5=\"\",E5=\"\"),\"\",IF(AND(B5=\"\",C5=\"\"),\"\",IF(OR(D5=\"a\",E5=\"a\"),\"Certif ?\",IF(COUNTBLANK(D5:E5)=1,\"incomplet\",INDEX(TableauCBTPS5,LOOKUP(D5,temps5ème:NB_ligne5ème),LOOKUP(E5,CB5ème,nb_col5ème))))))","v":"incomplet"},null,null,22.01,2,20.8,3,20.7]
[null,"Ficus","Marie",33,"a",{"$f":"IF(AND(D6=\"\",E6=\"\"),\"\",IF(AND(B6=\"\",C6=\"\"),\"\",IF(OR(D6=\"a\",E6=\"a\"),\"Certif ?\",IF(COUNTBLANK(D6:E6)=1,\"incomplet\",INDEX(TableauCBTPS5,LOOKUP(D6,temps5ème:NB_ligne5ème),LOOKUP(E6,CB5ème,nb_col5ème))))))","v":"Certif ?"},null,null,23.01,3,21.5,4,21.4]
[null,"Gouder","Isabelle","A","A",{"$f":"IF(AND(D7=\"\",E7=\"\"),\"\",IF(AND(B7=\"\",C7=\"\"),\"\",IF(OR(D7=\"a\",E7=\"a\"),\"Certif ?\",IF(COUNTBLANK(D7:E7)=1,\"incomplet\",INDEX(TableauCBTPS5,LOOKUP(D7,temps5ème:NB_ligne5ème),LOOKUP(E7,CB5ème,nb_col5ème))))))","v":"Certif ?"},null,null,25.01,4,22.200000000000003,5,22.1]
[null,null,null,null,null,{"$f":"IF(AND(D8=\"\",E8=\"\"),\"\",IF(AND(B8=\"\",C8=\"\"),\"\",IF(OR(D8=\"a\",E8=\"a\"),\"Certif ?\",IF(COUNTBLANK(D8:E8)=1,\"incomplet\",INDEX(TableauCBTPS5,LOOKUP(D8,temps5ème:NB_ligne5ème),LOOKUP(E8,CB5ème,nb_col5ème))))))","v":""},null,null,27.01,5,22.900000000000002,6,22.8]
[null,null,null,null,null,{"$f":"IF(AND(D9=\"\",E9=\"\"),\"\",IF(AND(B9=\"\",C9=\"\"),\"\",IF(OR(D9=\"a\",E9=\"a\"),\"Certif ?\",IF(COUNTBLANK(D9:E9)=1,\"incomplet\",INDEX(TableauCBTPS5,LOOKUP(D9,temps5ème:NB_ligne5ème),LOOKUP(E9,CB5ème,nb_col5ème))))))","v":""},null,null,29.01,6,23.6,7,23.5]
[null,null,null,null,null,{"$f":"IF(AND(D10=\"\",E10=\"\"),\"\",IF(AND(B10=\"\",C10=\"\"),\"\",IF(OR(D10=\"a\",E10=\"a\"),\"Certif ?\",IF(COUNTBLANK(D10:E10)=1,\"incomplet\",INDEX(TableauCBTPS5,LOOKUP(D10,temps5ème:NB_ligne5ème),LOOKUP(E10,CB5ème,nb_col5ème))))))","v":""},null,null,31.01,7,24.400000000000002,8,24.3]
[null,null,null,null,null,{"$f":"IF(AND(D11=\"\",E11=\"\"),\"\",IF(AND(B11=\"\",C11=\"\"),\"\",IF(OR(D11=\"a\",E11=\"a\"),\"Certif ?\",IF(COUNTBLANK(D11:E11)=1,\"incomplet\",INDEX(TableauCBTPS5,LOOKUP(D11,temps5ème:NB_ligne5ème),LOOKUP(E11,CB5ème,nb_col5ème))))))","v":""},null,null,33.01,8,25.200000000000003,9,25.1]
[null,null,null,null,null,{"$f":"IF(AND(D12=\"\",E12=\"\"),\"\",IF(AND(B12=\"\",C12=\"\"),\"\",IF(OR(D12=\"a\",E12=\"a\"),\"Certif ?\",IF(COUNTBLANK(D12:E12)=1,\"incomplet\",INDEX(TableauCBTPS5,LOOKUP(D12,temps5ème:NB_ligne5ème),LOOKUP(E12,CB5ème,nb_col5ème))))))","v":""},null,null,35.01,9,26,10,25.9]
[null,null,null,null,null,{"$f":"IF(AND(D13=\"\",E13=\"\"),\"\",IF(AND(B13=\"\",C13=\"\"),\"\",IF(OR(D13=\"a\",E13=\"a\"),\"Certif ?\",IF(COUNTBLANK(D13:E13)=1,\"incomplet\",INDEX(TableauCBTPS5,LOOKUP(D13,temps5ème:NB_ligne5ème),LOOKUP(E13,CB5ème,nb_col5ème))))))","v":""},null,null,37.01,10,26.8,11,26.7]
[null,null,null,null,null,{"$f":"IF(AND(D14=\"\",E14=\"\"),\"\",IF(AND(B14=\"\",C14=\"\"),\"\",IF(OR(D14=\"a\",E14=\"a\"),\"Certif ?\",IF(COUNTBLANK(D14:E14)=1,\"incomplet\",INDEX(TableauCBTPS5,LOOKUP(D14,temps5ème:NB_ligne5ème),LOOKUP(E14,CB5ème,nb_col5ème))))))","v":""},null,null,39.01,11,27.6,12,27.5]
[null,null,null,null,null,{"$f":"IF(AND(D15=\"\",E15=\"\"),\"\",IF(AND(B15=\"\",C15=\"\"),\"\",IF(OR(D15=\"a\",E15=\"a\"),\"Certif ?\",IF(COUNTBLANK(D15:E15)=1,\"incomplet\",INDEX(TableauCBTPS5,LOOKUP(D15,temps5ème:NB_ligne5ème),LOOKUP(E15,CB5ème,nb_col5ème))))))","v":""},null,null,40.01,12,28.400000000000002,13,28.3]
[null,null,null,null,null,{"$f":"IF(AND(D16=\"\",E16=\"\"),\"\",IF(AND(B16=\"\",C16=\"\"),\"\",IF(OR(D16=\"a\",E16=\"a\"),\"Certif ?\",IF(COUNTBLANK(D16:E16)=1,\"incomplet\",INDEX(TableauCBTPS5,LOOKUP(D16,temps5ème:NB_ligne5ème),LOOKUP(E16,CB5ème,nb_col5ème))))))","v":""},null,null,41.01,13,29.200000000000003,14,29.1]
[null,null,null,null,null,{"$f":"IF(AND(D17=\"\",E17=\"\"),\"\",IF(AND(B17=\"\",C17=\"\"),\"\",IF(OR(D17=\"a\",E17=\"a\"),\"Certif ?\",IF(COUNTBLANK(D17:E17)=1,\"incomplet\",INDEX(TableauCBTPS5,LOOKUP(D17,temps5ème:NB_ligne5ème),LOOKUP(E17,CB5ème,nb_col5ème))))))","v":""},null,null,42.01,14,30,15,29.9]
[null,null,null,null,null,{"$f":"IF(AND(D18=\"\",E18=\"\"),\"\",IF(AND(B18=\"\",C18=\"\"),\"\",IF(OR(D18=\"a\",E18=\"a\"),\"Certif ?\",IF(COUNTBLANK(D18:E18)=1,\"incomplet\",INDEX(TableauCBTPS5,LOOKUP(D18,temps5ème:NB_ligne5ème),LOOKUP(E18,CB5ème,nb_col5ème))))))","v":""},null,null,43.01,15,30.8,16,30.7]
[null,null,null,null,null,{"$f":"IF(AND(D19=\"\",E19=\"\"),\"\",IF(AND(B19=\"\",C19=\"\"),\"\",IF(OR(D19=\"a\",E19=\"a\"),\"Certif ?\",IF(COUNTBLANK(D19:E19)=1,\"incomplet\",INDEX(TableauCBTPS5,LOOKUP(D19,temps5ème:NB_ligne5ème),LOOKUP(E19,CB5ème,nb_col5ème))))))","v":""},null,null,44.01,16,31.6,17,31.5]
[null,null,null,null,null,{"$f":"IF(AND(D20=\"\",E20=\"\"),\"\",IF(AND(B20=\"\",C20=\"\"),\"\",IF(OR(D20=\"a\",E20=\"a\"),\"Certif ?\",IF(COUNTBLANK(D20:E20)=1,\"incomplet\",INDEX(TableauCBTPS5,LOOKUP(D20,temps5ème:NB_ligne5ème),LOOKUP(E20,CB5ème,nb_col5ème))))))","v":""},null,null,45.01,17,33.1,18,33]
[null,null,null,null,null,{"$f":"IF(AND(D21=\"\",E21=\"\"),\"\",IF(AND(B21=\"\",C21=\"\"),\"\",IF(OR(D21=\"a\",E21=\"a\"),\"Certif ?\",IF(COUNTBLANK(D21:E21)=1,\"incomplet\",INDEX(TableauCBTPS5,LOOKUP(D21,temps5ème:NB_ligne5ème),LOOKUP(E21,CB5ème,nb_col5ème))))))","v":""},null,null,46.01,18,34.6,19,34.5]
[null,null,null,null,null,{"$f":"IF(AND(D22=\"\",E22=\"\"),\"\",IF(AND(B22=\"\",C22=\"\"),\"\",IF(OR(D22=\"a\",E22=\"a\"),\"Certif ?\",IF(COUNTBLANK(D22:E22)=1,\"incomplet\",INDEX(TableauCBTPS5,LOOKUP(D22,temps5ème:NB_ligne5ème),LOOKUP(E22,CB5ème,nb_col5ème))))))","v":""},null,null,47.01,19,36.1,20,36]
[null,null,null,null,null,{"$f":"IF(AND(D23=\"\",E23=\"\"),\"\",IF(AND(B23=\"\",C23=\"\"),\"\",IF(OR(D23=\"a\",E23=\"a\"),\"Certif ?\",IF(COUNTBLANK(D23:E23)=1,\"incomplet\",INDEX(TableauCBTPS5,LOOKUP(D23,temps5ème:NB_ligne5ème),LOOKUP(E23,CB5ème,nb_col5ème))))))","v":""},null,null,48.01,20,37.6,21,37.5]
[null,null,null,null,null,{"$f":"IF(AND(D24=\"\",E24=\"\"),\"\",IF(AND(B24=\"\",C24=\"\"),\"\",IF(OR(D24=\"a\",E24=\"a\"),\"Certif ?\",IF(COUNTBLANK(D24:E24)=1,\"incomplet\",INDEX(TableauCBTPS5,LOOKUP(D24,temps5ème:NB_ligne5ème),LOOKUP(E24,CB5ème,nb_col5ème))))))","v":""},null,null,49.01,21,{"$f":"M24+25","v":63},22,38]
[null,null,null,null,null,{"$f":"IF(AND(D25=\"\",E25=\"\"),\"\",IF(AND(B25=\"\",C25=\"\"),\"\",IF(OR(D25=\"a\",E25=\"a\"),\"Certif ?\",IF(COUNTBLANK(D25:E25)=1,\"incomplet\",INDEX(TableauCBTPS5,LOOKUP(D25,temps5ème:NB_ligne5ème),LOOKUP(E25,CB5ème,nb_col5ème))))))","v":""}]
[null,null,null,null,null,{"$f":"IF(AND(D26=\"\",E26=\"\"),\"\",IF(AND(B26=\"\",C26=\"\"),\"\",IF(OR(D26=\"a\",E26=\"a\"),\"Certif ?\",IF(COUNTBLANK(D26:E26)=1,\"incomplet\",INDEX(TableauCBTPS5,LOOKUP(D26,temps5ème:NB_ligne5ème),LOOKUP(E26,CB5ème,nb_col5ème))))))","v":""}]
[null,null,null,null,null,{"$f":"IF(AND(D27=\"\",E27=\"\"),\"\",IF(AND(B27=\"\",C27=\"\"),\"\",IF(OR(D27=\"a\",E27=\"a\"),\"Certif ?\",IF(COUNTBLANK(D27:E27)=1,\"incomplet\",INDEX(TableauCBTPS5,LOOKUP(D27,temps5ème:NB_ligne5ème),LOOKUP(E27,CB5ème,nb_col5ème))))))","v":""}]
[null,null,null,null,null,{"$f":"IF(AND(D28=\"\",E28=\"\"),\"\",IF(AND(B28=\"\",C28=\"\"),\"\",IF(OR(D28=\"a\",E28=\"a\"),\"Certif ?\",IF(COUNTBLANK(D28:E28)=1,\"incomplet\",INDEX(TableauCBTPS5,LOOKUP(D28,temps5ème:NB_ligne5ème),LOOKUP(E28,CB5ème,nb_col5ème))))))","v":""}]
[null,null,null,null,null,{"$f":"IF(AND(D29=\"\",E29=\"\"),\"\",IF(AND(B29=\"\",C29=\"\"),\"\",IF(OR(D29=\"a\",E29=\"a\"),\"Certif ?\",IF(COUNTBLANK(D29:E29)=1,\"incomplet\",INDEX(TableauCBTPS5,LOOKUP(D29,temps5ème:NB_ligne5ème),LOOKUP(E29,CB5ème,nb_col5ème))))))","v":""}]
[null,null,null,null,null,{"$f":"IF(AND(D30=\"\",E30=\"\"),\"\",IF(AND(B30=\"\",C30=\"\"),\"\",IF(OR(D30=\"a\",E30=\"a\"),\"Certif ?\",IF(COUNTBLANK(D30:E30)=1,\"incomplet\",INDEX(TableauCBTPS5,LOOKUP(D30,temps5ème:NB_ligne5ème),LOOKUP(E30,CB5ème,nb_col5ème))))))","v":""}]
[null,null,null,null,null,{"$f":"IF(AND(D31=\"\",E31=\"\"),\"\",IF(AND(B31=\"\",C31=\"\"),\"\",IF(OR(D31=\"a\",E31=\"a\"),\"Certif ?\",IF(COUNTBLANK(D31:E31)=1,\"incomplet\",INDEX(TableauCBTPS5,LOOKUP(D31,temps5ème:NB_ligne5ème),LOOKUP(E31,CB5ème,nb_col5ème))))))","v":""}]
[null,null,null,null,null,{"$f":"IF(AND(D32=\"\",E32=\"\"),\"\",IF(AND(B32=\"\",C32=\"\"),\"\",IF(OR(D32=\"a\",E32=\"a\"),\"Certif ?\",IF(COUNTBLANK(D32:E32)=1,\"incomplet\",INDEX(TableauCBTPS5,LOOKUP(D32,temps5ème:NB_ligne5ème),LOOKUP(E32,CB5ème,nb_col5ème))))))","v":""}]
[null,null,null,null,null,{"$f":"IF(AND(D33=\"\",E33=\"\"),\"\",IF(AND(B33=\"\",C33=\"\"),\"\",IF(OR(D33=\"a\",E33=\"a\"),\"Certif ?\",IF(COUNTBLANK(D33:E33)=1,\"incomplet\",INDEX(TableauCBTPS5,LOOKUP(D33,temps5ème:NB_ligne5ème),LOOKUP(E33,CB5ème,nb_col5ème))))))","v":""}]
[null,null,null,null,null,{"$f":"IF(AND(D34=\"\",E34=\"\"),\"\",IF(AND(B34=\"\",C34=\"\"),\"\",IF(OR(D34=\"a\",E34=\"a\"),\"Certif ?\",IF(COUNTBLANK(D34:E34)=1,\"incomplet\",INDEX(TableauCBTPS5,LOOKUP(D34,temps5ème:NB_ligne5ème),LOOKUP(E34,CB5ème,nb_col5ème))))))","v":""}]
[null,null,null,null,null,{"$f":"IF(AND(D35=\"\",E35=\"\"),\"\",IF(AND(B35=\"\",C35=\"\"),\"\",IF(OR(D35=\"a\",E35=\"a\"),\"Certif ?\",IF(COUNTBLANK(D35:E35)=1,\"incomplet\",INDEX(TableauCBTPS5,LOOKUP(D35,temps5ème:NB_ligne5ème),LOOKUP(E35,CB5ème,nb_col5ème))))))","v":""}]
[null,null,null,null,null,{"$f":"IF(AND(D36=\"\",E36=\"\"),\"\",IF(AND(B36=\"\",C36=\"\"),\"\",IF(OR(D36=\"a\",E36=\"a\"),\"Certif ?\",IF(COUNTBLANK(D36:E36)=1,\"incomplet\",INDEX(TableauCBTPS5,LOOKUP(D36,temps5ème:NB_ligne5ème),LOOKUP(E36,CB5ème,nb_col5ème))))))","v":""}]
[null,null,null,null,null,{"$f":"IF(AND(D37=\"\",E37=\"\"),\"\",IF(AND(B37=\"\",C37=\"\"),\"\",IF(OR(D37=\"a\",E37=\"a\"),\"Certif ?\",IF(COUNTBLANK(D37:E37)=1,\"incomplet\",INDEX(TableauCBTPS5,LOOKUP(D37,temps5ème:NB_ligne5ème),LOOKUP(E37,CB5ème,nb_col5ème))))))","v":""}]
[null,null,null,null,null,{"$f":"IF(AND(D38=\"\",E38=\"\"),\"\",IF(AND(B38=\"\",C38=\"\"),\"\",IF(OR(D38=\"a\",E38=\"a\"),\"Certif ?\",IF(COUNTBLANK(D38:E38)=1,\"incomplet\",INDEX(TableauCBTPS5,LOOKUP(D38,temps5ème:NB_ligne5ème),LOOKUP(E38,CB5ème,nb_col5ème))))))","v":""}]
[null,"Nom","Prénom","Moyenne",null,{"$f":"IF(COUNT(F4:F38)=0,\"\",AVERAGE(F4:F38))","v":13}]

{"sheet":"BarêmeModifiable","index":4,"n_rows":39,"n_cols":13,"rows_kept":39,"cut":false,"hidden":false,"merged":[[1,1,1,5],[38,3,38,4]]}
[]
[null,"Notes Temps/coup de bras barème libre",null,null,null,null,null,null,null,null,"tempsmodifiable","NB lignes"]
[null,"Nom","Prénom","Temps","CB","Notes",null,null,"CB","NB col",1,1,"barême\ntemps"]
[null,"Belhadj","jean",25.2,35,{"$f":"IF(AND(D4=\"\",E4=\"\"),\"\",IF(AND(B4=\"\",C4=\"\"),\"\",IF(OR(D4=\"a\",E4=\"a\"),\"Certif ?\",IF(COUNTBLANK(D4:E4)=1,\"incomplet\",INDEX(TableauCBTPSmodifiable,LOOKUP(D4,tempsmodifiable:NBLigneLibre),LOOKUP(E4,CB,NBCoLibre))))))","v":16},null,{"$f":"I4","v":1},1,1,{"$f":"M4+0.1","v":20.100000000000001},2,{"$f":"('Barème 5ème'!B6)","v":20}]
[null,"Durand","Paul",22,null,{"$f":"IF(AND(D5=\"\",E5=\"\"),\"\",IF(AND(B5=\"\",C5=\"\"),\"\",IF(OR(D5=\"a\",E5=\"a\"),\"Certif ?\",IF(COUNTBLANK(D5:E5)=1,\"incomplet\",INDEX(TableauCBTPSmodifiable,LOOKUP(D5,tempsmodifiable:NBLigneLibre),LOOKUP(E5,CB,NBCoLibre))))))","v":"incomplet"},null,{"$f":"I5+0.01","v":{"$error":"#VALUE!"}},{"$f":"TRANSPOSE('Barème libre'!C5:V5)","v":"…"},2,{"$error":"#VALUE!"},3,{"$f":"('Barème libre'!W7)","v":"…"}]
[null,"Ficus","Marie",33,"a",{"$f":"IF(AND(D6=\"\",E6=\"\"),\"\",IF(AND(B6=\"\",C6=\"\"),\"\",IF(OR(D6=\"a\",E6=\"a\"),\"Certif ?\",IF(COUNTBLANK(D6:E6)=1,\"incomplet\",INDEX(TableauCBTPSmodifiable,LOOKUP(D6,tempsmodifiable:NBLigneLibre),LOOKUP(E6,CB,NBCoLibre))))))","v":"Certif ?"},null,{"$f":"I6+0.01","v":{"$error":"#VALUE!"}},"…",3,{"$error":"#VALUE!"},4,{"$f":"('Barème libre'!W8)","v":"…"}]
[null,"Gouder","Isabelle","A","A",{"$f":"IF(AND(D7=\"\",E7=\"\"),\"\",IF(AND(B7=\"\",C7=\"\"),\"\",IF(OR(D7=\"a\",E7=\"a\"),\"Certif ?\",IF(COUNTBLANK(D7:E7)=1,\"incomplet\",INDEX(TableauCBTPSmodifiable,LOOKUP(D7,tempsmodifiable:NBLigneLibre),LOOKUP(E7,CB,NBCoLibre))))))","v":"Certif ?"},null,{"$error":"#VALUE!"},"…",4,{"$error":"#VALUE!"},5,{"$f":"('Barème libre'!W9)","v":"…"}]
[null,null,null,null,null,{"$f":"IF(AND(D8=\"\",E8=\"\"),\"\",IF(AND(B8=\"\",C8=\"\"),\"\",IF(OR(D8=\"a\",E8=\"a\"),\"Certif ?\",IF(COUNTBLANK(D8:E8)=1,\"incomplet\",INDEX(TableauCBTPSmodifiable,LOOKUP(D8,tempsmodifiable:NBLigneLibre),LOOKUP(E8,CB,NBCoLibre))))))","v":""},null,{"$error":"#VALUE!"},"…",5,{"$error":"#VALUE!"},6,{"$f":"('Barème libre'!W10)","v":"…"}]
[null,null,null,null,null,{"$f":"IF(AND(D9=\"\",E9=\"\"),\"\",IF(AND(B9=\"\",C9=\"\"),\"\",IF(OR(D9=\"a\",E9=\"a\"),\"Certif ?\",IF(COUNTBLANK(D9:E9)=1,\"incomplet\",INDEX(TableauCBTPSmodifiable,LOOKUP(D9,tempsmodifiable:NBLigneLibre),LOOKUP(E9,CB,NBCoLibre))))))","v":""},null,{"$error":"#VALUE!"},"…",6,{"$error":"#VALUE!"},7,{"$f":"('Barème libre'!W11)","v":"…"}]
[null,null,null,null,null,{"$f":"IF(AND(D10=\"\",E10=\"\"),\"\",IF(AND(B10=\"\",C10=\"\"),\"\",IF(OR(D10=\"a\",E10=\"a\"),\"Certif ?\",IF(COUNTBLANK(D10:E10)=1,\"incomplet\",INDEX(TableauCBTPSmodifiable,LOOKUP(D10,tempsmodifiable:NBLigneLibre),LOOKUP(E10,CB,NBCoLibre))))))","v":""},null,32.01,32,7,26.400000000000002,8,{"$f":"('Barème libre'!W12)","v":26.3}]
[null,null,null,null,null,{"$f":"IF(AND(D11=\"\",E11=\"\"),\"\",IF(AND(B11=\"\",C11=\"\"),\"\",IF(OR(D11=\"a\",E11=\"a\"),\"Certif ?\",IF(COUNTBLANK(D11:E11)=1,\"incomplet\",INDEX(TableauCBTPSmodifiable,LOOKUP(D11,tempsmodifiable:NBLigneLibre),LOOKUP(E11,CB,NBCoLibre))))))","v":""},null,34.01,34,8,27.200000000000003,9,{"$f":"('Barème libre'!W13)","v":27.1}]
[null,null,null,null,null,{"$f":"IF(AND(D12=\"\",E12=\"\"),\"\",IF(AND(B12=\"\",C12=\"\"),\"\",IF(OR(D12=\"a\",E12=\"a\"),\"Certif ?\",IF(COUNTBLANK(D12:E12)=1,\"incomplet\",INDEX(TableauCBTPSmodifiable,LOOKUP(D12,tempsmodifiable:NBLigneLibre),LOOKUP(E12,CB,NBCoLibre))))))","v":""},null,36.01,36,9,28,10,{"$f":"('Barème libre'!W14)","v":27.9}]
[null,null,null,null,null,{"$f":"IF(AND(D13=\"\",E13=\"\"),\"\",IF(AND(B13=\"\",C13=\"\"),\"\",IF(OR(D13=\"a\",E13=\"a\"),\"Certif ?\",IF(COUNTBLANK(D13:E13)=1,\"incomplet\",INDEX(TableauCBTPSmodifiable,LOOKUP(D13,tempsmodifiable:NBLigneLibre),LOOKUP(E13,CB,NBCoLibre))))))","v":""},null,38.01,38,10,28.8,11,{"$f":"('Barème libre'!W15)","v":28.7}]
[null,null,null,null,null,{"$f":"IF(AND(D14=\"\",E14=\"\"),\"\",IF(AND(B14=\"\",C14=\"\"),\"\",IF(OR(D14=\"a\",E14=\"a\"),\"Certif ?\",IF(COUNTBLANK(D14:E14)=1,\"incomplet\",INDEX(TableauCBTPSmodifiable,LOOKUP(D14,tempsmodifiable:NBLigneLibre),LOOKUP(E14,CB,NBCoLibre))))))","v":""},null,39.01,39,11,29.6,12,{"$f":"('Barème libre'!W16)","v":29.5}]
[null,null,null,null,null,{"$f":"IF(AND(D15=\"\",E15=\"\"),\"\",IF(AND(B15=\"\",C15=\"\"),\"\",IF(OR(D15=\"a\",E15=\"a\"),\"Certif ?\",IF(COUNTBLANK(D15:E15)=1,\"incomplet\",INDEX(TableauCBTPSmodifiable,LOOKUP(D15,tempsmodifiable:NBLigneLibre),LOOKUP(E15,CB,NBCoLibre))))))","v":""},null,40.01,40,12,30.400000000000002,13,{"$f":"('Barème libre'!W17)","v":30.3}]
[null,null,null,null,null,{"$f":"IF(AND(D16=\"\",E16=\"\"),\"\",IF(AND(B16=\"\",C16=\"\"),\"\",IF(OR(D16=\"a\",E16=\"a\"),\"Certif ?\",IF(COUNTBLANK(D16:E16)=1,\"incomplet\",INDEX(TableauCBTPSmodifiable,LOOKUP(D16,tempsmodifiable:NBLigneLibre),LOOKUP(E16,CB,NBCoLibre))))))","v":""},null,41.01,41,13,31.200000000000003,14,{"$f":"('Barème libre'!W18)","v":31.1}]
[null,null,null,null,null,{"$f":"IF(AND(D17=\"\",E17=\"\"),\"\",IF(AND(B17=\"\",C17=\"\"),\"\",IF(OR(D17=\"a\",E17=\"a\"),\"Certif ?\",IF(COUNTBLANK(D17:E17)=1,\"incomplet\",INDEX(TableauCBTPSmodifiable,LOOKUP(D17,tempsmodifiable:NBLigneLibre),LOOKUP(E17,CB,NBCoLibre))))))","v":""},null,{"$error":"#VALUE!"},"…",14,32,15,{"$f":"('Barème libre'!W19)","v":31.9}]
[null,null,null,null,null,{"$f":"IF(AND(D18=\"\",E18=\"\"),\"\",IF(AND(B18=\"\",C18=\"\"),\"\",IF(OR(D18=\"a\",E18=\"a\"),\"Certif ?\",IF(COUNTBLANK(D18:E18)=1,\"incomplet\",INDEX(TableauCBTPSmodifiable,LOOKUP(D18,tempsmodifiable:NBLigneLibre),LOOKUP(E18,CB,NBCoLibre))))))","v":""},null,{"$error":"#VALUE!"},"…",15,32.800000000000004,16,{"$f":"('Barème libre'!W20)","v":32.700000000000003}]
[null,null,null,null,null,{"$f":"IF(AND(D19=\"\",E19=\"\"),\"\",IF(AND(B19=\"\",C19=\"\"),\"\",IF(OR(D19=\"a\",E19=\"a\"),\"Certif ?\",IF(COUNTBLANK(D19:E19)=1,\"incomplet\",INDEX(TableauCBTPSmodifiable,LOOKUP(D19,tempsmodifiable:NBLigneLibre),LOOKUP(E19,CB,NBCoLibre))))))","v":""},null,{"$error":"#VALUE!"},"…",16,33.6,17,{"$f":"('Barème libre'!W21)","v":33.5}]
[null,null,null,null,null,{"$f":"IF(AND(D20=\"\",E20=\"\"),\"\",IF(AND(B20=\"\",C20=\"\"),\"\",IF(OR(D20=\"a\",E20=\"a\"),\"Certif ?\",IF(COUNTBLANK(D20:E20)=1,\"incomplet\",INDEX(TableauCBTPSmodifiable,LOOKUP(D20,tempsmodifiable:NBLigneLibre),LOOKUP(E20,CB,NBCoLibre))))))","v":""},null,{"$error":"#VALUE!"},"…",17,{"$error":"#VALUE!"},18,{"$f":"('Barème libre'!W22)","v":"…"}]
[null,null,null,null,null,{"$f":"IF(AND(D21=\"\",E21=\"\"),\"\",IF(AND(B21=\"\",C21=\"\"),\"\",IF(OR(D21=\"a\",E21=\"a\"),\"Certif ?\",IF(COUNTBLANK(D21:E21)=1,\"incomplet\",INDEX(TableauCBTPSmodifiable,LOOKUP(D21,tempsmodifiable:NBLigneLibre),LOOKUP(E21,CB,NBCoLibre))))))","v":""},null,{"$error":"#VALUE!"},"…",18,{"$error":"#VALUE!"},19,{"$f":"('Barème libre'!W23)","v":"…"}]
[null,null,null,null,null,{"$f":"IF(AND(D22=\"\",E22=\"\"),\"\",IF(AND(B22=\"\",C22=\"\"),\"\",IF(OR(D22=\"a\",E22=\"a\"),\"Certif ?\",IF(COUNTBLANK(D22:E22)=1,\"incomplet\",INDEX(TableauCBTPSmodifiable,LOOKUP(D22,tempsmodifiable:NBLigneLibre),LOOKUP(E22,CB,NBCoLibre))))))","v":""},null,{"$error":"#VALUE!"},"…",19,{"$error":"#VALUE!"},20,{"$f":"('Barème libre'!W24)","v":"…"}]
[null,null,null,null,null,{"$f":"IF(AND(D23=\"\",E23=\"\"),\"\",IF(AND(B23=\"\",C23=\"\"),\"\",IF(OR(D23=\"a\",E23=\"a\"),\"Certif ?\",IF(COUNTBLANK(D23:E23)=1,\"incomplet\",INDEX(TableauCBTPSmodifiable,LOOKUP(D23,tempsmodifiable:NBLigneLibre),LOOKUP(E23,CB,NBCoLibre))))))","v":""},null,{"$error":"#VALUE!"},"…",20,{"$error":"#VALUE!"},21,{"$f":"('Barème libre'!W25)","v":"…"}]
[null,null,null,null,null,{"$f":"IF(AND(D24=\"\",E24=\"\"),\"\",IF(AND(B24=\"\",C24=\"\"),\"\",IF(OR(D24=\"a\",E24=\"a\"),\"Certif ?\",IF(COUNTBLANK(D24:E24)=1,\"incomplet\",INDEX(TableauCBTPSmodifiable,LOOKUP(D24,tempsmodifiable:NBLigneLibre),LOOKUP(E24,CB,NBCoLibre))))))","v":""},null,{"$error":"#VALUE!"},"…",21,{"$f":"M24+25","v":85},22,{"$f":"('Barème libre'!W26)","v":60}]
[null,null,null,null,null,{"$f":"IF(AND(D25=\"\",E25=\"\"),\"\",IF(AND(B25=\"\",C25=\"\"),\"\",IF(OR(D25=\"a\",E25=\"a\"),\"Certif ?\",IF(COUNTBLANK(D25:E25)=1,\"incomplet\",INDEX(TableauCBTPSmodifiable,LOOKUP(D25,tempsmodifiable:NBLigneLibre),LOOKUP(E25,CB,NBCoLibre))))))","v":""}]
[null,null,null,null,null,{"$f":"IF(AND(D26=\"\",E26=\"\"),\"\",IF(AND(B26=\"\",C26=\"\"),\"\",IF(OR(D26=\"a\",E26=\"a\"),\"Certif ?\",IF(COUNTBLANK(D26:E26)=1,\"incomplet\",INDEX(TableauCBTPSmodifiable,LOOKUP(D26,tempsmodifiable:NBLigneLibre),LOOKUP(E26,CB,NBCoLibre))))))","v":""}]
[null,null,null,null,null,{"$f":"IF(AND(D27=\"\",E27=\"\"),\"\",IF(AND(B27=\"\",C27=\"\"),\"\",IF(OR(D27=\"a\",E27=\"a\"),\"Certif ?\",IF(COUNTBLANK(D27:E27)=1,\"incomplet\",INDEX(TableauCBTPSmodifiable,LOOKUP(D27,tempsmodifiable:NBLigneLibre),LOOKUP(E27,CB,NBCoLibre))))))","v":""}]
[null,null,null,null,null,{"$f":"IF(AND(D28=\"\",E28=\"\"),\"\",IF(AND(B28=\"\",C28=\"\"),\"\",IF(OR(D28=\"a\",E28=\"a\"),\"Certif ?\",IF(COUNTBLANK(D28:E28)=1,\"incomplet\",INDEX(TableauCBTPSmodifiable,LOOKUP(D28,tempsmodifiable:NBLigneLibre),LOOKUP(E28,CB,NBCoLibre))))))","v":""}]
[null,null,null,null,null,{"$f":"IF(AND(D29=\"\",E29=\"\"),\"\",IF(AND(B29=\"\",C29=\"\"),\"\",IF(OR(D29=\"a\",E29=\"a\"),\"Certif ?\",IF(COUNTBLANK(D29:E29)=1,\"incomplet\",INDEX(TableauCBTPSmodifiable,LOOKUP(D29,tempsmodifiable:NBLigneLibre),LOOKUP(E29,CB,NBCoLibre))))))","v":""}]
[null,null,null,null,null,{"$f":"IF(AND(D30=\"\",E30=\"\"),\"\",IF(AND(B30=\"\",C30=\"\"),\"\",IF(OR(D30=\"a\",E30=\"a\"),\"Certif ?\",IF(COUNTBLANK(D30:E30)=1,\"incomplet\",INDEX(TableauCBTPSmodifiable,LOOKUP(D30,tempsmodifiable:NBLigneLibre),LOOKUP(E30,CB,NBCoLibre))))))","v":""}]
[null,null,null,null,null,{"$f":"IF(AND(D31=\"\",E31=\"\"),\"\",IF(AND(B31=\"\",C31=\"\"),\"\",IF(OR(D31=\"a\",E31=\"a\"),\"Certif ?\",IF(COUNTBLANK(D31:E31)=1,\"incomplet\",INDEX(TableauCBTPSmodifiable,LOOKUP(D31,tempsmodifiable:NBLigneLibre),LOOKUP(E31,CB,NBCoLibre))))))","v":""}]
[null,null,null,null,null,{"$f":"IF(AND(D32=\"\",E32=\"\"),\"\",IF(AND(B32=\"\",C32=\"\"),\"\",IF(OR(D32=\"a\",E32=\"a\"),\"Certif ?\",IF(COUNTBLANK(D32:E32)=1,\"incomplet\",INDEX(TableauCBTPSmodifiable,LOOKUP(D32,tempsmodifiable:NBLigneLibre),LOOKUP(E32,CB,NBCoLibre))))))","v":""}]
[null,null,null,null,null,{"$f":"IF(AND(D33=\"\",E33=\"\"),\"\",IF(AND(B33=\"\",C33=\"\"),\"\",IF(OR(D33=\"a\",E33=\"a\"),\"Certif ?\",IF(COUNTBLANK(D33:E33)=1,\"incomplet\",INDEX(TableauCBTPSmodifiable,LOOKUP(D33,tempsmodifiable:NBLigneLibre),LOOKUP(E33,CB,NBCoLibre))))))","v":""}]
[null,null,null,null,null,{"$f":"IF(AND(D34=\"\",E34=\"\"),\"\",IF(AND(B34=\"\",C34=\"\"),\"\",IF(OR(D34=\"a\",E34=\"a\"),\"Certif ?\",IF(COUNTBLANK(D34:E34)=1,\"incomplet\",INDEX(TableauCBTPSmodifiable,LOOKUP(D34,tempsmodifiable:NBLigneLibre),LOOKUP(E34,CB,NBCoLibre))))))","v":""}]
[null,null,null,null,null,{"$f":"IF(AND(D35=\"\",E35=\"\"),\"\",IF(AND(B35=\"\",C35=\"\"),\"\",IF(OR(D35=\"a\",E35=\"a\"),\"Certif ?\",IF(COUNTBLANK(D35:E35)=1,\"incomplet\",INDEX(TableauCBTPSmodifiable,LOOKUP(D35,tempsmodifiable:NBLigneLibre),LOOKUP(E35,CB,NBCoLibre))))))","v":""}]
[null,null,null,null,null,{"$f":"IF(AND(D36=\"\",E36=\"\"),\"\",IF(AND(B36=\"\",C36=\"\"),\"\",IF(OR(D36=\"a\",E36=\"a\"),\"Certif ?\",IF(COUNTBLANK(D36:E36)=1,\"incomplet\",INDEX(TableauCBTPSmodifiable,LOOKUP(D36,tempsmodifiable:NBLigneLibre),LOOKUP(E36,CB,NBCoLibre))))))","v":""}]
[null,null,null,null,null,{"$f":"IF(AND(D37=\"\",E37=\"\"),\"\",IF(AND(B37=\"\",C37=\"\"),\"\",IF(OR(D37=\"a\",E37=\"a\"),\"Certif ?\",IF(COUNTBLANK(D37:E37)=1,\"incomplet\",INDEX(TableauCBTPSmodifiable,LOOKUP(D37,tempsmodifiable:NBLigneLibre),LOOKUP(E37,CB,NBCoLibre))))))","v":""}]
[null,null,null,null,null,{"$f":"IF(AND(D38=\"\",E38=\"\"),\"\",IF(AND(B38=\"\",C38=\"\"),\"\",IF(OR(D38=\"a\",E38=\"a\"),\"Certif ?\",IF(COUNTBLANK(D38:E38)=1,\"incomplet\",INDEX(TableauCBTPSmodifiable,LOOKUP(D38,tempsmodifiable:NBLigneLibre),LOOKUP(E38,CB,NBCoLibre))))))","v":""}]
[null,"Nom","Prénom","Moyenne",null,{"$f":"IF(COUNT(F4:F38)=0,\"\",AVERAGE(F4:F38))","v":16}]

{"sheet":"Barème 6ème","index":5,"n_rows":27,"n_cols":24,"rows_kept":27,"cut":false,"hidden":false,"merged":[[1,0,3,0],[1,23,3,23],[0,1,0,22]]}
[null,"6ème-Tableau de correspondance entre le temps réalisé sur 25m crawl et le nombre de coup de bras-6ème"]
["6ème",null,null,null,null,null,null,"Nombre de coup de bras",null,null,null,null,null,null,null,null,null,null,null,null,null,null,null,"6ème"]
[]
[]
[null,"    CB\ntps",22,24,26,28,30,32,34,36,38,39,40,41,42,43,44,45,46,47,48,"49 \net +","CB\n    tps"]
[null,22,20,{"$f":"C6-0.5","v":19.5},19,18.5,18,17.5,17,16.5,16,15.5,15,14.5,14,13.5,13,12.5,12,{"$f":"S6-0.5","v":11.5},11,10.5,{"$f":"B6","v":22}]
[null,22.7,19.5,19,18.5,18,17.5,17,16.5,16,15.5,15,14.5,14,13.5,13,12.5,12,11.5,11,10.5,10,{"$f":"B7","v":22.7}]
[null,23.4,19,18.5,18,17.5,17,16.5,16,15.5,15,14.5,14,13.5,13,12.5,12,11.5,11,10.5,10,9.5,23.4]
["Temps",24.1,18.5,18,17.5,17,16.5,16,15.5,15,14.5,14,13.5,13,12.5,12,11.5,11,10.5,10,9.5,9,24.1]
[null,24.8,18,17.5,17,16.5,16,15.5,15,14.5,14,13.5,13,12.5,12,11.5,11,10.5,10,9.5,9,8.5,24.8]
[null,25.5,17.5,17,16.5,16,15.5,15,14.5,14,13.5,13,12.5,12,11.5,11,10.5,10,9.5,9,8.5,8,25.5]
[null,26.3,17,16.5,16,15.5,15,14.5,14,13.5,13,12.5,12,11.5,11,10.5,10,9.5,9,8.5,8,7.5,26.3]
[null,27.1,16.5,16,15.5,15,14.5,14,13.5,13,12.5,12,11.5,11,10.5,10,9.5,9,8.5,8,7.5,7,27.1]
[null,27.9,16,15.5,15,14.5,14,13.5,13,12.5,12,11.5,11,10.5,10,9.5,9,8.5,8,7.5,7,6.5,27.9]
[null,28.7,15.5,15,14.5,14,13.5,13,12.5,12,11.5,11,10.5,10,9.5,9,8.5,8,7.5,7,6.5,6,28.7]
[null,29.5,15,14.5,14,13.5,13,12.5,12,11.5,11,10.5,10,9.5,9,8.5,8,7.5,7,6.5,6,5.5,29.5]
[null,30.3,14.5,14,13.5,13,12.5,12,11.5,11,10.5,10,9.5,9,8.5,8,7.5,7,6.5,6,5.5,5,30.3]
[null,31.1,14,13.5,13,12.5,12,11.5,11,10.5,10,9.5,9,8.5,8,7.5,7,6.5,6,5.5,5,4.5,31.1]
[null,31.9,13.5,13,12.5,12,11.5,11,10.5,10,9.5,9,8.5,8,7.5,7,6.5,6,5.5,5,4.5,4,31.9]
[null,32.700000000000003,13,12.5,12,11.5,11,10.5,10,9.5,9,8.5,8,7.5,7,6.5,6,5.5,5,4.5,4,3.5,32.700000000000003]
[null,33.5,12.5,12,11.5,11,10.5,10,9.5,9,8.5,8,7.5,7,6.5,6,5.5,5,{"$f":"R21-0.5","v":4.5},4,3.5,3,33.5]
[null,35,12,{"$f":"C22-0.5","v":11.5},11,10.5,10,9.5,9,8.5,8,7.5,7,6.5,6,5.5,5,4.5,4,3.5,3,2.5,35]
[null,36.5,11.5,11,10.5,10,9.5,9,8.5,8,7.5,7,6.5,6,5.5,5,4.5,4,3.5,3,2.5,2,36.5]
[null,38,11,10.5,10,9.5,9,8.5,8,7.5,7,6.5,6,5.5,5,4.5,4,3.5,3,2.5,2,1.5,38]
[null,39.5,10.5,10,9.5,9,8.5,8,7.5,7,6.5,6,5.5,5,4.5,4,3.5,3,2.5,2,1.5,1,39.5]
[null,"40et+",10,9.5,9,8.5,8,7.5,7,6.5,6,5.5,5,4.5,4,3.5,3,2.5,2,1.5,1,0.5,"40et+"]
[null,"tps\n    CB",22,24,26,28,30,32,34,36,38,39,40,41,42,43,44,45,46,47,48,"49 \net +","    tps\nCB"]

{"sheet":"Barème 5ème","index":6,"n_rows":27,"n_cols":24,"rows_kept":27,"cut":false,"hidden":false,"merged":[[1,0,3,0],[1,23,3,23],[0,1,0,22]]}
[null,"5ème-Tableau de correspondance entre le temps réalisé sur 25m crawl et le nombre de coup de bras-5ème"]
["5ème",null,null,null,null,"Nombre de coup de bras",null,null,null,null,null,null,null,null,null,null,null,null,null,null,null,null,null,"5ème"]
[]
[]
[null,"    CB\ntps",22,24,26,28,30,32,34,36,38,39,40,41,42,43,44,45,46,47,48,"48 \net +","CB\n    tps"]
[null,20,20,{"$f":"C6-0.5","v":19.5},19,18.5,18,17.5,17,16.5,16,15.5,15,14.5,14,13.5,13,12.5,12,{"$f":"S6-0.5","v":11.5},11,{"$f":"U6-0.5","v":10.5},{"$f":"B6","v":20}]
[null,20.7,19.5,19,18.5,18,17.5,17,16.5,16,15.5,15,14.5,14,13.5,13,12.5,12,11.5,11,10.5,10,{"$f":"B7","v":20.7}]
["Temps",21.4,19,18.5,18,17.5,17,16.5,16,15.5,15,14.5,14,13.5,13,12.5,12,11.5,11,10.5,10,9.5,21.4]
[null,22.1,18.5,18,17.5,17,16.5,16,15.5,15,14.5,14,13.5,13,12.5,12,11.5,11,10.5,10,9.5,9,22.1]
[null,22.8,18,17.5,17,16.5,16,15.5,15,14.5,14,13.5,13,12.5,12,11.5,11,10.5,10,9.5,9,8.5,22.8]
[null,23.5,17.5,17,16.5,16,15.5,15,14.5,14,13.5,13,12.5,12,11.5,11,10.5,10,9.5,9,8.5,8,23.5]
[null,24.3,17,16.5,16,15.5,15,14.5,14,13.5,13,12.5,12,11.5,11,10.5,10,9.5,9,8.5,8,7.5,24.3]
[null,25.1,16.5,16,15.5,15,14.5,14,13.5,13,12.5,12,11.5,11,10.5,10,9.5,9,8.5,8,7.5,7,25.1]
[null,25.9,16,15.5,15,14.5,14,13.5,13,12.5,12,11.5,11,10.5,10,9.5,9,8.5,8,7.5,7,6.5,25.9]
[null,26.7,15.5,15,14.5,14,13.5,13,12.5,12,11.5,11,10.5,10,9.5,9,8.5,8,7.5,7,6.5,6,26.7]
[null,27.5,15,14.5,14,13.5,13,12.5,12,11.5,11,10.5,10,9.5,9,8.5,8,7.5,7,6.5,6,5.5,27.5]
[null,28.3,14.5,14,13.5,13,12.5,12,11.5,11,10.5,10,9.5,9,8.5,8,7.5,7,6.5,6,5.5,5,28.3]
[null,29.1,14,13.5,13,12.5,12,11.5,11,10.5,10,9.5,9,8.5,8,7.5,7,6.5,6,5.5,5,4.5,29.1]
[null,29.9,13.5,13,12.5,12,11.5,11,10.5,10,9.5,9,8.5,8,7.5,7,6.5,6,5.5,5,4.5,4,29.9]
[null,30.7,13,12.5,12,11.5,11,10.5,10,9.5,9,8.5,8,7.5,7,6.5,6,5.5,5,4.5,4,3.5,30.7]
[null,31.5,12.5,12,11.5,11,10.5,10,9.5,9,8.5,8,7.5,7,6.5,6,5.5,5,{"$f":"R21-0.5","v":4.5},4,3.5,3,31.5]
[null,33,12,{"$f":"C22-0.5","v":11.5},11,10.5,10,9.5,9,8.5,8,7.5,7,6.5,6,5.5,5,4.5,4,3.5,3,2.5,33]
[null,34.5,11.5,11,10.5,10,9.5,9,8.5,8,7.5,7,6.5,6,5.5,5,4.5,4,3.5,3,2.5,2,34.5]
[null,36,11,10.5,10,9.5,9,8.5,8,7.5,7,6.5,6,5.5,5,4.5,4,3.5,3,2.5,2,1.5,36]
[null,37.5,10.5,10,9.5,9,8.5,8,7.5,7,6.5,6,5.5,5,4.5,4,3.5,3,2.5,2,1.5,1,37.5]
[null,"38et+",10,9.5,9,8.5,8,7.5,7,6.5,6,5.5,5,4.5,4,3.5,3,2.5,2,1.5,1,0.5,"38et+"]
[null,"tps\n    CB",22,24,26,28,30,32,34,36,38,39,40,41,42,43,44,45,46,47,48,"48 \net +","    tps\nCB"]

{"sheet":"Barème libre","index":7,"n_rows":28,"n_cols":24,"rows_kept":28,"cut":false,"hidden":false,"merged":[[0,1,0,22],[1,0,3,2],[1,23,3,24],[9,0,18,0]]}
[null,"Tableau de correspondance entre le temps réalisé et le nombre de coup de bras"]
["Modifiable",null,null,null,null,"Nombre de coup de bras (A MODIFIER)",null,null,null,null,null,null,null,null,null,null,null,null,null,null,null,null,null,"Modifiable"]
[]
[]
[null,"    CB\ntps","…","…","…","…","…",32,34,36,38,39,40,41,"…","…","…","…","…","…","…","…","CB\n    tps"]
[null,"…",20,{"$f":"C6-0.5","v":19.5},{"$f":"D6-0.5","v":19},18.5,18,17.5,17,16.5,16,15.5,15,14.5,14,13.5,13,12.5,12,{"$f":"S6-0.5","v":11.5},11,{"$f":"U6-0.5","v":10.5},{"$f":"$B6","v":"…"}]
[null,"…",19.5,19,18.5,18,17.5,17,16.5,16,15.5,15,14.5,14,13.5,13,12.5,12,11.5,11,{"$f":"T7-0.5","v":10.5},{"$f":"U7-0.5","v":10},{"$f":"$B7","v":"…"}]
["Temps","…",19,18.5,18,17.5,17,16.5,16,15.5,15,14.5,14,13.5,13,12.5,12,11.5,11,10.5,10,9.5,"…"]
[null,"…",18.5,18,17.5,17,16.5,16,15.5,15,14.5,14,13.5,13,12.5,12,11.5,11,{"$f":"R9-0.5","v":10.5},10,9.5,9,"…"]
["(A MODIFIER)","…",18,17.5,17,16.5,16,15.5,15,14.5,14,13.5,13,12.5,12,11.5,11,10.5,10,9.5,9,8.5,"…"]
[null,"…",17.5,17,16.5,16,15.5,15,14.5,14,13.5,13,12.5,12,11.5,11,10.5,10,9.5,9,8.5,8,"…"]
[null,26.3,17,16.5,16,15.5,15,14.5,14,13.5,13,12.5,12,11.5,11,10.5,10,9.5,9,8.5,8,7.5,26.3]
[null,27.1,16.5,16,15.5,15,14.5,14,13.5,13,12.5,12,11.5,11,10.5,10,9.5,9,8.5,8,7.5,7,27.1]
[null,27.9,16,15.5,15,14.5,14,13.5,13,12.5,12,11.5,11,10.5,10,9.5,{"$f":"P14-0.5","v":9},8.5,8,7.5,7,6.5,27.9]
[null,28.7,15.5,15,14.5,14,13.5,13,12.5,12,11.5,11,10.5,10,9.5,9,8.5,8,7.5,{"$f":"S15-0.5","v":7},6.5,6,{"$f":"$B15","v":28.7}]
[null,29.5,15,14.5,14,13.5,13,12.5,12,11.5,11,10.5,10,9.5,9,8.5,8,7.5,7,6.5,6,5.5,29.5]
[null,30.3,14.5,14,13.5,13,12.5,12,11.5,11,10.5,10,9.5,9,8.5,8,7.5,7,6.5,6,5.5,5,30.3]
[null,31.1,14,13.5,13,12.5,12,11.5,11,10.5,10,9.5,9,8.5,8,7.5,7,6.5,6,5.5,5,4.5,31.1]
[null,31.9,13.5,13,12.5,12,11.5,11,10.5,10,9.5,9,8.5,8,7.5,7,6.5,6,5.5,5,4.5,4,31.9]
[null,32.700000000000003,13,12.5,12,11.5,11,10.5,10,9.5,9,8.5,8,7.5,7,6.5,6,5.5,5,4.5,4,3.5,32.700000000000003]
[null,33.5,12.5,12,11.5,11,10.5,10,9.5,9,8.5,8,7.5,7,6.5,6,5.5,5,{"$f":"R21-0.5","v":4.5},4,3.5,3,33.5]
[null,"…",12,{"$f":"C22-0.5","v":11.5},11,10.5,10,9.5,9,8.5,8,7.5,7,6.5,6,5.5,5,4.5,4,3.5,3,2.5,"…"]
[null,"…",11.5,11,10.5,10,9.5,9,8.5,8,7.5,7,6.5,6,5.5,5,4.5,4,3.5,3,2.5,2,"…"]
[null,"…",11,10.5,10,9.5,9,8.5,8,7.5,7,6.5,6,5.5,5,4.5,4,3.5,3,2.5,2,1.5,"…"]
[null,"…",10.5,10,9.5,9,8.5,8,7.5,7,6.5,6,5.5,5,4.5,4,3.5,3,2.5,2,1.5,1,"…"]
[null,60,10,9.5,9,8.5,8,7.5,7,6.5,6,5.5,5,4.5,4,3.5,3,2.5,2,1.5,1,0.5,60]
[null,"tps\n    CB",{"$f":"C$5","v":"…"},{"$f":"D$5","v":"…"},"…","…","…",32,34,36,38,39,40,41,"…","…","…","…","…","…","…","…","    tps\nCB"]
["Pour modifier le barème, vous devez rentrer vos valeurs: dans la colonne de gauche pour le temps, et la ligne du haut pour le nombre de coups de bras."]

{"sheet":"explication","index":8,"n_rows":1,"n_cols":1,"rows_kept":1,"cut":false,"hidden":false,"merged":[[0,0,0,15]]}
["Fiche explicative de l'utilisation du dossier Natation 25m coup de bras"]