{"text_format":"1","workbook":"xlsx","n_sheets":7,"sheets":["Catégories","Base","BENJAMIN FILLES","BENJAMIN GARCONS","MINIME FILLES","MINIME GARCONS","DEBUTANT"],"not_rendered":{"charts":0,"images":0,"macros":1,"external_links":0,"defined_names":18,"comments":0,"pivot_tables":0},"unopened":[],"bounds":{"document_bytes":16777216,"sheet_cells":100000,"rows_first":2000,"rows_last":500,"rows_between":2000,"halvings":0,"cell_chars":16384,"cell_head_chars":4096},"cells_cut":0,"cells_raw":0,"read":"whole","date_system":"1900"}

{"sheet":"Catégories","index":0,"n_rows":7,"n_cols":4,"rows_kept":7,"cut":false,"hidden":false,"merged":[]}
[]
[]
[null,1.1000000000000001,"BENJAMIN FILLES",8]
[null,1.2,"BENJAMIN GARCONS",8]
[null,2.1,"MINIME FILLES",10]
[null,2.2000000000000002,"MINIME GARCONS",10]
[null,3.1,"DEBUTANT",8]

{"sheet":"Base","index":1,"n_rows":231,"n_cols":21,"rows_kept":231,"cut":false,"hidden":false,"merged":[[9,12,9,14],[9,15,9,17],[9,10,9,11],[8,3,8,9],[8,10,8,13],[8,14,8,19]]}
[]
[]
[]
[]
[]
[]
[]
[]
[null,null,null,"Course d'Orientation",null,null,null,null,null,null,"CLASSEMENT :",null,null,null,"Course Open"]
[null,null,null,"N°équipe","Nom1","Prénom1","Établissement 1","Nom2","Prénom2","Établissement 2","Catégorie",null,"Tps de départ",null,null,"Tps d'arrivée",null,null,"Tps de parcours","Nb balises","Vérif balise"]
[null,null,null,null,null,null,null,null,null,null,null,{"$f":"IFERROR(VLOOKUP(K11,Catégories!$B$3:$D$7,2,FALSE),\"\")","v":""},null,null,null,null,null,null,{"$f":"transforme_seconde((P11-M11)*3600+(Q11-N11)*60+(R11-O11))","v":"0h00min00s"},null,{"$f":"IFERROR(IF(T11>VLOOKUP(K11,Catégories!$B$3:$D$7,3,FALSE),\"Attention\",\"OK\"),\"\")","v":""}]
[null,null,null,null,null,null,null,null,null,null,null,{"$f":"IFERROR(VLOOKUP(K12,Catégories!$B$3:$D$7,2,FALSE),\"\")","v":""},null,null,null,null,null,null,"0h00min00s",null,{"$f":"IFERROR(IF(T12>VLOOKUP(K12,Catégories!$B$3:$D$7,3,FALSE),\"Attention\",\"OK\"),\"\")","v":""}]
[null,null,null,null,null,null,null,null,null,null,null,{"$f":"IFERROR(VLOOKUP(K13,Catégories!$B$3:$D$7,2,FALSE),\"\")","v":""},null,null,null,null,null,null,"0h00min00s",null,{"$f":"IFERROR(IF(T13>VLOOKUP(K13,Catégories!$B$3:$D$7,3,FALSE),\"Attention\",\"OK\"),\"\")","v":""}]
[null,null,null,null,null,null,null,null,null,null,null,{"$f":"IFERROR(VLOOKUP(K14,Catégories!$B$3:$D$7,2,FALSE),\"\")","v":""},null,null,null,null,null,null,"0h00min00s",null,{"$f":"IFERROR(IF(T14>VLOOKUP(K14,Catégories!$B$3:$D$7,3,FALSE),\"Attention\",\"OK\"),\"\")","v":""}]
[null,null,null,null,null,null,null,null,null,null,null,{"$f":"IFERROR(VLOOKUP(K15,Catégories!$B$3:$D$7,2,FALSE),\"\")","v":""},null,null,null,null,null,null,"0h00min00s",null,{"$f":"IFERROR(IF(T15>VLOOKUP(K15,Catégories!$B$3:$D$7,3,FALSE),\"Attention\",\"OK\"),\"\")","v":""}]
[null,null,null,null,null,null,null,null,null,null,null,{"$f":"IFERROR(VLOOKUP(K16,Catégories!$B$3:$D$7,2,FALSE),\"\")","v":""},null,null,null,null,null,null,"0h00min00s",null,{"$f":"IFERROR(IF(T16>VLOOKUP(K16,Catégories!$B$3:$D$7,3,FALSE),\"Attention\",\"OK\"),\"\")","v":""}]
[null,null,null,null,null,null,null,null,null,null,null,{"$f":"IFERROR(VLOOKUP(K17,Catégories!$B$3:$D$7,2,FALSE),\"\")","v":""},null,null,null,null,null,null,"0h00min00s",null,{"$f":"IFERROR(IF(T17>VLOOKUP(K17,Catégories!$B$3:$D$7,3,FALSE),\"Attention\",\"OK\"),\"\")","v":""}]
[null,null,null,null,null,null,null,null,null,null,null,{"$f":"IFERROR(VLOOKUP(K18,Catégories!$B$3:$D$7,2,FALSE),\"\")","v":""},null,null,null,null,null,null,"0h00min00s",null,{"$f":"IFERROR(IF(T18>VLOOKUP(K18,Catégories!$B$3:$D$7,3,FALSE),\"Attention\",\"OK\"),\"\")","v":""}]
[null,null,null,null,null,null,null,null,null,null,null,{"$f":"IFERROR(VLOOKUP(K19,Catégories!$B$3:$D$7,2,FALSE),\"\")","v":""},null,null,null,null,null,null,"0h00min00s",null,{"$f":"IFERROR(IF(T19>VLOOKUP(K19,Catégories!$B$3:$D$7,3,FALSE),\"Attention\",\"OK\"),\"\")","v":""}]
[null,null,null,null,null,null,null,null,null,null,null,{"$f":"IFERROR(VLOOKUP(K20,Catégories!$B$3:$D$7,2,FALSE),\"\")","v":""},null,null,null,null,null,null,"0h00min00s",null,{"$f":"IFERROR(IF(T20>VLOOKUP(K20,Catégories!$B$3:$D$7,3,FALSE),\"Attention\",\"OK\"),\"\")","v":""}]
{"$rows_left_out":212}
{"sheet":"BENJAMIN FILLES","index":2,"n_rows":64,"n_cols":21,"rows_kept":64,"cut":false,"hidden":false,"merged":[[8,3,8,9],[8,10,8,13],[8,14,8,19],[9,10,9,11],[9,12,9,14],[9,15,9,17]]}
[]
[]
[]
[]
[]
[]
[]
[]
[null,null,null,"Course d'Orientation",null,null,null,null,null,null,"CLASSEMENT :",null,null,null,"BENJAMIN FILLES"]
[null,null,null,"N°équipe","Nom1","Prénom1","Établissement 1","Nom2","Prénom2","Établissement 2","Catégorie",null,"Tps de départ",null,null,"Tps d'arrivée",null,null,"Tps de parcours","Nb balises","Vérif balise"]
[null,null,null,null,null,null,null,null,null,null,null,{"$f":"IFERROR(VLOOKUP(K11,Catégories!$B$3:$D$7,2,FALSE),\"\")","v":""},4,null,null,6,null,null,{"$f":"transforme_seconde((P11-M11)*3600+(Q11-N11)*60+(R11-O11))","v":"2h00min00s"},8,{"$f":"IFERROR(IF(T11>VLOOKUP(K11,Catégories!$B$3:$D$7,3,FALSE),\"Attention\",\"OK\"),\"\")","v":""}]
[null,null,null,null,null,null,null,null,null,null,null,{"$f":"IFERROR(VLOOKUP(K12,Catégories!$B$3:$D$7,2,FALSE),\"\")","v":""},2,null,null,5,null,null,"3h00min00s",7,{"$f":"IFERROR(IF(T12>VLOOKUP(K12,Catégories!$B$3:$D$7,3,FALSE),\"Attention\",\"OK\"),\"\")","v":""}]
[null,null,null,null,null,null,null,null,null,null,null,{"$f":"IFERROR(VLOOKUP(K13,Catégories!$B$3:$D$7,2,FALSE),\"\")","v":""},null,null,null,null,null,null,"0h00min00s",null,{"$f":"IFERROR(IF(T13>VLOOKUP(K13,Catégories!$B$3:$D$7,3,FALSE),\"Attention\",\"OK\"),\"\")","v":""}]
[null,null,null,null,null,null,null,null,null,null,null,{"$f":"IFERROR(VLOOKUP(K14,Catégories!$B$3:$D$7,2,FALSE),\"\")","v":""},null,null,null,null,null,null,"0h00min00s",null,{"$f":"IFERROR(IF(T14>VLOOKUP(K14,Catégories!$B$3:$D$7,3,FALSE),\"Attention\",\"OK\"),\"\")","v":""}]
[null,null,null,null,null,null,null,null,null,null,null,{"$f":"IFERROR(VLOOKUP(K15,Catégories!$B$3:$D$7,2,FALSE),\"\")","v":""},null,null,null,null,null,null,"0h00min00s",null,{"$f":"IFERROR(IF(T15>VLOOKUP(K15,Catégories!$B$3:$D$7,3,FALSE),\"Attention\",\"OK\"),\"\")","v":""}]
[null,null,null,null,null,null,null,null,null,null,null,{"$f":"IFERROR(VLOOKUP(K16,Catégories!$B$3:$D$7,2,FALSE),\"\")","v":""},null,null,null,null,null,null,"0h00min00s",null,{"$f":"IFERROR(IF(T16>VLOOKUP(K16,Catégories!$B$3:$D$7,3,FALSE),\"Attention\",\"OK\"),\"\")","v":""}]
[null,null,null,null,null,null,null,null,null,null,null,{"$f":"IFERROR(VLOOKUP(K17,Catégories!$B$3:$D$7,2,FALSE),\"\")","v":""},null,null,null,null,null,null,"0h00min00s",null,{"$f":"IFERROR(IF(T17>VLOOKUP(K17,Catégories!$B$3:$D$7,3,FALSE),\"Attention\",\"OK\"),\"\")","v":""}]
[null,null,null,null,null,null,null,null,null,null,null,{"$f":"IFERROR(VLOOKUP(K18,Catégories!$B$3:$D$7,2,FALSE),\"\")","v":""},null,null,null,null,null,null,"0h00min00s",null,{"$f":"IFERROR(IF(T18>VLOOKUP(K18,Catégories!$B$3:$D$7,3,FALSE),\"Attention\",\"OK\"),\"\")","v":""}]
[null,null,null,null,null,null,null,null,null,null,null,{"$f":"IFERROR(VLOOKUP(K19,Catégories!$B$3:$D$7,2,FALSE),\"\")","v":""},null,null,null,null,null,null,"0h00min00s",null,{"$f":"IFERROR(IF(T19>VLOOKUP(K19,Catégories!$B$3:$D$7,3,FALSE),\"Attention\",\"OK\"),\"\")","v":""}]
[null,null,null,null,null,null,null,null,null,null,null,{"$f":"IFERROR(VLOOKUP(K20,Catégories!$B$3:$D$7,2,FALSE),\"\")","v":""},null,null,null,null,null,null,"0h00min00s",null,{"$f":"IFERROR(IF(T20>VLOOKUP(K20,Catégories!$B$3:$D$7,3,FALSE),\"Attention\",\"OK\"),\"\")","v":""}]
{"$rows_left_out":45}
{"sheet":"BENJAMIN GARCONS","index":3,"n_rows":97,"n_cols":21,"rows_kept":97,"cut":false,"hidden":false,"merged":[[8,3,8,9],[8,10,8,13],[8,14,8,19],[9,10,9,11],[9,12,9,14],[9,15,9,17]]}
[]
[]
[]
[]
[]
[]
[]
[]
[null,null,null,"Course d'Orientation",null,null,null,null,null,null,"CLASSEMENT :",null,null,null,"BENJAMIN GARCONS"]
[null,null,null,"N°équipe","Nom1","Prénom1","Établissement 1","Nom2","Prénom2","Établissement 2","Catégorie",null,"Tps de départ",null,null,"Tps d'arrivée",null,null,"Tps de parcours","Nb balises","Vérif balise"]
[null,null,null,68,"OSOUF","Gianni","BAGE LA VILLE",null,null,null,1.2,{"$f":"IFERROR(VLOOKUP(K11,Catégories!$B$3:$D$7,2,FALSE),\"\")","v":"BENJAMIN GARCONS"},5,null,null,9,null,null,{"$f":"transforme_seconde((P11-M11)*3600+(Q11-N11)*60+(R11-O11))","v":"4h00min00s"},8,{"$f":"IFERROR(IF(T11>VLOOKUP(K11,Catégories!$B$3:$D$7,3,FALSE),\"Attention\",\"OK\"),\"\")","v":"OK"}]
[null,null,null,72,"BREVET","Mathias","LEYMENT",null,null,null,1.2,{"$f":"IFERROR(VLOOKUP(K12,Catégories!$B$3:$D$7,2,FALSE),\"\")","v":"BENJAMIN GARCONS"},5,null,null,8,null,null,"3h00min00s",7,{"$f":"IFERROR(IF(T12>VLOOKUP(K12,Catégories!$B$3:$D$7,3,FALSE),\"Attention\",\"OK\"),\"\")","v":"OK"}]
[null,null,null,56,"BADET","Martin","ST-DENIS LES BOURG",null,null,null,1.2,{"$f":"IFERROR(VLOOKUP(K13,Catégories!$B$3:$D$7,2,FALSE),\"\")","v":"BENJAMIN GARCONS"},null,null,null,null,null,null,"0h00min00s",null,{"$f":"IFERROR(IF(T13>VLOOKUP(K13,Catégories!$B$3:$D$7,3,FALSE),\"Attention\",\"OK\"),\"\")","v":"OK"}]
[null,null,null,57,"BERNABEU","Lucas","ST-DENIS LES BOURG",null,null,null,1.2,{"$f":"IFERROR(VLOOKUP(K14,Catégories!$B$3:$D$7,2,FALSE),\"\")","v":"BENJAMIN GARCONS"},null,null,null,null,null,null,"0h00min00s",null,{"$f":"IFERROR(IF(T14>VLOOKUP(K14,Catégories!$B$3:$D$7,3,FALSE),\"Attention\",\"OK\"),\"\")","v":"OK"}]
[null,null,null,58,"BUCILLIAT","Kyliann","ST-DENIS LES BOURG",null,null,null,1.2,{"$f":"IFERROR(VLOOKUP(K15,Catégories!$B$3:$D$7,2,FALSE),\"\")","v":"BENJAMIN GARCONS"},null,null,null,null,null,null,"0h00min00s",null,{"$f":"IFERROR(IF(T15>VLOOKUP(K15,Catégories!$B$3:$D$7,3,FALSE),\"Attention\",\"OK\"),\"\")","v":"OK"}]
[null,null,null,59,"LUCET","Gaetan","ST-DENIS LES BOURG",null,null,null,1.2,{"$f":"IFERROR(VLOOKUP(K16,Catégories!$B$3:$D$7,2,FALSE),\"\")","v":"BENJAMIN GARCONS"},null,null,null,null,null,null,"0h00min00s",null,{"$f":"IFERROR(IF(T16>VLOOKUP(K16,Catégories!$B$3:$D$7,3,FALSE),\"Attention\",\"OK\"),\"\")","v":"OK"}]
[null,null,null,60,"VENET","Loic","ST-DENIS LES BOURG",null,null,null,1.2,{"$f":"IFERROR(VLOOKUP(K17,Catégories!$B$3:$D$7,2,FALSE),\"\")","v":"BENJAMIN GARCONS"},null,null,null,null,null,null,"0h00min00s",null,{"$f":"IFERROR(IF(T17>VLOOKUP(K17,Catégories!$B$3:$D$7,3,FALSE),\"Attention\",\"OK\"),\"\")","v":"OK"}]
[null,null,null,61,"AUGUSTIN","Clement","DIVONNE LES BAINS",null,null,null,1.2,{"$f":"IFERROR(VLOOKUP(K18,Catégories!$B$3:$D$7,2,FALSE),\"\")","v":"BENJAMIN GARCONS"},null,null,null,null,null,null,"0h00min00s",null,{"$f":"IFERROR(IF(T18>VLOOKUP(K18,Catégories!$B$3:$D$7,3,FALSE),\"Attention\",\"OK\"),\"\")","v":"OK"}]
[null,null,null,62,"BASSET","Éliot","BAGE LA VILLE",null,null,null,1.2,{"$f":"IFERROR(VLOOKUP(K19,Catégories!$B$3:$D$7,2,FALSE),\"\")","v":"BENJAMIN GARCONS"},null,null,null,null,null,null,"0h00min00s",null,{"$f":"IFERROR(IF(T19>VLOOKUP(K19,Catégories!$B$3:$D$7,3,FALSE),\"Attention\",\"OK\"),\"\")","v":"OK"}]
[null,null,null,63,"CARNEIRO","Lucien","BAGE LA VILLE",null,null,null,1.2,{"$f":"IFERROR(VLOOKUP(K20,Catégories!$B$3:$D$7,2,FALSE),\"\")","v":"BENJAMIN GARCONS"},null,null,null,null,null,null,"0h00min00s",null,{"$f":"IFERROR(IF(T20>VLOOKUP(K20,Catégories!$B$3:$D$7,3,FALSE),\"Attention\",\"OK\"),\"\")","v":"OK"}]
{"$rows_left_out":78}
{"sheet":"MINIME FILLES","index":4,"n_rows":36,"n_cols":21,"rows_kept":36,"cut":false,"hidden":false,"merged":[[8,3,8,9],[8,10,8,13],[8,14,8,19],[9,10,9,11],[9,12,9,14],[9,15,9,17]]}
[]
[]
[]
[]
[]
[]
[]
[]
[null,null,null,"Course d'Orientation",null,null,null,null,null,null,"CLASSEMENT :",null,null,null,"MINIME FILLES"]
[null,null,null,"N°équipe","Nom1","Prénom1","Établissement 1","Nom2","Prénom2","Établissement 2","Catégorie",null,"Tps de départ",null,null,"Tps d'arrivée",null,null,"Tps de parcours","Nb balises","Vérif balise"]
[null,null,null,null,null,null,null,null,null,null,null,{"$f":"IFERROR(VLOOKUP(K11,Catégories!$B$3:$D$7,2,FALSE),\"\")","v":""},null,null,null,null,null,null,{"$f":"transforme_seconde((P11-M11)*3600+(Q11-N11)*60+(R11-O11))","v":"0h00min00s"},null,{"$f":"IFERROR(IF(T11>VLOOKUP(K11,Catégories!$B$3:$D$7,3,FALSE),\"Attention\",\"OK\"),\"\")","v":""}]
[null,null,null,null,null,null,null,null,null,null,null,{"$f":"IFERROR(VLOOKUP(K12,Catégories!$B$3:$D$7,2,FALSE),\"\")","v":""},null,null,null,null,null,null,"0h00min00s",null,{"$f":"IFERROR(IF(T12>VLOOKUP(K12,Catégories!$B$3:$D$7,3,FALSE),\"Attention\",\"OK\"),\"\")","v":""}]
[null,null,null,null,null,null,null,null,null,null,null,{"$f":"IFERROR(VLOOKUP(K13,Catégories!$B$3:$D$7,2,FALSE),\"\")","v":""},null,null,null,null,null,null,"0h00min00s",null,{"$f":"IFERROR(IF(T13>VLOOKUP(K13,Catégories!$B$3:$D$7,3,FALSE),\"Attention\",\"OK\"),\"\")","v":""}]
[null,null,null,null,null,null,null,null,null,null,null,{"$f":"IFERROR(VLOOKUP(K14,Catégories!$B$3:$D$7,2,FALSE),\"\")","v":""},null,null,null,null,null,null,"0h00min00s",null,{"$f":"IFERROR(IF(T14>VLOOKUP(K14,Catégories!$B$3:$D$7,3,FALSE),\"Attention\",\"OK\"),\"\")","v":""}]
[null,null,null,null,null,null,null,null,null,null,null,{"$f":"IFERROR(VLOOKUP(K15,Catégories!$B$3:$D$7,2,FALSE),\"\")","v":""},null,null,null,null,null,null,"0h00min00s",null,{"$f":"IFERROR(IF(T15>VLOOKUP(K15,Catégories!$B$3:$D$7,3,FALSE),\"Attention\",\"OK\"),\"\")","v":""}]
[null,null,null,null,null,null,null,null,null,null,null,{"$f":"IFERROR(VLOOKUP(K16,Catégories!$B$3:$D$7,2,FALSE),\"\")","v":""},null,null,null,null,null,null,"0h00min00s",null,{"$f":"IFERROR(IF(T16>VLOOKUP(K16,Catégories!$B$3:$D$7,3,FALSE),\"Attention\",\"OK\"),\"\")","v":""}]
[null,null,null,null,null,null,null,null,null,null,null,{"$f":"IFERROR(VLOOKUP(K17,Catégories!$B$3:$D$7,2,FALSE),\"\")","v":""},null,null,null,null,null,null,"0h00min00s",null,{"$f":"IFERROR(IF(T17>VLOOKUP(K17,Catégories!$B$3:$D$7,3,FALSE),\"Attention\",\"OK\"),\"\")","v":""}]
[null,null,null,null,null,null,null,null,null,null,null,{"$f":"IFERROR(VLOOKUP(K18,Catégories!$B$3:$D$7,2,FALSE),\"\")","v":""},null,null,null,null,null,null,"0h00min00s",null,{"$f":"IFERROR(IF(T18>VLOOKUP(K18,Catégories!$B$3:$D$7,3,FALSE),\"Attention\",\"OK\"),\"\")","v":""}]
[null,null,null,null,null,null,null,null,null,null,null,{"$f":"IFERROR(VLOOKUP(K19,Catégories!$B$3:$D$7,2,FALSE),\"\")","v":""},null,null,null,null,null,null,"0h00min00s",null,{"$f":"IFERROR(IF(T19>VLOOKUP(K19,Catégories!$B$3:$D$7,3,FALSE),\"Attention\",\"OK\"),\"\")","v":""}]
[null,null,null,null,null,null,null,null,null,null,null,{"$f":"IFERROR(VLOOKUP(K20,Catégories!$B$3:$D$7,2,FALSE),\"\")","v":""},null,null,null,null,null,null,"0h00min00s",null,{"$f":"IFERROR(IF(T20>VLOOKUP(K20,Catégories!$B$3:$D$7,3,FALSE),\"Attention\",\"OK\"),\"\")","v":""}]
{"$rows_left_out":17}
{"sheet":"MINIME GARCONS","index":5,"n_rows":58,"n_cols":21,"rows_kept":58,"cut":false,"hidden":false,"merged":[[8,3,8,9],[8,10,8,13],[8,14,8,19],[9,10,9,11],[9,12,9,14],[9,15,9,17]]}
[]
[]
[]
[]
[]
[]
[]
[]
[null,null,null,"Course d'Orientation",null,null,null,null,null,null,"CLASSEMENT :",null,null,null,"MINIME GARCONS"]
[null,null,null,"N°équipe","Nom1","Prénom1","Établissement 1","Nom2","Prénom2","Établissement 2","Catégorie",null,"Tps de départ",null,null,"Tps d'arrivée",null,null,"Tps de parcours","Nb balises","Vérif balise"]
[null,null,null,null,null,null,null,null,null,null,null,{"$f":"IFERROR(VLOOKUP(K11,Catégories!$B$3:$D$7,2,FALSE),\"\")","v":""},null,null,null,null,null,null,{"$f":"transforme_seconde((P11-M11)*3600+(Q11-N11)*60+(R11-O11))","v":"0h00min00s"},null,{"$f":"IFERROR(IF(T11>VLOOKUP(K11,Catégories!$B$3:$D$7,3,FALSE),\"Attention\",\"OK\"),\"\")","v":""}]
[null,null,null,null,null,null,null,null,null,null,null,{"$f":"IFERROR(VLOOKUP(K12,Catégories!$B$3:$D$7,2,FALSE),\"\")","v":""},null,null,null,null,null,null,"0h00min00s",null,{"$f":"IFERROR(IF(T12>VLOOKUP(K12,Catégories!$B$3:$D$7,3,FALSE),\"Attention\",\"OK\"),\"\")","v":""}]
[null,null,null,null,null,null,null,null,null,null,null,{"$f":"IFERROR(VLOOKUP(K13,Catégories!$B$3:$D$7,2,FALSE),\"\")","v":""},null,null,null,null,null,null,"0h00min00s",null,{"$f":"IFERROR(IF(T13>VLOOKUP(K13,Catégories!$B$3:$D$7,3,FALSE),\"Attention\",\"OK\"),\"\")","v":""}]
[null,null,null,null,null,null,null,null,null,null,null,{"$f":"IFERROR(VLOOKUP(K14,Catégories!$B$3:$D$7,2,FALSE),\"\")","v":""},null,null,null,null,null,null,"0h00min00s",null,{"$f":"IFERROR(IF(T14>VLOOKUP(K14,Catégories!$B$3:$D$7,3,FALSE),\"Attention\",\"OK\"),\"\")","v":""}]
[null,null,null,null,null,null,null,null,null,null,null,{"$f":"IFERROR(VLOOKUP(K15,Catégories!$B$3:$D$7,2,FALSE),\"\")","v":""},null,null,null,null,null,null,"0h00min00s",null,{"$f":"IFERROR(IF(T15>VLOOKUP(K15,Catégories!$B$3:$D$7,3,FALSE),\"Attention\",\"OK\"),\"\")","v":""}]
[null,null,null,null,null,null,null,null,null,null,null,{"$f":"IFERROR(VLOOKUP(K16,Catégories!$B$3:$D$7,2,FALSE),\"\")","v":""},null,null,null,null,null,null,"0h00min00s",null,{"$f":"IFERROR(IF(T16>VLOOKUP(K16,Catégories!$B$3:$D$7,3,FALSE),\"Attention\",\"OK\"),\"\")","v":""}]
[null,null,null,null,null,null,null,null,null,null,null,{"$f":"IFERROR(VLOOKUP(K17,Catégories!$B$3:$D$7,2,FALSE),\"\")","v":""},null,null,null,null,null,null,"0h00min00s",null,{"$f":"IFERROR(IF(T17>VLOOKUP(K17,Catégories!$B$3:$D$7,3,FALSE),\"Attention\",\"OK\"),\"\")","v":""}]
[null,null,null,null,null,null,null,null,null,null,null,{"$f":"IFERROR(VLOOKUP(K18,Catégories!$B$3:$D$7,2,FALSE),\"\")","v":""},null,null,null,null,null,null,"0h00min00s",null,{"$f":"IFERROR(IF(T18>VLOOKUP(K18,Catégories!$B$3:$D$7,3,FALSE),\"Attention\",\"OK\"),\"\")","v":""}]
[null,null,null,null,null,null,null,null,null,null,null,{"$f":"IFERROR(VLOOKUP(K19,Catégories!$B$3:$D$7,2,FALSE),\"\")","v":""},null,null,null,null,null,null,"0h00min00s",null,{"$f":"IFERROR(IF(T19>VLOOKUP(K19,Catégories!$B$3:$D$7,3,FALSE),\"Attention\",\"OK\"),\"\")","v":""}]
[null,null,null,null,null,null,null,null,null,null,null,{"$f":"IFERROR(VLOOKUP(K20,Catégories!$B$3:$D$7,2,FALSE),\"\")","v":""},null,null,null,null,null,null,"0h00min00s",null,{"$f":"IFERROR(IF(T20>VLOOKUP(K20,Catégories!$B$3:$D$7,3,FALSE),\"Attention\",\"OK\"),\"\")","v":""}]
{"$rows_left_out":39}
{"sheet":"DEBUTANT","index":6,"n_rows":20,"n_cols":21,"rows_kept":20,"cut":false,"hidden":false,"merged":[[8,3,8,9],[8,10,8,13],[8,14,8,19],[9,10,9,11],[9,12,9,14],[9,15,9,17]]}
[]
[]
[]
[]
[]
[]
[]
[]
[null,null,null,"Course d'Orientation",null,null,null,null,null,null,"CLASSEMENT :",null,null,null,"DEBUTANT"]
[null,null,null,"N°équipe","Nom1","Prénom1","Établissement 1","Nom2","Prénom2","Établissement 2","Catégorie",null,"Tps de départ",null,null,"Tps d'arrivée",null,null,"Tps de parcours","Nb balises","Vérif balise"]
[null,null,null,null,null,null,null,null,null,null,null,{"$f":"IFERROR(VLOOKUP(K11,Catégories!$B$3:$D$7,2,FALSE),\"\")","v":""},null,null,null,null,null,null,{"$f":"transforme_seconde((P11-M11)*3600+(Q11-N11)*60+(R11-O11))","v":"0h00min00s"},null,{"$f":"IFERROR(IF(T11>VLOOKUP(K11,Catégories!$B$3:$D$7,3,FALSE),\"Attention\",\"OK\"),\"\")","v":""}]
[null,null,null,null,null,null,null,null,null,null,null,{"$f":"IFERROR(VLOOKUP(K12,Catégories!$B$3:$D$7,2,FALSE),\"\")","v":""},null,null,null,null,null,null,"0h00min00s",null,{"$f":"IFERROR(IF(T12>VLOOKUP(K12,Catégories!$B$3:$D$7,3,FALSE),\"Attention\",\"OK\"),\"\")","v":""}]
[null,null,null,null,null,null,null,null,null,null,null,{"$f":"IFERROR(VLOOKUP(K13,Catégories!$B$3:$D$7,2,FALSE),\"\")","v":""},null,null,null,null,null,null,"0h00min00s",null,{"$f":"IFERROR(IF(T13>VLOOKUP(K13,Catégories!$B$3:$D$7,3,FALSE),\"Attention\",\"OK\"),\"\")","v":""}]
[null,null,null,null,null,null,null,null,null,null,null,{"$f":"IFERROR(VLOOKUP(K14,Catégories!$B$3:$D$7,2,FALSE),\"\")","v":""},null,null,null,null,null,null,"0h00min00s",null,{"$f":"IFERROR(IF(T14>VLOOKUP(K14,Catégories!$B$3:$D$7,3,FALSE),\"Attention\",\"OK\"),\"\")","v":""}]
[null,null,null,null,null,null,null,null,null,null,null,{"$f":"IFERROR(VLOOKUP(K15,Catégories!$B$3:$D$7,2,FALSE),\"\")","v":""},null,null,null,null,null,null,"0h00min00s",null,{"$f":"IFERROR(IF(T15>VLOOKUP(K15,Catégories!$B$3:$D$7,3,FALSE),\"Attention\",\"OK\"),\"\")","v":""}]
[null,null,null,null,null,null,null,null,null,null,null,{"$f":"IFERROR(VLOOKUP(K16,Catégories!$B$3:$D$7,2,FALSE),\"\")","v":""},null,null,null,null,null,null,"0h00min00s",null,{"$f":"IFERROR(IF(T16>VLOOKUP(K16,Catégories!$B$3:$D$7,3,FALSE),\"Attention\",\"OK\"),\"\")","v":""}]
[null,null,null,null,null,null,null,null,null,null,null,{"$f":"IFERROR(VLOOKUP(K17,Catégories!$B$3:$D$7,2,FALSE),\"\")","v":""},null,null,null,null,null,null,"0h00min00s",null,{"$f":"IFERROR(IF(T17>VLOOKUP(K17,Catégories!$B$3:$D$7,3,FALSE),\"Attention\",\"OK\"),\"\")","v":""}]
[null,null,null,null,null,null,null,null,null,null,null,{"$f":"IFERROR(VLOOKUP(K18,Catégories!$B$3:$D$7,2,FALSE),\"\")","v":""},null,null,null,null,null,null,"0h00min00s",null,{"$f":"IFERROR(IF(T18>VLOOKUP(K18,Catégories!$B$3:$D$7,3,FALSE),\"Attention\",\"OK\"),\"\")","v":""}]
[null,null,null,null,null,null,null,null,null,null,null,{"$f":"IFERROR(VLOOKUP(K19,Catégories!$B$3:$D$7,2,FALSE),\"\")","v":""},null,null,null,null,null,null,"0h00min00s",null,{"$f":"IFERROR(IF(T19>VLOOKUP(K19,Catégories!$B$3:$D$7,3,FALSE),\"Attention\",\"OK\"),\"\")","v":""}]
[null,null,null,"Fin des données"]