{"text_format":"1","workbook":"xlsx","n_sheets":11,"sheets":["COMMENCER","DEFI (1)","DEFI (2)","DEFI (3)","DEFI (4)","DEFI (5)","BRAVO","MATCHS","APPEL","DEBUT","SAMICBIS"],"not_rendered":{"charts":0,"images":14,"macros":0,"external_links":1,"defined_names":50,"comments":5,"pivot_tables":0},"unopened":[],"bounds":{"document_bytes":16777216,"sheet_cells":100000,"rows_first":2000,"rows_last":500,"rows_between":2000,"halvings":0,"cell_chars":16384,"cell_head_chars":4096},"cells_cut":0,"cells_raw":0,"read":"whole","date_system":"1900"}

{"sheet":"COMMENCER","index":0,"n_rows":24,"n_cols":8,"rows_kept":24,"cut":false,"hidden":false,"merged":[[9,1,10,1],[0,2,2,7],[8,1,8,8],[5,2,5,7],[6,2,6,7],[7,2,7,7],[4,2,4,7]]}
[null,null,"ECHECS et BAD"]
[null,"TPROE"]
[]
[]
[null,null,"BUT DU JEU"]
[null,null,"L'ensemble du groupe doit : "]
[null,null,"1-Comprendre le déplacement des pièces"]
[null,null,"2-S'entrainer pour réussir à se déplacer comme cette pièce"]
[null,"3-Réussir ensemble à devenir cette pièce pour passer à la pièce suivante et mettre le roi en ECHEC et BAD"]
[null,"Choisis la Pièce ->"]
[]
[null,"Fares",{"$f":"'DEFI (1)'!M4","v":"Défi réussi"},{"$f":"'DEFI (2)'!M4","v":"En cours"},{"$f":"'DEFI (3)'!M4","v":0},{"$f":"'DEFI (4)'!M4","v":0},{"$f":"'DEFI (5)'!M4","v":0}," "]
[null,"Haykel Riadh",{"$f":"'DEFI (1)'!M5","v":0},{"$f":"'DEFI (2)'!M5","v":0},{"$f":"'DEFI (3)'!M5","v":0},{"$f":"'DEFI (4)'!M5","v":0},{"$f":"'DEFI (5)'!M5","v":0}]
[null,null,{"$f":"'DEFI (1)'!M6","v":0},{"$f":"'DEFI (2)'!M6","v":0},{"$f":"'DEFI (3)'!M6","v":0},{"$f":"'DEFI (4)'!M6","v":0},{"$f":"'DEFI (5)'!M6","v":0}]
[null,null,{"$f":"'DEFI (1)'!M7","v":0},{"$f":"'DEFI (2)'!M7","v":0},{"$f":"'DEFI (3)'!M7","v":0},{"$f":"'DEFI (4)'!M7","v":0},{"$f":"'DEFI (5)'!M7","v":0}]
[null,null,{"$f":"'DEFI (1)'!M8","v":0},{"$f":"'DEFI (2)'!M8","v":0},{"$f":"'DEFI (3)'!M8","v":0},{"$f":"'DEFI (4)'!M8","v":0},{"$f":"'DEFI (5)'!M8","v":0}]
[null,null,{"$f":"'DEFI (1)'!M9","v":0},{"$f":"'DEFI (2)'!M9","v":0},{"$f":"'DEFI (3)'!M9","v":0},{"$f":"'DEFI (4)'!M9","v":0},{"$f":"'DEFI (5)'!M9","v":0}]
[null,null,null,null,null,null,null," "]
[]
[]
[]
[]
[]
[null,null,null,null,null,null,null," "]

{"sheet":"DEFI (1)","index":1,"n_rows":23,"n_cols":13,"rows_kept":23,"cut":false,"hidden":false,"merged":[[1,2,1,10],[11,19,11,20],[13,2,13,6],[13,7,13,10],[3,2,4,2],[3,3,4,4],[3,6,3,9],[3,10,4,10],[4,6,4,9],[5,2,5,6],[5,7,5,10],[16,2,16,10],[6,7,9,10],[6,2,11,6],[12,2,12,6],[12,7,12,10],[11,7,11,10],[10,7,10,10],[17,2,17,4],[17,5,17,7],[17,8,17,10],[22,2,22,10],[18,2,18,4],[18,5,18,7],[18,8,18,10],[19,2,19,10],[20,2,20,10],[21,2,21,10]]}
[]
[null,null,"LE GROUPE DOIT ESSAYER DE COMPRENDRE LA MISE EN PLACE DE LA SITUATION D'APPRENTISSAGE ENSEMBLE"]
[]
[null,null,"BAD","LE PION",null,"Obj",{"$f":"VLOOKUP($D$4,SAMICBIS!$A$4:$T$136,5,FALSE)","v":"Améliorer le déplacement"},null,null,null,{"$f":"VLOOKUP($D$4,SAMICBIS!$A$4:$T$136,2,FALSE)","v":0},{"$f":"COMMENCER!B12","v":"Fares"},"Défi réussi"]
[null,null,null,null,null,"But",{"$f":"VLOOKUP($D$4,SAMICBIS!$A$4:$T$136,6,FALSE)","v":"Renvoyer le volant après avoir réaliser un léger déplacement en ligne droite ou en diagonale"},null,null,null,null,{"$f":"COMMENCER!B13","v":"Haykel Riadh"}]
[null,null,"Schéma",null,null,null,null,"Matériel nécessaire",null,null,null,{"$f":"COMMENCER!B14","v":0}]
[null,null,null,null,null,null,null,{"$f":"VLOOKUP($D$4,SAMICBIS!$A$4:$T$136,13,FALSE)","v":"2 raquettes. 1 volant. Des cones, lattes ou tapis pour matérialiser les zones."},null,null,null,{"$f":"COMMENCER!B15","v":0}]
[null,null,null,null,null,null,null,null,null,null,null,{"$f":"COMMENCER!B16","v":0}]
[null,null,null,null,null,null,null,null,null,null,null,{"$f":"COMMENCER!B17","v":0}]
[]
[null,null,null,null,null,null,null,"Consignes"]
[null,null,null,null,null,null,null,{"$f":"CONCATENATE(VLOOKUP($D$4,SAMICBIS!$A$4:$T$136,8,FALSE),\"  -  \",VLOOKUP($D$4,SAMICBIS!$A$4:$T$136,10,FALSE))","v":"Le joueur blanc envoie en continu le volant une fois au centre une fois devant lui. Le joueur rouge  renvoie toujours au centre.  -  "}]
[null,null,"Critères de réussite",null,null,null,null,"Conseils pour réussir"]
[null,null,{"$f":"VLOOKUP($D$4,SAMICBIS!$A$4:$T$136,14,FALSE)","v":"Je suis capable de me déplacer rapidement pour me stabiliser lors de ma frappe"},null,null,null,null,{"$f":"VLOOKUP($D$4,SAMICBIS!$A$4:$T$136,12,FALSE)","v":"Reculer en gardant la tête orientée vers l'avant."}]
[]
[]
[null,null,"ACQUISITIONS PRIORITAIRES"]
[null,null,"Connaissances",null,null,"Capacités",null,null,"Attitudes"]
[null,null,{"$f":"VLOOKUP($D$4,SAMICBIS!$A$4:$T$136,16,FALSE)","v":0},null,null,{"$f":"VLOOKUP($D$4,SAMICBIS!$A$4:$T$136,17,FALSE)","v":0},null,null,{"$f":"VLOOKUP($D$4,SAMICBIS!$A$4:$T$136,18,FALSE)","v":0}]
[null,null,"COMPLEXIFICATION "]
[null,null,{"$f":"VLOOKUP($D$4,SAMICBIS!$A$4:$T$136,19,FALSE)","v":0}]
[null,null,"Simplification"]
[null,null,{"$f":"VLOOKUP($D$4,SAMICBIS!$A$4:$T$136,20,FALSE)","v":0}]

{"sheet":"DEFI (2)","index":2,"n_rows":23,"n_cols":13,"rows_kept":23,"cut":false,"hidden":false,"merged":[[1,2,1,10],[3,2,4,2],[3,3,4,4],[3,6,3,9],[3,10,4,10],[4,6,4,9],[16,2,16,10],[5,2,5,6],[5,7,5,10],[6,2,11,6],[6,7,9,10],[10,7,10,10],[11,7,11,10],[11,19,11,20],[12,2,12,6],[12,7,12,10],[13,2,13,6],[13,7,13,10],[19,2,19,10],[20,2,20,10],[21,2,21,10],[22,2,22,10],[17,2,17,4],[17,5,17,7],[17,8,17,10],[18,2,18,4],[18,5,18,7],[18,8,18,10]]}
[]
[null,null,"LE GROUPE DOIT ESSAYER DE COMPRENDRE LA MISE EN PLACE DE LA SITUATION D'APPRENTISSAGE ENSEMBLE"]
[]
[null,null,"BAD","LE CAVALIER",null,"Obj",{"$f":"VLOOKUP($D$4,SAMICBIS!$A$4:$T$136,5,FALSE)","v":"Améliorer le déplacement"},null,null,null,{"$f":"VLOOKUP($D$4,SAMICBIS!$A$4:$T$136,2,FALSE)","v":0},{"$f":"COMMENCER!B12","v":"Fares"},"En cours"]
[null,null,null,null,null,"But",{"$f":"VLOOKUP($D$4,SAMICBIS!$A$4:$T$136,6,FALSE)","v":"Renvoyer le volant après avoir réaliser un déplacement vers l'avant et le côté (ou l'arrière et le côté)"},null,null,null,null,{"$f":"COMMENCER!B13","v":"Haykel Riadh"}]
[null,null,"Schéma",null,null,null,null,"Matériel nécessaire",null,null,null,{"$f":"COMMENCER!B14","v":0}]
[null,null,null,null,null,null,null,{"$f":"VLOOKUP($D$4,SAMICBIS!$A$4:$T$136,13,FALSE)","v":"3 raquettes. 1 volant. Des cones, lattes ou tapis pour matérialiser les zones."},null,null,null,{"$f":"COMMENCER!B15","v":0}]
[null,null,null,null,null,null,null,null,null,null,null,{"$f":"COMMENCER!B16","v":0}]
[null,null,null,null,null,null,null,null,null,null,null,{"$f":"COMMENCER!B17","v":0}]
[]
[null,null,null,null,null,null,null,"Consignes"]
[null,null,null,null,null,null,null,{"$f":"CONCATENATE(VLOOKUP($D$4,SAMICBIS!$A$4:$T$136,8,FALSE),\"  -  \",VLOOKUP($D$4,SAMICBIS!$A$4:$T$136,10,FALSE))","v":"Le joueur blanc envoie en continu le volant une fois au centre une fois devant à droite (ou devant à gauche ou au fond à droite ou au fond à gauche). Le joueur rouge  renvoie toujours au centre.  -  "}]
[null,null,"Critères de réussite",null,null,null,null,"Conseils pour réussir"]
[null,null,{"$f":"VLOOKUP($D$4,SAMICBIS!$A$4:$T$136,14,FALSE)","v":"Je suis capable de me déplacer rapidement pour me stabiliser lors de ma frappe"},null,null,null,null,{"$f":"VLOOKUP($D$4,SAMICBIS!$A$4:$T$136,12,FALSE)","v":"Se déplacer en pas chassés rapides."}]
[]
[]
[null,null,"ACQUISITIONS PRIORITAIRES"]
[null,null,"Connaissances",null,null,"Capacités",null,null,"Attitudes"]
[null,null,{"$f":"VLOOKUP($D$4,SAMICBIS!$A$4:$T$136,16,FALSE)","v":0},null,null,{"$f":"VLOOKUP($D$4,SAMICBIS!$A$4:$T$136,17,FALSE)","v":0},null,null,{"$f":"VLOOKUP($D$4,SAMICBIS!$A$4:$T$136,18,FALSE)","v":0}]
[null,null,"COMPLEXIFICATION "]
[null,null,{"$f":"VLOOKUP($D$4,SAMICBIS!$A$4:$T$136,19,FALSE)","v":0}]
[null,null,"Simplification"]
[null,null,{"$f":"VLOOKUP($D$4,SAMICBIS!$A$4:$T$136,20,FALSE)","v":0}]

{"sheet":"DEFI (3)","index":3,"n_rows":23,"n_cols":12,"rows_kept":23,"cut":false,"hidden":false,"merged":[[1,2,1,10],[3,2,4,2],[3,3,4,4],[3,6,3,9],[3,10,4,10],[4,6,4,9],[16,2,16,10],[5,2,5,6],[5,7,5,10],[6,2,11,6],[6,7,9,10],[10,7,10,10],[11,7,11,10],[11,19,11,20],[12,2,12,6],[12,7,12,10],[13,2,13,6],[13,7,13,10],[19,2,19,10],[20,2,20,10],[21,2,21,10],[22,2,22,10],[17,2,17,4],[17,5,17,7],[17,8,17,10],[18,2,18,4],[18,5,18,7],[18,8,18,10]]}
[]
[null,null,"LE GROUPE DOIT ESSAYER DE COMPRENDRE LA MISE EN PLACE DE LA SITUATION D'APPRENTISSAGE ENSEMBLE"]
[]
[null,null,"BAD","LE FOU ",null,"Obj",{"$f":"VLOOKUP($D$4,SAMICBIS!$A$4:$T$136,5,FALSE)","v":"Améliorer le déplacement"},null,null,null,{"$f":"VLOOKUP($D$4,SAMICBIS!$A$4:$T$136,2,FALSE)","v":0},{"$f":"COMMENCER!B12","v":"Fares"}]
[null,null,null,null,null,"But",{"$f":"VLOOKUP($D$4,SAMICBIS!$A$4:$T$136,6,FALSE)","v":"Renvoyer le volant après avoir réaliser un déplacement en diagonale"},null,null,null,null,{"$f":"COMMENCER!B13","v":"Haykel Riadh"}]
[null,null,"Schéma",null,null,null,null,"Matériel nécessaire",null,null,null,{"$f":"COMMENCER!B14","v":0}]
[null,null,null,null,null,null,null,{"$f":"VLOOKUP($D$4,SAMICBIS!$A$4:$T$136,13,FALSE)","v":"4 raquettes. 1 volant. Des cones, lattes ou tapis pour matérialiser les zones."},null,null,null,{"$f":"COMMENCER!B15","v":0}]
[null,null,null,null,null,null,null,null,null,null,null,{"$f":"COMMENCER!B16","v":0}]
[null,null,null,null,null,null,null,null,null,null,null,{"$f":"COMMENCER!B17","v":0}]
[]
[null,null,null,null,null,null,null,"Consignes"]
[null,null,null,null,null,null,null,{"$f":"CONCATENATE(VLOOKUP($D$4,SAMICBIS!$A$4:$T$136,8,FALSE),\"  -  \",VLOOKUP($D$4,SAMICBIS!$A$4:$T$136,10,FALSE))","v":"Le joueur blanc envoie en continu le volant une fois devant à gauche une fois au fond à droite (et inversement). Le joueur rouge  renvoie toujours au centre.  -  "}]
[null,null,"Critères de réussite",null,null,null,null,"Conseils pour réussir"]
[null,null,{"$f":"VLOOKUP($D$4,SAMICBIS!$A$4:$T$136,14,FALSE)","v":"Je suis capable de me déplacer rapidement pour me stabiliser lors de ma frappe"},null,null,null,null,{"$f":"VLOOKUP($D$4,SAMICBIS!$A$4:$T$136,12,FALSE)","v":"Se déplacer en pas chassés rapides vers l'avant et l'arrière."}]
[]
[]
[null,null,"ACQUISITIONS PRIORITAIRES"]
[null,null,"Connaissances",null,null,"Capacités",null,null,"Attitudes"]
[null,null,{"$f":"VLOOKUP($D$4,SAMICBIS!$A$4:$T$136,16,FALSE)","v":0},null,null,{"$f":"VLOOKUP($D$4,SAMICBIS!$A$4:$T$136,17,FALSE)","v":0},null,null,{"$f":"VLOOKUP($D$4,SAMICBIS!$A$4:$T$136,18,FALSE)","v":0}]
[null,null,"COMPLEXIFICATION "]
[null,null,{"$f":"VLOOKUP($D$4,SAMICBIS!$A$4:$T$136,19,FALSE)","v":0}]
[null,null,"Simplification"]
[null,null,{"$f":"VLOOKUP($D$4,SAMICBIS!$A$4:$T$136,20,FALSE)","v":0}]

{"sheet":"DEFI (4)","index":4,"n_rows":23,"n_cols":12,"rows_kept":23,"cut":false,"hidden":false,"merged":[[1,2,1,10],[3,2,4,2],[3,3,4,4],[3,6,3,9],[3,10,4,10],[4,6,4,9],[16,2,16,10],[5,2,5,6],[5,7,5,10],[6,2,11,6],[6,7,9,10],[10,7,10,10],[11,7,11,10],[11,19,11,20],[12,2,12,6],[12,7,12,10],[13,2,13,6],[13,7,13,10],[19,2,19,10],[20,2,20,10],[21,2,21,10],[22,2,22,10],[17,2,17,4],[17,5,17,7],[17,8,17,10],[18,2,18,4],[18,5,18,7],[18,8,18,10]]}
[]
[null,null,"LE GROUPE DOIT ESSAYER DE COMPRENDRE LA MISE EN PLACE DE LA SITUATION D'APPRENTISSAGE ENSEMBLE"]
[]
[null,null,"BAD","LA TOUR",null,"Obj",{"$f":"VLOOKUP($D$4,SAMICBIS!$A$4:$T$136,5,FALSE)","v":"Améliorer le déplacement"},null,null,null,{"$f":"VLOOKUP($D$4,SAMICBIS!$A$4:$T$136,2,FALSE)","v":0},{"$f":"COMMENCER!B12","v":"Fares"}]
[null,null,null,null,null,"But",{"$f":"VLOOKUP($D$4,SAMICBIS!$A$4:$T$136,6,FALSE)","v":"Renvoyer le volant après avoir réaliser un déplacement en ligne droite."},null,null,null,null,{"$f":"COMMENCER!B13","v":"Haykel Riadh"}]
[null,null,"Schéma",null,null,null,null,"Matériel nécessaire",null,null,null,{"$f":"COMMENCER!B14","v":0}]
[null,null,null,null,null,null,null,{"$f":"VLOOKUP($D$4,SAMICBIS!$A$4:$T$136,13,FALSE)","v":"5 raquettes. 1 volant. Des cones, lattes ou tapis pour matérialiser les zones."},null,null,null,{"$f":"COMMENCER!B15","v":0}]
[null,null,null,null,null,null,null,null,null,null,null,{"$f":"COMMENCER!B16","v":0}]
[null,null,null,null,null,null,null,null,null,null,null,{"$f":"COMMENCER!B17","v":0}]
[]
[null,null,null,null,null,null,null,"Consignes"]
[null,null,null,null,null,null,null,{"$f":"CONCATENATE(VLOOKUP($D$4,SAMICBIS!$A$4:$T$136,8,FALSE),\"  -  \",VLOOKUP($D$4,SAMICBIS!$A$4:$T$136,10,FALSE))","v":"Le joueur blanc envoie en continu le volant une fois au fond une fois devant. Le joueur rouge  renvoie toujours au centre.  -  "}]
[null,null,"Critères de réussite",null,null,null,null,"Conseils pour réussir"]
[null,null,{"$f":"VLOOKUP($D$4,SAMICBIS!$A$4:$T$136,14,FALSE)","v":"Je suis capable de me déplacer rapidement pour me stabiliser lors de ma frappe"},null,null,null,null,{"$f":"VLOOKUP($D$4,SAMICBIS!$A$4:$T$136,12,FALSE)","v":"Se déplacer en course avant et arrière."}]
[]
[]
[null,null,"ACQUISITIONS PRIORITAIRES"]
[null,null,"Connaissances",null,null,"Capacités",null,null,"Attitudes"]
[null,null,{"$f":"VLOOKUP($D$4,SAMICBIS!$A$4:$T$136,16,FALSE)","v":0},null,null,{"$f":"VLOOKUP($D$4,SAMICBIS!$A$4:$T$136,17,FALSE)","v":0},null,null,{"$f":"VLOOKUP($D$4,SAMICBIS!$A$4:$T$136,18,FALSE)","v":0}]
[null,null,"COMPLEXIFICATION "]
[null,null,{"$f":"VLOOKUP($D$4,SAMICBIS!$A$4:$T$136,19,FALSE)","v":0}]
[null,null,"Simplification"]
[null,null,{"$f":"VLOOKUP($D$4,SAMICBIS!$A$4:$T$136,20,FALSE)","v":0}]

{"sheet":"DEFI (5)","index":5,"n_rows":23,"n_cols":12,"rows_kept":23,"cut":false,"hidden":false,"merged":[[1,2,1,10],[3,2,4,2],[3,3,4,4],[3,6,3,9],[3,10,4,10],[4,6,4,9],[16,2,16,10],[5,2,5,6],[5,7,5,10],[6,2,11,6],[6,7,9,10],[10,7,10,10],[11,7,11,10],[11,19,11,20],[12,2,12,6],[12,7,12,10],[13,2,13,6],[13,7,13,10],[19,2,19,10],[20,2,20,10],[21,2,21,10],[22,2,22,10],[17,2,17,4],[17,5,17,7],[17,8,17,10],[18,2,18,4],[18,5,18,7],[18,8,18,10]]}
[]
[null,null,"LE GROUPE DOIT ESSAYER DE COMPRENDRE LA MISE EN PLACE DE LA SITUATION D'APPRENTISSAGE ENSEMBLE"]
[]
[null,null,"BAD","LA DAME",null,"Obj",{"$f":"VLOOKUP($D$4,SAMICBIS!$A$4:$T$136,5,FALSE)","v":"Améliorer le déplacement"},null,null,null,{"$f":"VLOOKUP($D$4,SAMICBIS!$A$4:$T$136,2,FALSE)","v":0},{"$f":"COMMENCER!B12","v":"Fares"}]
[null,null,null,null,null,"But",{"$f":"VLOOKUP($D$4,SAMICBIS!$A$4:$T$136,6,FALSE)","v":"Renvoyer le volant après avoir réaliser un déplacement en ligne droite puis en diagonale (le 8)"},null,null,null,null,{"$f":"COMMENCER!B13","v":"Haykel Riadh"}]
[null,null,"Schéma",null,null,null,null,"Matériel nécessaire",null,null,null,{"$f":"COMMENCER!B14","v":0}]
[null,null,null,null,null,null,null,{"$f":"VLOOKUP($D$4,SAMICBIS!$A$4:$T$136,13,FALSE)","v":"6 raquettes. 1 volant. Des cones, lattes ou tapis pour matérialiser les zones."},null,null,null,{"$f":"COMMENCER!B15","v":0}]
[null,null,null,null,null,null,null,null,null,null,null,{"$f":"COMMENCER!B16","v":0}]
[null,null,null,null,null,null,null,null,null,null,null,{"$f":"COMMENCER!B17","v":0}]
[]
[null,null,null,null,null,null,null,"Consignes"]
[null,null,null,null,null,null,null,{"$f":"CONCATENATE(VLOOKUP($D$4,SAMICBIS!$A$4:$T$136,8,FALSE),\"  -  \",VLOOKUP($D$4,SAMICBIS!$A$4:$T$136,10,FALSE))","v":"Le joueur blanc envoie en continu le volant en suivant l'ordre des chiffre (1-devant à gauche. 2- Au fond à droite. 3- Devant à droite. 4- Au fond à gauche). Le joueur rouge  renvoie toujours au centre.  -  "}]
[null,null,"Critères de réussite",null,null,null,null,"Conseils pour réussir"]
[null,null,{"$f":"VLOOKUP($D$4,SAMICBIS!$A$4:$T$136,14,FALSE)","v":"Je suis capable de me déplacer rapidement pour me stabiliser lors de ma frappe"},null,null,null,null,{"$f":"VLOOKUP($D$4,SAMICBIS!$A$4:$T$136,12,FALSE)","v":"Adapter le bon type de déplacement selon la distance à parcourir."}]
[]
[]
[null,null,"ACQUISITIONS PRIORITAIRES"]
[null,null,"Connaissances",null,null,"Capacités",null,null,"Attitudes"]
[null,null,{"$f":"VLOOKUP($D$4,SAMICBIS!$A$4:$T$136,16,FALSE)","v":0},null,null,{"$f":"VLOOKUP($D$4,SAMICBIS!$A$4:$T$136,17,FALSE)","v":0},null,null,{"$f":"VLOOKUP($D$4,SAMICBIS!$A$4:$T$136,18,FALSE)","v":0}]
[null,null,"COMPLEXIFICATION "]
[null,null,{"$f":"VLOOKUP($D$4,SAMICBIS!$A$4:$T$136,19,FALSE)","v":0}]
[null,null,"Simplification"]
[null,null,{"$f":"VLOOKUP($D$4,SAMICBIS!$A$4:$T$136,20,FALSE)","v":0}]

{"sheet":"BRAVO","index":6,"n_rows":21,"n_cols":4,"rows_kept":21,"cut":false,"hidden":false,"merged":[[8,2,18,8],[20,3,20,8]]}
[]
[]
[]
[]
[]
[]
[]
[]
[null,null,"ECHEC \nET BAD"]
[]
[]
[]
[]
[]
[]
[]
[]
[]
[]
[]
[null,null,null,"….enfin…. Que si tu arrives à battre le PROF!"]

{"sheet":"MATCHS","index":7,"n_rows":38,"n_cols":8,"rows_kept":38,"cut":false,"hidden":false,"merged":[[1,1,1,7]]}
[]
[null,"Pour chaque match, chaque joueur évolue dans un terrain qui correspond au niveau atteint : une zone centrale pour le pion, une zone centrale élargie pour le cavalier, une zone en diagonale pour le fou, un demi-terrain pour la tour et tout le terrain pour la dame"]
[null,"Elèves","Pièces ","Points ",null,"Elèves","Pièces ","Points "]
[null,"Anouar","Cavalier",1,null,"Anouar","Cavalier",1]
[null,"Jason ","Fou",7,null,"Jason ","Fou",7]
[]
[null,"Anouar","Cavalier",1,null,"Anouar","Cavalier",1]
[null,"Jason ","Fou",7,null,"Jason ","Fou",7]
[]
[null,"Anouar","Cavalier",1,null,"Anouar","Cavalier",1]
[null,"Jason ","Fou",7,null,"Jason ","Fou",7]
[]
[null,"Anouar","Cavalier",1,null,"Anouar","Cavalier",1]
[null,"Jason ","Fou",7,null,"Jason ","Fou",7]
[]
[null,"Anouar","Cavalier",1,null,"Anouar","Cavalier",1]
[null,"Jason ","Fou",7,null,"Jason ","Fou",7]
[]
[null,"Anouar","Cavalier",1,null,"Anouar","Cavalier",1]
[null,"Jason ","Fou",7,null,"Jason ","Fou",7]
[]
[null,"Anouar","Cavalier",1,null,"Anouar","Cavalier",1]
[null,"Jason ","Fou",7,null,"Jason ","Fou",7]
[]
[null,"Anouar","Cavalier",1,null,"Anouar","Cavalier",1]
[null,"Jason ","Fou",7,null,"Jason ","Fou",7]
[]
[null,"Anouar","Cavalier",1,null,"Anouar","Cavalier",1]
[null,"Jason ","Fou",7,null,"Jason ","Fou",7]
[]
{"$rows_left_out":9}
{"sheet":"APPEL","index":8,"n_rows":38,"n_cols":28,"rows_kept":38,"cut":false,"hidden":false,"merged":[[0,19,0,20],[0,22,0,23],[0,25,0,26],[0,1,0,2],[0,4,0,5],[0,7,0,8],[0,10,0,11],[0,13,0,14],[0,16,0,17]]}
[null,"TPROE",null,null,"TAPR",null,null,"1COM-1ELEC",null,null,"2COM-2GA",null,null,"2ELEC-2TU",null,null,"TTU-TELEC",null,null,"1CIP-1META-1PROE",null,null,"1TU-1GA"]
[null,"PRENOMS","NOMS","sexe","PRENOMS","NOMS","sexe","PRENOMS","NOMS","sexe","PRENOMS","NOMS","sexe","PRENOMS","NOMS","sexe","PRENOMS","NOMS","sexe","PRENOMS","NOMS","sexe","PRENOMS","NOMS","sexe","PRENOMS","NOMS","sexe"]
[1,null,"Abdelwahid","g",null,"Alexandrine","f",null,"Abdelmalik","g",null,"Amira","f",null,"Achraf","g",null,"Abdelbasset","g"]
[2,null,"Ali","g",null,"Asiya","f",null,"Aslem","g",null,"Anissa","f",null,"Adel","g",null,"Amir","g"]
[3,null,"Fares","g",null,"Bacary","g",null,"Dhayaeddine","g",null,"Brinna","f",null,"Adem","g",null,"Aoukar","g"]
[4,null,"Haykel Riadh","g",null,"Behija","f",null,"Dounia","f",null,"Chahla","f",null,"Amar","g",null,"Badis","g"]
[5,null,"Jeff","g",null,"Chadia","f",null,"Erol","g",null,"Chamina","f",null,"Ayoub","g",null,"Badrane","g"]
[6,null,"Maxence","g",null,"Chafion","g",null,"Erwan","g",null,"Gentjana","f",null,"Azedine","g",null,"Bamadi","g"]
[7,null,"Mohamed","g",null,"Christopher","g",null,"Hamza","g",null,"Nefisse","f",null,"Bilal","g",null,"Benamar","g"]
[8,null,"Mohamed","g",null,"Dorin","g",null,"Ismaïl","g",null,"Nissrine","f",null,"Bilal","g",null,"Bilale","g"]
[9,null,"Mohamed","g",null,"Ines","f",null,"Lucas","g",null,"Sueda","f",null,"Djaoidou","g",null,"Brahyan","g"]
[10,null,"Phi Tram","g",null,"Inès","f",null,"Marouane","g",null,"William","g",null,"Fahade","g",null,"Diva","g"]
[11,null,"Ryad","g",null,"Jeremy ","g",null,"Mohammed-Aimad","g",null,"Zamira","f",null,"Farhane","g",null,"Edhem","g"]
[12,null,"Samy","g",null,"Jessie","f",null,"Rayan","g",null,"Zumra","f",null,"Faudel","g",null,"Emin","g"]
[13,null,null,null,null,"KHAN Nahidul","g",null,"Wassim","g",null,null,null,null,"Fazil","g",null,"Emre","g"]
[14,null,null,null,null,"Narjisse","f",null,"Yaya","g",null,null,null,null,"Hicham","g",null,"Faouzi","g"]
[15,null,null,null,null,"Petronela","f",null,null,null,null,null,null,null,"Jassim","g",null,"Hedi","g"]
[16,null,null,null,null,"Queenster","f",null,null,null,null,null,null,null,"Jean Alexandre","g",null,"Khalil","g"]
[17,null,null,null,null,"Syntiche","f",null,null,null,null,null,null,null,"John","g",null,"Kheireddine","g"]
[18,null,null,null,null,"Victor","g",null,null,null,null,null,null,null,"Kail-Mourad","g",null,"Knias","g"]
[19,null,null,null,null,"Yanis","g",null,null,null,null,null,null,null,"Malcom","g",null,"Maxime","g"]
[20,null,null,null,null,null,null,null,null,null,null,null,null,null,"Nicolas","g",null,"Mouhammadou","g"]
[21,null,null,null,null,null,null,null,null,null,null,null,null,null,"Oumar","g",null,"Mustafa","g"]
[22,null,null,null,null,null,null,null,null,null,null,null,null,null,"Quintimo","g",null,"Nassim","g"]
[23,null,null,null,null,null,null,null,null,null,null,null,null,null,"Raphaël","g",null,"Rustan","g"]
[24,null,null,null,null,null,null,null,null,null,null,null,null,null,"Richmond","g",null,"Samuel","g"]
[25,null,null,null,null,null,null,null,null,null,null,null,null,null,"Valentin","g",null,"Sheyms-Edyn","g"]
[26,null,null,null,null,null,null,null,null,null,null,null,null,null,"Willy","g",null,"Sombate","g"]
[27,null,null,null,null,null,null,null,null,null,null,null,null,null,"Yahia","g",null,"Tareq","g"]
[28,null,null,null,null,null,null,null,null,null,null,null,null,null,"Yamine","g",null,"Willy","g"]
{"$rows_left_out":9}
{"sheet":"DEBUT","index":9,"n_rows":24,"n_cols":5,"rows_kept":24,"cut":false,"hidden":false,"merged":[[81,2,86,2],[87,2,91,2],[30,1,36,1],[37,1,42,1],[43,1,49,1],[50,1,57,1],[50,2,51,2],[52,2,53,2],[43,2,44,2],[37,2,39,2],[68,2,71,2],[72,2,75,2],[76,2,78,2],[62,4,62,6],[62,7,62,9],[62,10,62,12],[2,0,2,1],[28,10,28,12],[28,7,28,9],[28,4,28,6],[28,1,29,1],[28,2,29,2],[28,3,29,3]]}
[null,null,"Pièces","Points","Défi"]
[]
[null,null,"Pion",0,"Défi réussi"]
[null,null,"Cavalier",1,"En cours"]
[null,null,"Fou",2]
[null,null,"Tour",3]
[null,null,"Dame",4]
[null,null,"Roi",5]
[null,null,null,6]
[null,null,null,7]
[null,null,null,8]
[null,null,null,9]
[null,null,null,10]
[null,null,null,11]
[null,null,null,12]
[null,null,null,13]
[null,null,null,14]
[null,null,null,15]
[null,null,null,16]
[null,null,null,17]
[null,null,null,18]
[null,null,null,19]
[null,null,null,20]
[null,null,null,21]

{"sheet":"SAMICBIS","index":10,"n_rows":9,"n_cols":22,"rows_kept":9,"cut":false,"hidden":false,"merged":[]}
[]
["nom SA","n° SA","OBJ GENERAL","NIVEAU","Obj SA","But","Type SA","Consignes","Schéma","Consignes 2","Schéma 2","Réussir","Matériel ","CR","Intérêt SA","Connaissances","Capacités","Attitudes","Complexification","Simplification","Colonne1","type SA2"]
[]
["LE PION",null,null,null,"Améliorer le déplacement","Renvoyer le volant après avoir réaliser un léger déplacement en ligne droite ou en diagonale",null,"Le joueur blanc envoie en continu le volant une fois au centre une fois devant lui. Le joueur rouge  renvoie toujours au centre.",null,null,null,"Reculer en gardant la tête orientée vers l'avant.","2 raquettes. 1 volant. Des cones, lattes ou tapis pour matérialiser les zones.","Je suis capable de me déplacer rapidement pour me stabiliser lors de ma frappe",null,null,null,null,null,null,null,"Routine"]
["LE CAVALIER",null,null,null,"Améliorer le déplacement","Renvoyer le volant après avoir réaliser un déplacement vers l'avant et le côté (ou l'arrière et le côté)",null,"Le joueur blanc envoie en continu le volant une fois au centre une fois devant à droite (ou devant à gauche ou au fond à droite ou au fond à gauche). Le joueur rouge  renvoie toujours au centre.",null,null,null,"Se déplacer en pas chassés rapides.","3 raquettes. 1 volant. Des cones, lattes ou tapis pour matérialiser les zones.","Je suis capable de me déplacer rapidement pour me stabiliser lors de ma frappe",null,null,null,null,null,null,null,"Multi-volants"]
["LE FOU ",null,null,null,"Améliorer le déplacement","Renvoyer le volant après avoir réaliser un déplacement en diagonale",null,"Le joueur blanc envoie en continu le volant une fois devant à gauche une fois au fond à droite (et inversement). Le joueur rouge  renvoie toujours au centre.",null,null,null,"Se déplacer en pas chassés rapides vers l'avant et l'arrière.","4 raquettes. 1 volant. Des cones, lattes ou tapis pour matérialiser les zones.","Je suis capable de me déplacer rapidement pour me stabiliser lors de ma frappe",null,null,null,null,null,null,null,"Volant continu"]
["LA TOUR",null,null,null,"Améliorer le déplacement","Renvoyer le volant après avoir réaliser un déplacement en ligne droite.",null,"Le joueur blanc envoie en continu le volant une fois au fond une fois devant. Le joueur rouge  renvoie toujours au centre.",null,null,null,"Se déplacer en course avant et arrière.","5 raquettes. 1 volant. Des cones, lattes ou tapis pour matérialiser les zones.","Je suis capable de me déplacer rapidement pour me stabiliser lors de ma frappe"]
["LA DAME",null,null,null,"Améliorer le déplacement","Renvoyer le volant après avoir réaliser un déplacement en ligne droite puis en diagonale (le 8)",null,"Le joueur blanc envoie en continu le volant en suivant l'ordre des chiffre (1-devant à gauche. 2- Au fond à droite. 3- Devant à droite. 4- Au fond à gauche). Le joueur rouge  renvoie toujours au centre.",null,null,null,"Adapter le bon type de déplacement selon la distance à parcourir.","6 raquettes. 1 volant. Des cones, lattes ou tapis pour matérialiser les zones.","Je suis capable de me déplacer rapidement pour me stabiliser lors de ma frappe",null,null,null,null,null,null,null,"Jeu"]
["LE ROI",null,null,null,null,null,null,null,null,null,null,null,null,null,null,null,null,null,null,null,null,"Match à thème"]