{"text_format":"1","workbook":"xlsx","n_sheets":17,"sheets":["ACCUEIL","EQUIPES","BASKET","GRAPHIQUE","STAT","CLASSEMENT","RESULTeqA","RESULTeqB","RESULTeqC","RESULTeqD","RESULTeqE","GRAPHeqA","GRAPHeqB","GRAPHeqC","GRAPHeqD","GRAPHeqE","FICHE"],"not_rendered":{"charts":22,"images":12,"macros":1,"external_links":0,"defined_names":6,"comments":0,"pivot_tables":0},"unopened":[{"sheet":"GRAPHIQUE","index":3,"reason":"not_a_worksheet"}],"bounds":{"document_bytes":16777216,"sheet_cells":100000,"rows_first":2000,"rows_last":500,"rows_between":2000,"halvings":0,"cell_chars":16384,"cell_head_chars":4096},"cells_cut":0,"cells_raw":0,"read":"whole","date_system":"1900"}

{"sheet":"ACCUEIL","index":0,"n_rows":0,"n_cols":0,"rows_kept":0,"cut":false,"hidden":false,"merged":[]}

{"sheet":"EQUIPES","index":1,"n_rows":76,"n_cols":8,"rows_kept":76,"cut":false,"hidden":false,"merged":[[3,1,10,1],[1,3,1,7]]}
[]
[null,"Classe:","3A","Renseigner les équipes de BASKET"]
[null,"EQUIPES","N°","A","B","C","D","E"]
[null,"JOUEURS",1,"Eric","Fabien","Fred","Christian","Stéphanie"]
[null,null,2,"Lucie","Damien","Sami","Stephane","Sarah"]
[null,null,3,"Mathilde","Lucas","Léonie","Olivier","Murielle"]
[null,null,4,"Idriss","Mélanie","Clara","Marc","David"]
[null,null,5,"Clemy","Marie","Chloé","Ernest","Quentin"]
[null,null,6,"Yacine"]
[null,null,7]
[null,null,8]
[null,"Matchs\njoués",null,{"$f":"COUNTIF(RESULTeqA!A:A,\">0\")","v":0},{"$f":"COUNTIF(RESULTeqB!A:A,\">0\")","v":1},{"$f":"COUNTIF(RESULTeqC!A:A,\">0\")","v":0},{"$f":"COUNTIF(RESULTeqD!A:A,\">0\")","v":2},{"$f":"COUNTIF(RESULTeqE!A:A,\">0\")","v":1}]
[]
["Historique des rencontres"]
["Equipe_D","contre","Equipe_E"]
["Equipe_B","contre","Equipe_D"]
[]
[]
[]
[]
[]
[]
[]
[]
[]
[]
[]
[]
[]
[]
[]
[]
[]
[]
[]
[]
[]
[]
[]
[]
[]
[]
[]
[]
[]
[]
[]
[]
[]
[]
[]
[]
[]
[]
[]
[]
[]
[]
[]
[]
[]
[]
[]
[]
[]
[]
[]
[]
[]
[]
[]
["Equipe A"]
["Equipe B"]
["Equipe C"]
["Equipe D"]
["Equipe E"]

{"sheet":"BASKET","index":2,"n_rows":7,"n_cols":19,"rows_kept":7,"cut":false,"hidden":false,"merged":[]}
["Equipe_C",null,null,null,null,null,null,null,null,null,null,null,"Equipe_D"]
[]
[]
[]
[]
["Fred",null,"Sami",null,"Léonie",null,"Clara",null,null,null,null,null,"Christian",null,"Stephane",null,"Olivier",null,"Marc"]
["Chloé",null,null,null,null,null,null,null,null,null,null,null,"Ernest"]

{"sheet":"STAT","index":4,"n_rows":15,"n_cols":4,"rows_kept":15,"cut":false,"hidden":false,"merged":[]}
[null,{"$f":"BASKET!A1","v":"Equipe_C"},"-",{"$f":"BASKET!M1","v":"Equipe_D"}]
["Tirs",0,null,0]
["Paniers",0,null,0]
["AXE DE TRAVAIL N°1 \nTIR",{"$f":"IF(B2>0,B3/B2,0)","v":0},null,{"$f":"IF(D2>0,D3/D2,0)","v":0}]
["Possessions",0,null,0]
["Pertes de balle",0,null,0]
["AXE DE TRAVAIL N°2\nCONSERVATION",{"$f":"IF(B5>0,1-(B6/B5),0)","v":0},null,{"$f":"IF(D5>0,1-(D6/D5),0)","v":0}]
["AXE DE TRAVAIL N°3\nRECUPERATION (VOLUME DE JEU)",{"$f":"IF(B11>0,B5/B11,0)","v":0},null,{"$f":"IF(D11>0,D5/D11,0)","v":0}]
["SCORE",0,null,0]
["VICTOIRE - DEFAITE - NUL",{"$f":"IF(B9>D9,\"V\",IF(B9<D9,\"D\",\"N\"))","v":"N"},null,{"$f":"IF(D9>B9,\"V\",IF(D9<B9,\"D\",\"N\"))","v":"N"}]
["VOLUME TOTAL DE JEU (Possessions)",{"$f":"B5+D5","v":0},null,{"$f":"B5+D5","v":0}]
["AXE DE TRAVAIL N°4\nPROGRESSION",{"$f":"IF(B5>0,B2/B5,0)","v":0},null,{"$f":"IF(D5>0,D2/D5,0)","v":0}]
[{"$f":"A9","v":"SCORE"},0,null,{"$f":"D9","v":0}]
["VICTOIRE - DEFAITE - NUL","N",0,{"$f":"D10","v":"N"}]
["VOLUME TOTAL DE JEU (Possessions)",0,null,{"$f":"D11","v":0}]

{"sheet":"CLASSEMENT","index":5,"n_rows":17,"n_cols":16,"rows_kept":17,"cut":false,"hidden":false,"merged":[[0,1,0,2],[0,4,0,5],[0,7,0,8],[0,10,0,11],[0,13,0,14]]}
[null,"Victoires",null,null,"Efficacité au tir",null,null,"Conservation de balle",null,null,"Récupération de balle",null,null,"Progression vers la cible"]
[null,null,{"$f":"RESULTeqA!Y2+RESULTeqA!X2/100+RESULTeqA!Q2/500","v":0},"Equipe A",null,{"$f":"RESULTeqA!T2+C2/1000","v":0},"Equipe A",null,{"$f":"RESULTeqA!U2+C2/1000","v":0},"Equipe A",null,{"$f":"RESULTeqA!V2+C2/1000","v":0},"Equipe A",null,{"$f":"RESULTeqA!W2+C2/1000","v":0},"Equipe A"]
[null,null,{"$f":"RESULTeqB!Y2+RESULTeqB!X2/100+RESULTeqB!Q2/500","v":3.07},"Equipe B",null,{"$f":"RESULTeqB!T2+C3/1000","v":0.50307000000000002},"Equipe B",null,{"$f":"RESULTeqB!U2+C3/1000","v":0.20306999999999994},"Equipe B",null,{"$f":"RESULTeqB!V2+C3/1000","v":0.50307000000000002},"Equipe B",null,{"$f":"RESULTeqB!W2+C3/1000","v":1.2030699999999999},"Equipe B"]
[null,null,{"$f":"RESULTeqC!Y2+RESULTeqC!X2/100+RESULTeqC!Q2/500","v":0},"Equipe C",null,{"$f":"RESULTeqC!T2+C4/1000","v":0},"Equipe C",null,{"$f":"RESULTeqC!U2+C4/1000","v":0},"Equipe C",null,{"$f":"RESULTeqC!V2+C4/1000","v":0},"Equipe C",null,{"$f":"RESULTeqC!W2+C4/1000","v":0},"Equipe C"]
[null,null,{"$f":"RESULTeqD!Y2+RESULTeqD!X2/100+RESULTeqD!Q2/500","v":2.08},"Equipe D",null,{"$f":"RESULTeqD!T2+C5/1000","v":0.60207999999999995},"Equipe D",null,{"$f":"RESULTeqD!U2+C5/1000","v":0.20207999999999995},"Equipe D",null,{"$f":"RESULTeqD!V2+C5/1000","v":0.52839578947368415},"Equipe D",null,{"$f":"RESULTeqD!W2+C5/1000","v":0.50207999999999997},"Equipe D"]
[null,null,{"$f":"RESULTeqE!Y2+RESULTeqE!X2/100+RESULTeqE!Q2/500","v":3.048},"Equipe E",null,{"$f":"RESULTeqE!T2+C6/1000","v":1.0030479999999999},"Equipe E",null,{"$f":"RESULTeqE!U2+C6/1000","v":0.253048},"Equipe E",null,{"$f":"RESULTeqE!V2+C6/1000","v":0.44749244444444441},"Equipe E",null,{"$f":"RESULTeqE!W2+C6/1000","v":0.50304800000000005},"Equipe E"]
[]
[]
[]
[null,"Classement",null,null,"Classement",null,null,"Classement",null,null,"Classement",null,null,"Classement"]
[1,"1er",{"$f":"IF(LARGE(C$2:C$6,1)=LARGE(C$2:C$6,5),\"\",VLOOKUP(LARGE(C$2:C$6,A11),C$2:D$6,2,FALSE))","v":"Equipe B"},{"$f":"RANK(C2,C1:C2)","v":1},"1er",{"$f":"IF($C$11=\"\",\"\",VLOOKUP(LARGE(F$2:F$6,A11),F$2:G$6,2,FALSE))","v":"Equipe E"},{"$f":"RANK(F2,$F$2:$F$6)","v":4},"1er",{"$f":"IF($C$11=\"\",\"\",VLOOKUP(LARGE(I$2:I$6,A11),I$2:J$6,2,FALSE))","v":"Equipe E"},{"$f":"RANK(I2,$I$2:$I$6)","v":4},"1er",{"$f":"IF($C$11=\"\",\"\",VLOOKUP(LARGE(L$2:L$6,A11),L$2:M$6,2,FALSE))","v":"Equipe D"},{"$f":"RANK(L2,$L$2:$L$6)","v":4},"1er",{"$f":"IF($C$11=\"\",\"\",VLOOKUP(LARGE(O$2:O$6,A11),O$2:P$6,2,FALSE))","v":"Equipe B"},{"$f":"RANK(O2,$O$2:$O$6)","v":4}]
[2,"2eme",{"$f":"IF(LARGE(C$2:C$6,1)=LARGE(C$2:C$6,5),\"\",VLOOKUP(LARGE(C$2:C$6,A12),C$2:D$6,2,FALSE))","v":"Equipe E"},{"$f":"RANK(C3,C1:C4)","v":1},"2eme",{"$f":"IF($C$11=\"\",\"\",VLOOKUP(LARGE(F$2:F$6,A12),F$2:G$6,2,FALSE))","v":"Equipe D"},{"$f":"RANK(F3,$F$2:$F$6)","v":3},"2eme",{"$f":"IF($C$11=\"\",\"\",VLOOKUP(LARGE(I$2:I$6,A12),I$2:J$6,2,FALSE))","v":"Equipe B"},{"$f":"RANK(I3,$I$2:$I$6)","v":2},"2eme",{"$f":"IF($C$11=\"\",\"\",VLOOKUP(LARGE(L$2:L$6,A12),L$2:M$6,2,FALSE))","v":"Equipe B"},{"$f":"RANK(L3,$L$2:$L$6)","v":2},"2eme",{"$f":"IF($C$11=\"\",\"\",VLOOKUP(LARGE(O$2:O$6,A12),O$2:P$6,2,FALSE))","v":"Equipe E"},{"$f":"RANK(O3,$O$2:$O$6)","v":1}]
[3,"3eme",{"$f":"IF(LARGE(C$2:C$6,1)=LARGE(C$2:C$6,5),\"\",VLOOKUP(LARGE(C$2:C$6,A13),C$2:D$6,2,FALSE))","v":"Equipe D"},{"$f":"RANK(C4,C3:C7)","v":4},"3eme",{"$f":"IF($C$11=\"\",\"\",VLOOKUP(LARGE(F$2:F$6,A13),F$2:G$6,2,FALSE))","v":"Equipe B"},{"$f":"RANK(F4,$F$2:$F$6)","v":4},"3eme",{"$f":"IF($C$11=\"\",\"\",VLOOKUP(LARGE(I$2:I$6,A13),I$2:J$6,2,FALSE))","v":"Equipe D"},{"$f":"RANK(I4,$I$2:$I$6)","v":4},"3eme",{"$f":"IF($C$11=\"\",\"\",VLOOKUP(LARGE(L$2:L$6,A13),L$2:M$6,2,FALSE))","v":"Equipe E"},{"$f":"RANK(L4,$L$2:$L$6)","v":4},"3eme",{"$f":"IF($C$11=\"\",\"\",VLOOKUP(LARGE(O$2:O$6,A13),O$2:P$6,2,FALSE))","v":"Equipe D"},{"$f":"RANK(O4,$O$2:$O$6)","v":4}]
[4,"4eme",{"$f":"IF(LARGE(C$2:C$6,1)=LARGE(C$2:C$6,5),\"\",VLOOKUP(LARGE(C$2:C$6,A14),C$2:D$6,2,FALSE))","v":"Equipe A"},{"$f":"RANK(C5,C5:C9)","v":2},"4eme",{"$f":"IF($C$11=\"\",\"\",VLOOKUP(LARGE(F$2:F$6,A14),F$2:G$6,2,FALSE))","v":"Equipe A"},{"$f":"RANK(F5,$F$2:$F$6)","v":2},"4eme",{"$f":"IF($C$11=\"\",\"\",VLOOKUP(LARGE(I$2:I$6,A14),I$2:J$6,2,FALSE))","v":"Equipe A"},{"$f":"RANK(I5,$I$2:$I$6)","v":3},"4eme",{"$f":"IF($C$11=\"\",\"\",VLOOKUP(LARGE(L$2:L$6,A14),L$2:M$6,2,FALSE))","v":"Equipe A"},{"$f":"RANK(L5,$L$2:$L$6)","v":1},"4eme",{"$f":"IF($C$11=\"\",\"\",VLOOKUP(LARGE(O$2:O$6,A14),O$2:P$6,2,FALSE))","v":"Equipe A"},{"$f":"RANK(O5,$O$2:$O$6)","v":3}]
[5,"5eme",{"$f":"IF(LARGE(C$2:C$6,1)=LARGE(C$2:C$6,5),\"\",VLOOKUP(LARGE(C$2:C$6,A15),C$2:D$6,2,FALSE))","v":"Equipe A"},{"$f":"RANK(C6,C5:C8)","v":1},"5eme",{"$f":"IF($C$11=\"\",\"\",VLOOKUP(LARGE(F$2:F$6,A15),F$2:G$6,2,FALSE))","v":"Equipe A"},{"$f":"RANK(F6,$F$2:$F$6)","v":1},"5eme",{"$f":"IF($C$11=\"\",\"\",VLOOKUP(LARGE(I$2:I$6,A15),I$2:J$6,2,FALSE))","v":"Equipe A"},{"$f":"RANK(I6,$I$2:$I$6)","v":1},"5eme",{"$f":"IF($C$11=\"\",\"\",VLOOKUP(LARGE(L$2:L$6,A15),L$2:M$6,2,FALSE))","v":"Equipe A"},{"$f":"RANK(L6,$L$2:$L$6)","v":3},"5eme",{"$f":"IF($C$11=\"\",\"\",VLOOKUP(LARGE(O$2:O$6,A15),O$2:P$6,2,FALSE))","v":"Equipe A"},{"$f":"RANK(O6,$O$2:$O$6)","v":2}]
[]
[null,null,null,null,null,null,null,null,""]

{"sheet":"RESULTeqA","index":6,"n_rows":2,"n_cols":30,"rows_kept":2,"cut":false,"hidden":false,"merged":[[0,3,0,6]]}
[null,null,null,"Equipe A",null,null,null,null,null,null,null,null,null,"TOTAL","Tirs","Paniers","Possessions","Pertes de balle","Nombre total possessions","EFFICACITE \nTIR","EFFICACITE\nCONSERVATION","EFFICACITE\nRECUPERATION (VOLUME DE JEU)","EFFICACITE\nPROGRESSION","SCORE","Points de classement (V:3/N:2/D:1)",null,"INEFFICACITE\nTIR","INEFFICACITE\nCONSERVATION","INEFFICACITE\nRECUPERATION (VOLUME DE JEU)","INEFFICACITE\nPROGRESSION"]
["Match\nn°","Tirs","Paniers","Possessions","Pertes de balle","Nombre total possessions","AXE DE TRAVAIL N°1 \nTIR","AXE DE TRAVAIL N°2\nCONSERVATION","AXE DE TRAVAIL N°3\nRECUPERATION (VOLUME DE JEU)","AXE DE TRAVAIL N°4\nPROGRESSION","SCORE","VICTOIRE NUL DEFAITE\n(V-N-D)\n3pts-2pts-1pt",null,null,{"$f":"SUM(B:B)","v":0},{"$f":"SUM(C:C)","v":0},{"$f":"SUM(D:D)","v":0},{"$f":"SUM(E:E)","v":0},{"$f":"SUM(F:F)","v":0},{"$f":"IF(O2>0,P2/O2,\"0%\")","v":"0%"},{"$f":"IF(Q2>0,1-(R2/Q2),\"0%\")","v":"0%"},{"$f":"IF(S2>0,Q2/S2,\"0%\")","v":"0%"},{"$f":"IF(Q2>0,O2/Q2,\"0%\")","v":"0%"},{"$f":"SUM(K:K)","v":0},{"$f":"SUM(L:L)","v":0},null,{"$f":"1-T2","v":1},{"$f":"1-U2","v":1},{"$f":"1-V2","v":1},{"$f":"1-W2","v":1}]

{"sheet":"RESULTeqB","index":7,"n_rows":3,"n_cols":30,"rows_kept":3,"cut":false,"hidden":false,"merged":[[0,3,0,6]]}
[null,null,null,"Equipe B",null,null,null,null,null,null,null,null,null,"TOTAL","Tirs","Paniers","Possessions","Pertes de balle","Nombre total possessions","EFFICACITE \nTIR","EFFICACITE\nCONSERVATION","EFFICACITE\nRECUPERATION (VOLUME DE JEU)","EFFICACITE\nPROGRESSION","SCORE","Points de classement (V:3/N:2/D:1)",null,"INEFFICACITE\nTIR","INEFFICACITE\nCONSERVATION","INEFFICACITE\nRECUPERATION (VOLUME DE JEU)","INEFFICACITE\nPROGRESSION"]
["Match\nn°","Tirs","Paniers","Possessions","Pertes de balle","Nombre total possessions","AXE DE TRAVAIL N°1 \nTIR","AXE DE TRAVAIL N°2\nCONSERVATION","AXE DE TRAVAIL N°3\nRECUPERATION (VOLUME DE JEU)","AXE DE TRAVAIL N°4\nPROGRESSION","SCORE","VICTOIRE NUL DEFAITE\n(V-N-D)\n3pts-2pts-1pt",null,null,{"$f":"SUM(B:B)","v":6},{"$f":"SUM(C:C)","v":3},{"$f":"SUM(D:D)","v":5},{"$f":"SUM(E:E)","v":4},{"$f":"SUM(F:F)","v":10},{"$f":"IF(O2>0,P2/O2,\"0%\")","v":0.5},{"$f":"IF(Q2>0,1-(R2/Q2),\"0%\")","v":0.19999999999999996},{"$f":"IF(S2>0,Q2/S2,\"0%\")","v":0.5},{"$f":"IF(Q2>0,O2/Q2,\"0%\")","v":1.2},{"$f":"SUM(K:K)","v":6},{"$f":"SUM(L:L)","v":3},null,{"$f":"1-T2","v":0.5},{"$f":"1-U2","v":0.8},{"$f":"1-V2","v":0.5},{"$f":"1-W2","v":-0.19999999999999996}]
[{"$f":"A4+1","v":1},6,3,5,4,10,0.5,0.19999999999999996,0.5,1.2,6,3]

{"sheet":"RESULTeqC","index":8,"n_rows":2,"n_cols":30,"rows_kept":2,"cut":false,"hidden":false,"merged":[[0,3,0,6]]}
[null,null,null,"Equipe C",null,null,null,null,null,null,null,null,null,"TOTAL","Tirs","Paniers","Possessions","Pertes de balle","Nombre total possessions","EFFICACITE \nTIR","EFFICACITE\nCONSERVATION","EFFICACITE\nRECUPERATION (VOLUME DE JEU)","EFFICACITE\nPROGRESSION","SCORE","Points de classement (V:3/N:2/D:1)",null,"INEFFICACITE\nTIR","INEFFICACITE\nCONSERVATION","INEFFICACITE\nRECUPERATION (VOLUME DE JEU)","INEFFICACITE\nPROGRESSION"]
["Match\nn°","Tirs","Paniers","Possessions","Pertes de balle","Nombre total possessions","AXE DE TRAVAIL N°1 \nTIR","AXE DE TRAVAIL N°2\nCONSERVATION","AXE DE TRAVAIL N°3\nRECUPERATION (VOLUME DE JEU)","AXE DE TRAVAIL N°4\nPROGRESSION","SCORE","VICTOIRE NUL DEFAITE\n(V-N-D)\n3pts-2pts-1pt",null,null,{"$f":"SUM(B:B)","v":0},{"$f":"SUM(C:C)","v":0},{"$f":"SUM(D:D)","v":0},{"$f":"SUM(E:E)","v":0},{"$f":"SUM(F:F)","v":0},{"$f":"IF(O2>0,P2/O2,\"0%\")","v":"0%"},{"$f":"IF(Q2>0,1-(R2/Q2),\"0%\")","v":"0%"},{"$f":"IF(S2>0,Q2/S2,\"0%\")","v":"0%"},{"$f":"IF(Q2>0,O2/Q2,\"0%\")","v":"0%"},{"$f":"SUM(K:K)","v":0},{"$f":"SUM(L:L)","v":0},null,{"$f":"1-T2","v":1},{"$f":"1-U2","v":1},{"$f":"1-V2","v":1},{"$f":"1-W2","v":1}]

{"sheet":"RESULTeqD","index":9,"n_rows":4,"n_cols":30,"rows_kept":4,"cut":false,"hidden":false,"merged":[[0,3,0,6]]}
[null,null,null,"Equipe D",null,null,null,null,null,null,null,null,null,"TOTAL","Tirs","Paniers","Possessions","Pertes de balle","Nombre total possessions","EFFICACITE \nTIR","EFFICACITE\nCONSERVATION","EFFICACITE\nRECUPERATION (VOLUME DE JEU)","EFFICACITE\nPROGRESSION","SCORE","Points de classement (V:3/N:2/D:1)",null,"INEFFICACITE\nTIR","INEFFICACITE\nCONSERVATION","INEFFICACITE\nRECUPERATION (VOLUME DE JEU)","INEFFICACITE\nPROGRESSION"]
["Match\nn°","Tirs","Paniers","Possessions","Pertes de balle","Nombre total possessions","AXE DE TRAVAIL N°1 \nTIR","AXE DE TRAVAIL N°2\nCONSERVATION","AXE DE TRAVAIL N°3\nRECUPERATION (VOLUME DE JEU)","AXE DE TRAVAIL N°4\nPROGRESSION","SCORE","VICTOIRE NUL DEFAITE\n(V-N-D)\n3pts-2pts-1pt",null,null,{"$f":"SUM(B:B)","v":5},{"$f":"SUM(C:C)","v":3},{"$f":"SUM(D:D)","v":10},{"$f":"SUM(E:E)","v":8},{"$f":"SUM(F:F)","v":19},{"$f":"IF(O2>0,P2/O2,\"0%\")","v":0.6},{"$f":"IF(Q2>0,1-(R2/Q2),\"0%\")","v":0.19999999999999996},{"$f":"IF(S2>0,Q2/S2,\"0%\")","v":0.52631578947368418},{"$f":"IF(Q2>0,O2/Q2,\"0%\")","v":0.5},{"$f":"SUM(K:K)","v":6},{"$f":"SUM(L:L)","v":2},null,{"$f":"1-T2","v":0.4},{"$f":"1-U2","v":0.8},{"$f":"1-V2","v":0.47368421052631582},{"$f":"1-W2","v":0.5}]
[{"$f":"A4+1","v":2},2,1,5,4,9,0.5,0.19999999999999996,0.55555555555555558,0.4,2,1]
[{"$f":"A5+1","v":1},3,2,5,4,10,0.66666666666666663,0.19999999999999996,0.5,0.6,4,1]

{"sheet":"RESULTeqE","index":10,"n_rows":3,"n_cols":30,"rows_kept":3,"cut":false,"hidden":false,"merged":[[0,3,0,6]]}
[null,null,null,"Equipe E",null,null,null,null,null,null,null,null,null,"TOTAL","Tirs","Paniers","Possessions","Pertes de balle","Nombre total possessions","EFFICACITE \nTIR","EFFICACITE\nCONSERVATION","EFFICACITE\nRECUPERATION (VOLUME DE JEU)","EFFICACITE\nPROGRESSION","SCORE","Points de classement (V:3/N:2/D:1)",null,"INEFFICACITE\nTIR","INEFFICACITE\nCONSERVATION","INEFFICACITE\nRECUPERATION (VOLUME DE JEU)","INEFFICACITE\nPROGRESSION"]
["Match\nn°","Tirs","Paniers","Possessions","Pertes de balle","Nombre total possessions","AXE DE TRAVAIL N°1 \nTIR","AXE DE TRAVAIL N°2\nCONSERVATION","AXE DE TRAVAIL N°3\nRECUPERATION (VOLUME DE JEU)","AXE DE TRAVAIL N°4\nPROGRESSION","SCORE","VICTOIRE NUL DEFAITE\n(V-N-D)\n3pts-2pts-1pt",null,null,{"$f":"SUM(B:B)","v":2},{"$f":"SUM(C:C)","v":2},{"$f":"SUM(D:D)","v":4},{"$f":"SUM(E:E)","v":3},{"$f":"SUM(F:F)","v":9},{"$f":"IF(O2>0,P2/O2,\"0%\")","v":1},{"$f":"IF(Q2>0,1-(R2/Q2),\"0%\")","v":0.25},{"$f":"IF(S2>0,Q2/S2,\"0%\")","v":0.44444444444444442},{"$f":"IF(Q2>0,O2/Q2,\"0%\")","v":0.5},{"$f":"SUM(K:K)","v":4},{"$f":"SUM(L:L)","v":3},null,{"$f":"1-T2","v":0},{"$f":"1-U2","v":0.75},{"$f":"1-V2","v":0.55555555555555558},{"$f":"1-W2","v":0.5}]
[{"$f":"A4+1","v":1},2,2,4,3,9,1,0.25,0.44444444444444442,0.5,4,3]

{"sheet":"GRAPHeqA","index":11,"n_rows":0,"n_cols":0,"rows_kept":0,"cut":false,"hidden":false,"merged":[]}

{"sheet":"GRAPHeqB","index":12,"n_rows":0,"n_cols":0,"rows_kept":0,"cut":false,"hidden":false,"merged":[]}

{"sheet":"GRAPHeqC","index":13,"n_rows":0,"n_cols":0,"rows_kept":0,"cut":false,"hidden":false,"merged":[]}

{"sheet":"GRAPHeqD","index":14,"n_rows":0,"n_cols":0,"rows_kept":0,"cut":false,"hidden":false,"merged":[]}

{"sheet":"GRAPHeqE","index":15,"n_rows":0,"n_cols":0,"rows_kept":0,"cut":false,"hidden":false,"merged":[]}

{"sheet":"FICHE","index":16,"n_rows":14,"n_cols":16,"rows_kept":14,"cut":false,"hidden":false,"merged":[[13,2,13,6],[13,11,13,15],[11,0,13,0],[11,9,13,9],[5,2,5,6],[12,2,12,6],[12,11,12,15],[3,0,5,0],[3,11,3,15],[4,11,4,15],[5,11,5,15],[11,2,11,6],[11,11,11,15],[3,9,5,9],[3,2,3,6],[4,2,4,6]]}
[null,null,"Equipe observée: ",null,null,null,null,null,null,null,null,"Equipe observée: "]
[null,null,"A","B","C","D","E",null,null,null,null,"A","B","C","D","E"]
[]
["OBSERVATEUR 1","Tirs",null,null,null,null,null,null,null,"OBSERVATEUR 2","Possessions"]
[null,"Paniers",null,null,null,null,null,null,null,null,"Pertes de balle"]
[null,"SCORE",null,null,null,null,null,null,null,null,"Total de possessions"]
[]
[]
[null,null,"Equipe observée: ",null,null,null,null,null,null,null,null,"Equipe observée: "]
[null,null,"A","B","C","D","E",null,null,null,null,"A","B","C","D","E"]
[]
["OBSERVATEUR 1","Tirs",null,null,null,null,null,null,null,"OBSERVATEUR 2","Possessions"]
[null,"Paniers",null,null,null,null,null,null,null,null,"Pertes de balle"]
[null,"SCORE",null,null,null,null,null,null,null,null,"Total de possessions"]