{"text_format":"1","workbook":"xlsx","n_sheets":12,"sheets":["MICKAPPS","ECHFMTELEVE","4EQUIPES","SAELEVE1","SCORE","OBS1","OBS2","OBS3","OBS4","DEBUT","APPEL","SAMICBIS"],"not_rendered":{"charts":0,"images":117,"macros":1,"external_links":1,"defined_names":39,"comments":5,"pivot_tables":0},"unopened":[],"bounds":{"document_bytes":16777216,"sheet_cells":100000,"rows_first":2000,"rows_last":500,"rows_between":2000,"halvings":0,"cell_chars":16384,"cell_head_chars":4096},"cells_cut":0,"cells_raw":0,"read":"whole","date_system":"1900"}

{"sheet":"MICKAPPS","index":0,"n_rows":24,"n_cols":8,"rows_kept":24,"cut":false,"hidden":false,"merged":[[15,3,15,6],[22,7,22,10],[23,7,23,10]]}
[]
[]
[]
[]
[]
[]
[]
[]
[]
[]
[]
[]
[]
[]
[]
[null,null,null,"BB COACH"]
[]
[]
[]
[]
[]
[]
[null,null,null,null,null,null,null,"mickael.da-costa@ac-lyon.fr"]
[null,null,null,null,null,null,null,"https://acmickeps.wordpress.com"]

{"sheet":"ECHFMTELEVE","index":1,"n_rows":18,"n_cols":8,"rows_kept":18,"cut":false,"hidden":false,"merged":[[17,7,21,9],[2,5,2,6],[4,5,4,6],[11,5,11,6],[16,5,16,6],[5,5,10,6],[12,5,15,6],[17,5,21,6],[1,2,1,4],[3,5,3,6],[11,0,13,4],[5,7,10,9],[12,7,15,9]]}
[]
["Classe ","1TV","NOTE/10"]
["COULEUR","BLEU",null,null,null,"ECHAUFFEMENT détaillé"]
["Arbitre","Amira"]
["Arbitre","Estelle",null,null,null,{"$f":"VLOOKUP($F$3,DEBUT!$A$2:$M$16,2,FALSE)","v":"Echauffement cardio-pulmonaire"},null,{"$f":"VLOOKUP($F$3,DEBUT!$A$2:$M$16,4,FALSE)","v":"5 min"}]
["Observateur",null,null,null,null,{"$f":"VLOOKUP($F$3,DEBUT!$A$2:$M$16,3,FALSE)","v":"3 A-R course / Montée genoux / Talons fesses / Pas chassés / Pas croisés / Flexions / Extensions / Course arrière / Appuis arrières / Accélération progressive (60% - 70% - 80% - 90%)"},null,{"$f":"VLOOKUP($F$3,DEBUT!$A$2:$M$16,5,FALSE)","v":"Progressivité / Complet / "}]
["Observateur"]
["Score"]
["Score"]
["Autre"]
["Autre"]
["Si l'échauffement est complet, continu, progressif, logique et bien démontré alors je peux avoir 10/10, sinon -1 à chaque oubli",null,null,null,null,{"$f":"VLOOKUP($F$3,DEBUT!$A$2:$M$16,6,FALSE)","v":"Mobilisation articulaire"},null,{"$f":"VLOOKUP($F$3,DEBUT!$A$2:$M$16,8,FALSE)","v":"3 min"}]
[null,null,null,null,null,{"$f":"VLOOKUP($F$3,DEBUT!$A$2:$M$16,7,FALSE)","v":"Cou / Epaules / Coudes / Poignets / Bassin / Genoux / Chevilles"},null,{"$f":"VLOOKUP($F$3,DEBUT!$A$2:$M$16,9,FALSE)","v":"Du haut vers le bas"}]
[]
[]
[]
[null,null,null,null,null,{"$f":"VLOOKUP($F$3,DEBUT!$A$2:$M$16,10,FALSE)","v":"Etirements"},null,{"$f":"VLOOKUP($F$3,DEBUT!$A$2:$M$16,12,FALSE)","v":"3 min"}]
[null,null,null,null,null,{"$f":"VLOOKUP($F$3,DEBUT!$A$2:$M$16,11,FALSE)","v":"Triceps / Biceps / Epaules / Adducteurs / ischios / Quadriceps / Mollets"},null,{"$f":"VLOOKUP($F$3,DEBUT!$A$2:$M$16,13,FALSE)","v":"Du haut vers le bas / Tenir 7\""}]

{"sheet":"4EQUIPES","index":2,"n_rows":14,"n_cols":16,"rows_kept":14,"cut":false,"hidden":false,"merged":[[1,2,1,4],[1,6,1,8],[1,10,1,12],[1,14,1,16],[0,2,0,4],[0,6,0,8],[0,10,0,12],[0,14,0,16]]}
[null,null,"ECHAUFFEMENT/10",null,null,null,"ECHAUFFEMENT/10",null,null,null,"ECHAUFFEMENT/10",null,null,null,"ECHAUFFEMENT/10"]
[null,{"$f":"ECHFMTELEVE!B2","v":"1TV"},null,null,null,{"$f":"B2","v":"1TV"},null,null,null,{"$f":"B2","v":"1TV"},null,null,null,{"$f":"B2","v":"1TV"}]
[null,"VIOLET",null,10,null,"BLANC",null,10,null,"ORANGE",null,10,null,"ROUGE",null,10]
[null,{"$f":"ECHFMTELEVE!B4","v":"Amira"},null,null,null,"Abraham",null,null,null,"Beyza",null,null,null,"Anis"]
[null,{"$f":"ECHFMTELEVE!B5","v":"Estelle"}]
[null,{"$f":"ECHFMTELEVE!B6","v":0}]
[null,{"$f":"ECHFMTELEVE!B7","v":0}]
[null,{"$f":"ECHFMTELEVE!B8","v":0}]
[null,{"$f":"ECHFMTELEVE!B9","v":0}]
[null,{"$f":"ECHFMTELEVE!B10","v":0}]
[null,{"$f":"ECHFMTELEVE!B11","v":0}]
[]
[]
[null,"OBSERVATION MATCH",null,null,null,"OBSERVATION MATCH",null,null,null,"OBSERVATION MATCH",null,null,null,"OBSERVATION MATCH"]

{"sheet":"SAELEVE1","index":3,"n_rows":19,"n_cols":11,"rows_kept":19,"cut":false,"hidden":false,"merged":[[2,10,3,10],[3,6,3,9],[4,2,4,6],[4,7,4,10],[7,7,7,10],[5,7,5,10],[7,17,7,18],[9,2,9,6],[9,7,9,10],[12,2,12,10],[8,2,8,6],[8,7,8,10],[0,3,0,6],[18,2,18,10],[14,2,14,4],[14,5,14,7],[14,8,14,10],[15,2,15,10],[16,2,16,10],[17,2,17,10],[6,7,6,10],[5,2,7,6],[13,2,13,4],[13,5,13,7],[13,8,13,10],[2,2,3,2],[2,3,3,4],[2,6,2,9]]}
[null,null,"Thème","TIR",null,null,null,"Niveau ->","N4",{"$f":"IF(I1=DEBUT!S2,VLOOKUP(D1,DEBUT!R3:V26,2,FALSE),IF(I1=DEBUT!T2,VLOOKUP(D1,DEBUT!R3:V26,3,FALSE),IF(I1=DEBUT!U2,VLOOKUP(D1,DEBUT!R3:V26,4,FALSE),IF(I1=DEBUT!V2,VLOOKUP(D1,DEBUT!R3:V26,5,FALSE)))))","v":0}]
[]
[null,null,"BAD","PASSE et VA",null,"Obj",{"$f":"VLOOKUP($D$3,SAMICBIS!$A$3:$T$70,5,FALSE)","v":"ENCHAINER PASSE – DEPLACEMENT - RECEPTION – TIR EN COURSE – REBOND - DRIBBLE"},null,null,null,{"$f":"VLOOKUP($D$3,SAMICBIS!$A$3:$T$70,2,FALSE)","v":"PVA"}]
[null,null,null,null,null,"But",{"$f":"VLOOKUP($D$3,SAMICBIS!$A$3:$T$70,6,FALSE)","v":"Réaliser un passe et va + tir en course et marquer le plus de paniers possible"}]
[null,null,"Schéma / Matériel nécessaire",null,null,null,null,"Matériel nécessaire"]
[null,null,null,null,null,null,null,{"$f":"VLOOKUP($D$3,SAMICBIS!$A$3:$T$70,13,FALSE)","v":"2 plots. 1 ballon. 1 chrono / Panier. Si l'équipe possède 4 joueurs ou plus il faut utiliser 2 paniers et démarrer en même temps. "}]
[null,null,null,null,null,null,null,"Consignes"]
[null,null,null,null,null,null,null,{"$f":"CONCATENATE(VLOOKUP($D$3,SAMICBIS!$A$3:$T$70,8,FALSE),\"  -  \",VLOOKUP($D$3,SAMICBIS!$A$3:$T$70,10,FALSE))","v":"Le joueur ROUGE fait une passe au joueur VERT qui lui remet dans la course (une-deux). Le joueur ROUGE tente le tir, récupère le ballon et retourne faire le tour du plot rouge. Le joueur ROUGE enchaine les une-deux et les tirs pendant 1 minute.  -  Relever le score sur la feuille suivante"}]
[null,null,"Critères de réussite",null,null,null,null,"Conseils pour réussir"]
[null,null,{"$f":"VLOOKUP($D$3,SAMICBIS!$A$3:$T$70,14,FALSE)","v":0},null,null,null,null,{"$f":"VLOOKUP($D$3,SAMICBIS!$A$3:$T$70,12,FALSE)","v":"JE m'applique sur ma passe et mon tir. Je reviens rapidement faire le tour du plot."}]
[]
[]
[null,null,"ACQUISITIONS PRIORITAIRES"]
[null,null,"Connaissances",null,null,"Capacités",null,null,"Attitudes"]
[null,null,{"$f":"VLOOKUP($D$3,SAMICBIS!$A$3:$T$70,16,FALSE)","v":0},null,null,{"$f":"VLOOKUP($D$3,SAMICBIS!$A$3:$T$70,17,FALSE)","v":0},null,null,{"$f":"VLOOKUP($D$3,SAMICBIS!$A$3:$T$70,18,FALSE)","v":0}]
[null,null,"COMPLEXIFICATION "]
[null,null,{"$f":"VLOOKUP($D$3,SAMICBIS!$A$3:$T$70,19,FALSE)","v":0}]
[null,null,"Simplification"]
[null,null,{"$f":"VLOOKUP($D$3,SAMICBIS!$A$3:$T$70,20,FALSE)","v":"essai"}]

{"sheet":"SCORE","index":4,"n_rows":12,"n_cols":15,"rows_kept":12,"cut":false,"hidden":false,"merged":[]}
[]
[]
[null,{"$f":"ECHFMTELEVE!B2","v":"1TV"},"Score1","Score2","Score3","Score4","Score5","Score6","Score7","Score8","Score9","Score10","Score11","Score12","Total"]
[null,{"$f":"ECHFMTELEVE!B3","v":"BLEU"},{"$f":"SUM(C5:C12)","v":0},{"$f":"SUM(D5:D12)","v":0},0,0,0,0,{"$f":"SUM(I5:I12)","v":0},{"$f":"SUM(J5:J12)","v":0},0,0,0,0,{"$f":"SUM(C4:N4)","v":0}]
[null,{"$f":"ECHFMTELEVE!B4","v":"Amira"},null,null,null,null,null,null,null,null,null,null,null,null,{"$f":"SUM(C5:N5)","v":0}]
[null,{"$f":"ECHFMTELEVE!B5","v":"Estelle"},null,null,null,null,null,null,null,null,null,null,null,null,{"$f":"SUM(C6:N6)","v":0}]
[null,{"$f":"ECHFMTELEVE!B6","v":0},null,null,null,null,null,null,null,null,null,null,null,null,0]
[null,{"$f":"ECHFMTELEVE!B7","v":0},null,null,null,null,null,null,null,null,null,null,null,null,0]
[null,{"$f":"ECHFMTELEVE!B8","v":0},null,null,null,null,null,null,null,null,null,null,null,null,0]
[null,{"$f":"ECHFMTELEVE!B9","v":0},null,null,null,null,null,null,null,null,null,null,null,null,0]
[null,{"$f":"ECHFMTELEVE!B10","v":0},null,null,null,null,null,null,null,null,null,null,null,null,0]
[null,{"$f":"ECHFMTELEVE!B11","v":0},null,null,null,null,null,null,null,null,null,null,null,null,0]

{"sheet":"OBS1","index":5,"n_rows":73,"n_cols":23,"rows_kept":73,"cut":false,"hidden":false,"merged":[[0,3,0,4],[0,14,0,15],[15,16,15,17],[16,16,16,17],[17,16,17,17],[18,16,18,17],[19,16,19,17],[20,16,20,17],[21,16,21,17],[19,8,19,9],[20,8,20,9],[21,8,21,9],[1,14,1,15],[6,14,6,15],[7,14,7,15],[8,14,8,15],[9,14,9,15],[10,14,10,15],[11,14,11,15],[12,14,12,15],[13,14,13,15],[14,14,14,15],[15,14,15,15],[16,14,16,15],[6,16,6,17],[7,16,7,17],[8,16,8,17],[9,16,9,17],[10,16,10,17],[11,16,11,17],[12,16,12,17],[13,16,13,17],[14,16,14,17],[23,10,23,11],[24,10,24,11],[25,10,25,11],[26,10,26,11],[27,10,27,11],[28,10,28,11],[32,16,32,17],[33,16,33,17],[34,16,34,17],[32,10,32,11],[33,10,33,11],[34,10,34,11],[29,10,29,11],[30,10,30,11],[31,10,31,11],[23,16,23,17],[28,8,28,9],[29,8,29,9],[30,8,30,9],[31,8,31,9],[32,8,32,9],[33,8,33,9],[34,8,34,9],[6,10,6,11],[7,10,7,11],[8,10,8,11],[9,10,9,11],[10,10,10,11],[11,10,11,11],[12,10,12,11],[13,10,13,11],[14,10,14,11],[15,10,15,11],[16,10,16,11],[17,10,17,11],[18,10,18,11],[19,10,19,11],[20,10,20,11],[21,10,21,11],[22,10,22,11],[22,8,22,9],[23,8,23,9],[24,8,24,9],[25,8,25,9],[26,8,26,9],[27,8,27,9],[10,8,10,9],[11,8,11,9],[12,8,12,9],[13,8,13,9],[14,8,14,9],[15,8,15,9],[16,8,16,9],[17,8,17,9],[18,8,18,9],[68,4,68,5],[69,4,69,5],[70,4,70,5],[69,10,69,11],[65,6,65,7],[66,6,66,7],[67,6,67,7],[68,6,68,7],[69,6,69,7],[70,6,70,7],[65,12,65,14],[66,12,66,14],[67,12,67,14],[68,12,68,14],[69,12,69,14],[70,12,70,14],[27,20,27,21],[28,20,28,21],[29,20,29,21],[30,20,30,21],[31,20,31,21],[32,20,32,21],[33,20,33,21],[34,20,34,21],[29,18,29,19],[30,18,30,19],[29,14,29,15],[30,14,30,15],[31,14,31,15],[32,14,32,15],[33,14,33,15],[34,14,34,15],[34,12,34,13],[58,12,58,13],[26,20,26,21],[22,18,22,19],[23,18,23,19],[24,18,24,19],[25,18,25,19],[26,18,26,19],[27,18,27,19],[28,18,28,19],[27,14,27,15],[28,14,28,15],[22,20,22,21],[23,20,23,21],[24,20,24,21],[25,20,25,21],[22,16,22,17],[6,18,6,19],[7,18,7,19],[8,18,8,19],[9,18,9,19],[10,18,10,19],[11,18,11,19],[12,18,12,19],[13,18,13,19],[14,18,14,19],[15,18,15,19],[16,18,16,19],[17,18,17,19],[18,18,18,19],[1,3,1,4],[31,18,31,19],[33,18,33,19],[34,18,34,19],[6,20,6,21],[7,20,7,21],[8,20,8,21],[9,20,9,21],[10,20,10,21],[11,20,11,21],[12,20,12,21],[13,20,13,21],[14,20,14,21],[15,20,15,21],[16,20,16,21],[17,20,17,21],[18,20,18,21],[19,20,19,21],[20,20,20,21],[21,20,21,21],[19,18,19,19],[20,18,20,19],[21,18,21,19],[27,16,27,17],[28,16,28,17],[29,16,29,17],[30,16,30,17],[31,16,31,17],[32,12,32,13],[23,12,23,13],[24,12,24,13],[25,12,25,13],[26,12,26,13],[27,12,27,13],[28,12,28,13],[29,12,29,13],[30,12,30,13],[31,12,31,13],[32,18,32,19],[24,16,24,17],[25,16,25,17],[26,16,26,17],[26,14,26,15],[22,12,22,13],[17,14,17,15],[18,14,18,15],[19,14,19,15],[20,14,20,15],[21,14,21,15],[22,14,22,15],[23,14,23,15],[24,14,24,15],[25,14,25,15],[28,6,28,7],[29,6,29,7],[30,6,30,7],[31,6,31,7],[32,6,32,7],[33,6,33,7],[34,6,34,7],[6,12,6,13],[7,12,7,13],[8,12,8,13],[9,12,9,13],[10,12,10,13],[11,12,11,13],[12,12,12,13],[13,12,13,13],[14,12,14,13],[15,12,15,13],[16,12,16,13],[17,12,17,13],[18,12,18,13],[19,12,19,13],[20,12,20,13],[21,12,21,13],[33,12,33,13],[19,6,19,7],[20,6,20,7],[21,6,21,7],[22,6,22,7],[23,6,23,7],[24,6,24,7],[25,6,25,7],[26,6,26,7],[27,6,27,7],[10,6,10,7],[11,6,11,7],[12,6,12,7],[13,6,13,7],[14,6,14,7],[15,6,15,7],[16,6,16,7],[17,6,17,7],[18,6,18,7],[70,2,70,3],[70,10,70,11],[63,2,63,3],[63,10,63,11],[63,18,70,19],[63,20,70,21],[64,2,64,3],[64,10,64,11],[65,2,65,3],[65,10,65,11],[66,2,66,3],[66,10,66,11],[67,2,67,3],[67,10,67,11],[68,2,68,3],[68,10,68,11],[69,2,69,3],[63,4,63,5],[64,4,64,5],[65,4,65,5],[66,4,66,5],[67,4,67,5],[63,6,63,7],[63,12,63,14],[64,6,64,7],[61,1,61,21],[62,2,62,3],[62,10,62,11],[62,18,62,19],[59,13,60,13],[59,15,60,15],[59,17,60,17],[59,19,60,19],[59,21,60,21],[59,3,60,3],[59,5,60,5],[59,7,60,7],[59,9,60,9],[59,11,60,11],[62,4,62,5],[62,20,62,21],[62,12,62,14],[62,6,62,7],[64,12,64,14],[58,14,58,15],[58,16,58,17],[58,18,58,19],[58,20,58,21],[58,2,58,3],[58,4,58,5],[58,6,58,7],[58,8,58,9],[58,10,58,11],[55,13,56,13],[55,15,56,15],[55,17,56,17],[55,19,56,19],[55,21,56,21],[55,3,56,3],[55,5,56,5],[55,7,56,7],[55,9,56,9],[55,11,56,11],[52,13,53,13],[52,15,53,15],[52,17,53,17],[52,19,53,19],[52,21,53,21],[52,3,53,3],[52,5,53,5],[52,7,53,7],[52,9,53,9],[52,11,53,11],[50,13,51,13],[50,15,51,15],[50,17,51,17],[50,19,51,19],[50,21,51,21],[50,3,51,3],[50,5,51,5],[50,7,51,7],[50,9,51,9],[50,11,51,11],[48,13,49,13],[48,15,49,15],[48,17,49,17],[48,19,49,19],[48,21,49,21],[48,3,49,3],[48,5,49,5],[48,7,49,7],[48,9,49,9],[48,11,49,11],[46,15,47,15],[46,17,47,17],[46,19,47,19],[46,21,47,21],[46,3,47,3],[46,5,47,5],[46,7,47,7],[46,9,47,9],[46,11,47,11],[46,13,47,13],[44,13,45,13],[44,15,45,15],[44,17,45,17],[44,19,45,19],[44,21,45,21],[44,3,45,3],[44,5,45,5],[44,7,45,7],[44,9,45,9],[44,11,45,11],[42,13,43,13],[42,15,43,15],[42,17,43,17],[42,19,43,19],[42,21,43,21],[42,3,43,3],[42,5,43,5],[42,7,43,7],[42,9,43,9],[42,11,43,11],[40,13,41,13],[40,15,41,15],[40,17,41,17],[40,19,41,19],[40,21,41,21],[40,3,41,3],[40,5,41,5],[40,7,41,7],[40,9,41,9],[40,11,41,11],[38,13,39,13],[38,15,39,15],[38,17,39,17],[38,19,39,19],[38,21,39,21],[38,3,39,3],[38,5,39,5],[38,7,39,7],[38,9,39,9],[38,11,39,11],[36,13,37,13],[36,15,37,15],[36,17,37,17],[36,19,37,19],[36,21,37,21],[36,3,37,3],[36,5,37,5],[36,7,37,7],[36,9,37,9],[36,11,37,11],[10,2,10,3],[29,2,29,3],[30,2,30,3],[31,2,31,3],[32,2,32,3],[33,2,33,3],[10,4,10,5],[11,4,11,5],[12,4,12,5],[13,4,13,5],[14,4,14,5],[15,4,15,5],[16,4,16,5],[17,4,17,5],[18,4,18,5],[19,4,19,5],[20,4,20,5],[21,4,21,5],[22,4,22,5],[23,4,23,5],[24,4,24,5],[25,4,25,5],[26,4,26,5],[27,4,27,5],[3,12,4,13],[3,14,4,15],[3,16,4,17],[3,18,4,19],[3,20,4,21],[6,2,6,3],[7,2,7,3],[8,2,8,3],[9,2,9,3],[3,2,4,3],[3,4,4,5],[3,6,3,11],[4,6,4,7],[4,8,4,9],[4,10,4,11],[6,4,6,5],[7,4,7,5],[8,4,8,5],[9,4,9,5],[6,8,6,9],[7,8,7,9],[8,8,8,9],[9,8,9,9],[5,2,5,3],[35,20,35,21],[35,14,35,15],[22,2,22,3],[11,2,11,3],[12,2,12,3],[13,2,13,3],[14,2,14,3],[15,2,15,3],[16,2,16,3],[17,2,17,3],[18,2,18,3],[19,2,19,3],[20,2,20,3],[21,2,21,3],[34,2,34,3],[23,2,23,3],[24,2,24,3],[25,2,25,3],[26,2,26,3],[27,2,27,3],[28,2,28,3],[35,2,35,3],[35,4,35,5],[35,6,35,7],[5,4,5,5],[5,6,5,7],[5,8,5,9],[5,10,5,11],[5,12,5,13],[5,14,5,15],[5,16,5,17],[5,18,5,19],[35,12,35,13],[35,16,35,17],[35,18,35,19],[35,8,35,9],[35,10,35,11],[28,4,28,5],[29,4,29,5],[30,4,30,5],[31,4,31,5],[32,4,32,5],[33,4,33,5],[34,4,34,5],[6,6,6,7],[7,6,7,7],[8,6,8,7],[9,6,9,7]]}
[null,"Classe",null,"Equipe observée",null,null,null,null,null,null,null,null,null,null,"Advsersaire"]
[null,{"$f":"'4EQUIPES'!B2","v":"1TV"},null,{"$f":"'4EQUIPES'!B3","v":"VIOLET"},null,"score",{"$f":"$C$6*C37+$E$6*E37+G37*$G$6+M37*$M$6+O37*$O$6+S37*$S$6+$U$2+$U$3","v":0},"-",null,null,null,null,null,"score","VERT",null,null,null,null,"Nb de 3 PTS"]
[null,null,null,null,null,null,null,null,null,null,null,null,null,null,null,null,null,null,null,"Nb de lancers francs"]
[null,null,"FAUTE",null,"BALLON PERDU",null,"POSSESSION",null,null,null,null,null,"TIRS",null,"BONS TIRS",null,"PANIERS",null,"PANIERS",null,"% REUSSITE"]
[null,null,null,null,null,null,"RECUPERATION B",null,"BALLON PERDU",null,"RECUPERATION B"]
[null,null,-3,null,-1,null,null,null,null,null,null,null,1,null,3,null,null,null,6]
[null,1]
[null,2]
[null,3]
[null,4]
[null,5]
[null,6]
[null,7]
[null,8]
[null,9]
[null,10]
[null,11]
[null,12]
[null,13]
[null,14]
[null,15]
[null,16]
[null,17]
[null,18]
[null,19]
[null,20]
[null,21]
[null,22]
[null,23]
[null,24]
[null,25]
[null,26]
[null,27]
[null,28]
[null,29]
[null,30,null,null,null,null,{"$f":"(SUMPRODUCT(N(ISTEXT(C7:T35))))","v":0}]
[null,{"$f":"D2","v":"VIOLET"},{"$f":"(SUMPRODUCT(N(ISTEXT(C7:C36))))","v":0},null,{"$f":"(SUMPRODUCT(N(ISTEXT(E7:E36))))","v":0},null,{"$f":"(SUMPRODUCT(N(ISTEXT(G7:G36))))","v":0},null,{"$f":"(SUMPRODUCT(N(ISTEXT(I7:I36))))","v":0},null,{"$f":"(SUMPRODUCT(N(ISTEXT(K7:K36))))","v":0},null,{"$f":"(SUMPRODUCT(N(ISTEXT(M7:M36))))","v":0},null,{"$f":"(SUMPRODUCT(N(ISTEXT(O7:O36))))","v":0},null,{"$f":"(SUMPRODUCT(N(ISTEXT(Q7:Q36))))","v":0},null,{"$f":"(SUMPRODUCT(N(ISTEXT(S7:S36))))","v":0},null,{"$f":"IF(SUM(M37+O37+S37)=0,\"??\",S37/SUM(M37+O37+S37)*100)","v":"??"},null,{"$f":"B37","v":"VIOLET"}]
[null,{"$f":"G2","v":0},null,null,null,null,null,null,null,null,null,null,null,null,null,null,null,null,null,null,null,null,"<-Contrats "]
[null,{"$f":"'4EQUIPES'!B4","v":"Amira"},{"$f":"COUNTIF($C$7:$C$36,B39)","v":0},null,{"$f":"COUNTIF($E$7:$E$36,B39)","v":0},null,{"$f":"COUNTIF($G$7:$G$36,B39)","v":0},null,{"$f":"COUNTIF($I$7:$I$36,B39)","v":0},null,{"$f":"COUNTIF($K$7:$K$36,B39)","v":0},null,{"$f":"COUNTIF($M$7:$M$36,B39)","v":0},null,{"$f":"COUNTIF($O$7:$O$36,B39)","v":0},null,{"$f":"COUNTIF($Q$7:$Q$36,B39)","v":0},null,{"$f":"COUNTIF($S$7:$S$36,B39)","v":0},null,{"$f":"IF(SUM(M39+O39+S39)=0,\"??\",S39/SUM(M39+O39+S39)*100)","v":"??"},null,{"$f":"B39","v":"Amira"}]
[null,{"$f":"$C$6*C39+$E$6*E39+G39*$G$6+M39*$M$6+O39*$O$6+S39*$S$6","v":0},null,null,null,null,null,null,null,null,null,null,null,null,null,null,null,null,null,null,null,null,"<-Contrats "]
[null,{"$f":"'4EQUIPES'!B5","v":"Estelle"},{"$f":"COUNTIF($C$7:$C$36,B41)","v":0},null,{"$f":"COUNTIF($E$7:$E$36,B41)","v":0},null,{"$f":"COUNTIF($G$7:$G$36,B41)","v":0},null,null,null,{"$f":"COUNTIF($K$7:$K$36,B41)","v":0},null,{"$f":"COUNTIF($M$7:$M$36,B41)","v":0},null,{"$f":"COUNTIF($O$7:$O$36,B41)","v":0},null,{"$f":"COUNTIF($Q$7:$Q$36,B41)","v":0},null,{"$f":"COUNTIF($S$7:$S$36,B41)","v":0},null,{"$f":"IF(SUM(M41+O41+S41)=0,\"??\",S41/SUM(M41+O41+S41)*100)","v":"??"},null,{"$f":"B41","v":"Estelle"}]
[null,{"$f":"$C$6*C41+$E$6*E41+G41*$G$6+M41*$M$6+O41*$O$6+S41*$S$6","v":0},null,null,null,null,null,null,null,null,null,null,null,null,null,null,null,null,null,null,null,null,"<-Contrats "]
[null,{"$f":"'4EQUIPES'!B6","v":0},{"$f":"COUNTIF($C$7:$C$36,B43)","v":0},null,{"$f":"COUNTIF($E$7:$E$36,B43)","v":0},null,{"$f":"COUNTIF($G$7:$G$36,B43)","v":1},null,null,null,{"$f":"COUNTIF($K$7:$K$36,B43)","v":0},null,{"$f":"COUNTIF($M$7:$M$36,B43)","v":0},null,{"$f":"COUNTIF($O$7:$O$36,B43)","v":0},null,{"$f":"COUNTIF($Q$7:$Q$36,B43)","v":0},null,{"$f":"COUNTIF($S$7:$S$36,B43)","v":0},null,{"$f":"IF(SUM(M43+O43+S43)=0,\"??\",S43/SUM(M43+O43+S43)*100)","v":"??"},null,{"$f":"B43","v":0}]
[null,{"$f":"$C$6*C43+$E$6*E43+G43*$G$6+M43*$M$6+O43*$O$6+S43*$S$6","v":0},null,null,null,null,null,null,null,null,null,null,null,null,null,null,null,null,null,null,null,null,"<-Contrats "]
[null,{"$f":"'4EQUIPES'!B7","v":0},{"$f":"COUNTIF($C$7:$C$36,B45)","v":0},null,{"$f":"COUNTIF($E$7:$E$36,B45)","v":0},null,{"$f":"COUNTIF($G$7:$G$36,B45)","v":1},null,null,null,{"$f":"COUNTIF($K$7:$K$36,B45)","v":0},null,{"$f":"COUNTIF($M$7:$M$36,B45)","v":0},null,{"$f":"COUNTIF($O$7:$O$36,B45)","v":0},null,{"$f":"COUNTIF($Q$7:$Q$36,B45)","v":0},null,{"$f":"COUNTIF($S$7:$S$36,B45)","v":0},null,{"$f":"IF(SUM(M45+O45+S45)=0,\"??\",S45/SUM(M45+O45+S45)*100)","v":"??"},null,{"$f":"B45","v":0}]
[null,{"$f":"$C$6*C45+$E$6*E45+G45*$G$6+M45*$M$6+O45*$O$6+S45*$S$6","v":0},null,null,null,null,null,null,null,null,null,null,null,null,null,null,null,null,null,null,null,null,"<-Contrats "]
[null,{"$f":"'4EQUIPES'!B8","v":0},{"$f":"COUNTIF($C$7:$C$36,B47)","v":0},null,{"$f":"COUNTIF($E$7:$E$36,B47)","v":0},null,{"$f":"COUNTIF($G$7:$G$36,B47)","v":1},null,null,null,{"$f":"COUNTIF($K$7:$K$36,B47)","v":0},null,{"$f":"COUNTIF($M$7:$M$36,B47)","v":0},null,{"$f":"COUNTIF($O$7:$O$36,B47)","v":0},null,{"$f":"COUNTIF($Q$7:$Q$36,B47)","v":0},null,{"$f":"COUNTIF($S$7:$S$36,B47)","v":0},null,{"$f":"IF(SUM(M47+O47+S47)=0,\"??\",S47/SUM(M47+O47+S47)*100)","v":"??"},null,{"$f":"B47","v":0}]
[null,{"$f":"$C$6*C47+$E$6*E47+G47*$G$6+M47*$M$6+O47*$O$6+S47*$S$6","v":0},null,null,null,null,null,null,null,null,null,null,null,null,null,null,null,null,null,null,null,null,"<-Contrats "]
[null,{"$f":"'4EQUIPES'!B9","v":0},{"$f":"COUNTIF($C$7:$C$36,B49)","v":0},null,{"$f":"COUNTIF($E$7:$E$36,B49)","v":0},null,{"$f":"COUNTIF($G$7:$G$36,B49)","v":1},null,null,null,{"$f":"COUNTIF($K$7:$K$36,B49)","v":0},null,{"$f":"COUNTIF($M$7:$M$36,B49)","v":0},null,{"$f":"COUNTIF($O$7:$O$36,B49)","v":0},null,{"$f":"COUNTIF($Q$7:$Q$36,B49)","v":0},null,{"$f":"COUNTIF($S$7:$S$36,B49)","v":0},null,{"$f":"IF(SUM(M49+O49+S49)=0,\"??\",S49/SUM(M49+O49+S49)*100)","v":"??"},null,{"$f":"B49","v":0}]
[null,{"$f":"$C$6*C49+$E$6*E49+G49*$G$6+M49*$M$6+O49*$O$6+S49*$S$6","v":0},null,null,null,null,null,null,null,null,null,null,null,null,null,null,null,null,null,null,null,null,"<-Contrats "]
[null,{"$f":"'4EQUIPES'!B10","v":0},{"$f":"COUNTIF($C$7:$C$36,B51)","v":0},null,{"$f":"COUNTIF($E$7:$E$36,B51)","v":0},null,{"$f":"COUNTIF($G$7:$G$36,B51)","v":1},null,null,null,{"$f":"COUNTIF($K$7:$K$36,B51)","v":0},null,{"$f":"COUNTIF($M$7:$M$36,B51)","v":0},null,{"$f":"COUNTIF($O$7:$O$36,B51)","v":0},null,{"$f":"COUNTIF($Q$7:$Q$36,B51)","v":0},null,{"$f":"COUNTIF($S$7:$S$36,B51)","v":0},null,{"$f":"IF(SUM(M51+O51+S51)=0,\"??\",S51/SUM(M51+O51+S51)*100)","v":"??"},null,{"$f":"B51","v":0}]
[null,{"$f":"$C$6*C51+$E$6*E51+G51*$G$6+M51*$M$6+O51*$O$6+S51*$S$6","v":0},null,null,null,null,null,null,null,null,null,null,null,null,null,null,null,null,null,null,null,null,"<-Contrats "]
[null,{"$f":"'4EQUIPES'!B11","v":0},{"$f":"COUNTIF($C$7:$C$36,B53)","v":0},null,{"$f":"COUNTIF($E$7:$E$36,B53)","v":0},null,{"$f":"COUNTIF($G$7:$G$36,B53)","v":1},null,null,null,{"$f":"COUNTIF($K$7:$K$36,B53)","v":0},null,{"$f":"COUNTIF($M$7:$M$36,B53)","v":0},null,{"$f":"COUNTIF($O$7:$O$36,B53)","v":0},null,{"$f":"COUNTIF($Q$7:$Q$36,B53)","v":0},null,{"$f":"COUNTIF($S$7:$S$36,B53)","v":0},null,{"$f":"IF(SUM(M53+O53+S53)=0,\"??\",S53/SUM(M53+O53+S53)*100)","v":"??"},null,{"$f":"B53","v":0}]
[null,{"$f":"$C$6*C53+$E$6*E53+G53*$G$6+M53*$M$6+O53*$O$6+S53*$S$6","v":0},null,null,null,null,null,null,null,null,0,null,null,null,null,null,null,null,null,null,null,null,"<-Contrats "]
[]
[null,{"$f":"B37","v":"VIOLET"},{"$f":"C37","v":0},null,0,null,0,null,0,null,0,null,0,null,0,null,0,null,0,null,{"$f":"IF(SUM(M56+O56+S56)=0,\"??\",S56/SUM(M56+O56+S56)*100)","v":"??"}]
[null,"Contrats ->"]
[]
[null,"EQUIPE",{"$f":"CONCATENATE(C4,\" / POSSESSION\")","v":"FAUTE / POSSESSION"},null,{"$f":"CONCATENATE(E4,\" / POSSESSION\")","v":"BALLON PERDU / POSSESSION"},null,{"$f":"CONCATENATE(G5,\" / POSSESSION\")","v":"RECUPERATION B / POSSESSION"},null,{"$f":"CONCATENATE(I4,\" / POSSESSION\")","v":" / POSSESSION"},null,{"$f":"CONCATENATE(K4,\" / POSSESSION\")","v":" / POSSESSION"},null,{"$f":"CONCATENATE(M4,\" / POSSESSION\")","v":"TIRS / POSSESSION"},null,{"$f":"CONCATENATE(O4,\" / POSSESSION\")","v":"BONS TIRS / POSSESSION"},null,{"$f":"CONCATENATE(Q4,\" / POSSESSION\")","v":"PANIERS / POSSESSION"},null,{"$f":"CONCATENATE(S4,\" / POSSESSION\")","v":"PANIERS / POSSESSION"},null,"TIR REUSSI\n/TIR TENTE"]
[null,{"$f":"B56","v":"VIOLET"},null,{"$f":"C56/$G$36","v":{"$error":"#DIV/0!"}},null,{"$f":"E56/$G$36","v":{"$error":"#DIV/0!"}},null,{"$f":"G56/$G$36","v":{"$error":"#DIV/0!"}},null,null,{"$f":"K56/K36","v":{"$error":"#DIV/0!"}},null,null,{"$f":"M56/$G$36","v":{"$error":"#DIV/0!"}},null,{"$f":"O56/$G$36","v":{"$error":"#DIV/0!"}},null,null,null,{"$f":"S56/$G$36","v":{"$error":"#DIV/0!"}},null,{"$f":"U56","v":"??"}]
[null,"Contrats ->"]
[null,"PROFILS DE JEU ET SITUATIONS A TRAVAILLER"]
[null,null,"MON POINT FORT",null,"MON POINT FAIBLE",null,"JE VEUX TRAVAILLER …",null,null,null,"SITUATIONS A TRAVAILLER n°",null,"Nom de la situation A TRAVAILLER",null,null,null,null,null,"PROFIL DE JEU DE NOTRE EQUIPE",null,"Nom de la SITUATION A TRAVAILLER"]
[null,{"$f":"B39","v":"Amira"},"TIR",null,"DEFENSE INDIVIDUELLE",null,"PASSE",null,null,null,{"$f":"VLOOKUP(C64,#REF!,4,TRUE)","v":{"$error":"#REF!"}},null,{"$f":"VLOOKUP(G64,DEBUT!$R$3:$V$12,2,FALSE)","v":0},null,null,null,null,null,"Contre attaque",null,{"$f":"VLOOKUP(S64,DEBUT!R13:V26,2,FALSE)","v":0}]
[null,{"$f":"B41","v":"Estelle"},"PASSE",null,"DEFENSE INDIVIDUELLE",null,"TIR",null,null,null,{"$f":"VLOOKUP(C65,#REF!,4,TRUE)","v":{"$error":"#REF!"}},null,{"$f":"VLOOKUP(G65,DEBUT!$R$3:$V$12,2,FALSE)","v":0}]
[null,{"$f":"B43","v":0},null,null,"DEFENSE INDIVIDUELLE",null,"TIR",null,null,null,{"$f":"VLOOKUP(C66,#REF!,4,TRUE)","v":{"$error":"#REF!"}},null,{"$f":"VLOOKUP(G66,DEBUT!$R$3:$V$12,2,FALSE)","v":0}]
[null,{"$f":"B45","v":0},null,null,"DEFENSE INDIVIDUELLE",null,"TIR",null,null,null,{"$f":"VLOOKUP(C67,#REF!,4,TRUE)","v":{"$error":"#REF!"}},null,{"$f":"VLOOKUP(G67,DEBUT!$R$3:$V$12,2,FALSE)","v":0}]
[null,{"$f":"B47","v":0},null,null,"DEFENSE INDIVIDUELLE",null,"TIR",null,null,null,{"$f":"VLOOKUP(C68,#REF!,4,TRUE)","v":{"$error":"#REF!"}},null,{"$f":"VLOOKUP(G68,DEBUT!$R$3:$V$12,2,FALSE)","v":0}]
[null,{"$f":"B49","v":0},null,null,"DEFENSE INDIVIDUELLE",null,"TIR",null,null,null,{"$f":"VLOOKUP(C69,#REF!,4,TRUE)","v":{"$error":"#REF!"}},null,{"$f":"VLOOKUP(G69,DEBUT!$R$3:$V$12,2,FALSE)","v":0}]
[null,{"$f":"B51","v":0},null,null,"DEFENSE INDIVIDUELLE",null,"TIR",null,null,null,{"$f":"VLOOKUP(C70,#REF!,4,TRUE)","v":{"$error":"#REF!"}},null,{"$f":"VLOOKUP(G70,DEBUT!$R$3:$V$12,2,FALSE)","v":0}]
[null,{"$f":"B53","v":0},null,null,"DEFENSE INDIVIDUELLE",null,"TIR",null,null,null,{"$f":"VLOOKUP(C71,#REF!,4,TRUE)","v":{"$error":"#REF!"}},null,{"$f":"VLOOKUP(G71,DEBUT!$R$3:$V$12,2,FALSE)","v":0}]
[]
[null,null,null,"Le profil de jeu peut être choisi par l'élève à partir de l'analyse de ses stats ou alors à partir d'une formule du type : si TIR = 0 alors travailler SA1"]

{"sheet":"OBS2","index":6,"n_rows":73,"n_cols":23,"rows_kept":73,"cut":false,"hidden":false,"merged":[[67,12,67,14],[70,2,70,3],[70,4,70,5],[70,6,70,7],[70,10,70,11],[70,12,70,14],[68,2,68,3],[68,4,68,5],[68,6,68,7],[68,10,68,11],[68,12,68,14],[69,2,69,3],[69,4,69,5],[69,6,69,7],[69,10,69,11],[69,12,69,14],[65,2,65,3],[65,4,65,5],[65,6,65,7],[65,10,65,11],[65,12,65,14],[62,20,62,21],[63,2,63,3],[63,4,63,5],[63,6,63,7],[63,10,63,11],[63,12,63,14],[63,18,70,19],[63,20,70,21],[64,2,64,3],[64,4,64,5],[66,2,66,3],[66,4,66,5],[66,6,66,7],[66,10,66,11],[66,12,66,14],[67,2,67,3],[67,4,67,5],[67,6,67,7],[67,10,67,11],[61,1,61,21],[62,2,62,3],[62,4,62,5],[62,6,62,7],[62,10,62,11],[62,12,62,14],[62,18,62,19],[64,6,64,7],[64,10,64,11],[64,12,64,14],[58,20,58,21],[59,3,60,3],[59,5,60,5],[59,7,60,7],[59,9,60,9],[59,11,60,11],[59,13,60,13],[59,15,60,15],[59,17,60,17],[59,19,60,19],[59,21,60,21],[58,2,58,3],[58,4,58,5],[58,6,58,7],[58,8,58,9],[58,10,58,11],[58,12,58,13],[58,14,58,15],[58,16,58,17],[58,18,58,19],[52,21,53,21],[55,3,56,3],[55,5,56,5],[55,7,56,7],[55,9,56,9],[55,11,56,11],[55,13,56,13],[55,15,56,15],[55,17,56,17],[55,19,56,19],[55,21,56,21],[52,3,53,3],[52,5,53,5],[52,7,53,7],[52,9,53,9],[52,11,53,11],[52,13,53,13],[52,15,53,15],[52,17,53,17],[52,19,53,19],[48,21,49,21],[50,3,51,3],[50,5,51,5],[50,7,51,7],[50,9,51,9],[50,11,51,11],[50,13,51,13],[50,15,51,15],[50,17,51,17],[50,19,51,19],[50,21,51,21],[48,3,49,3],[48,5,49,5],[48,7,49,7],[48,9,49,9],[48,11,49,11],[48,13,49,13],[48,15,49,15],[48,17,49,17],[48,19,49,19],[44,21,45,21],[46,3,47,3],[46,5,47,5],[46,7,47,7],[46,9,47,9],[46,11,47,11],[46,13,47,13],[46,15,47,15],[46,17,47,17],[46,19,47,19],[46,21,47,21],[44,3,45,3],[44,5,45,5],[44,7,45,7],[44,9,45,9],[44,11,45,11],[44,13,45,13],[44,15,45,15],[44,17,45,17],[44,19,45,19],[40,21,41,21],[42,3,43,3],[42,5,43,5],[42,7,43,7],[42,9,43,9],[42,11,43,11],[42,13,43,13],[42,15,43,15],[42,17,43,17],[42,19,43,19],[42,21,43,21],[40,3,41,3],[40,5,41,5],[40,7,41,7],[40,9,41,9],[40,11,41,11],[40,13,41,13],[40,15,41,15],[40,17,41,17],[40,19,41,19],[36,21,37,21],[38,3,39,3],[38,5,39,5],[38,7,39,7],[38,9,39,9],[38,11,39,11],[38,13,39,13],[38,15,39,15],[38,17,39,17],[38,19,39,19],[38,21,39,21],[36,3,37,3],[36,5,37,5],[36,7,37,7],[36,9,37,9],[36,11,37,11],[36,13,37,13],[36,15,37,15],[36,17,37,17],[36,19,37,19],[34,20,34,21],[35,2,35,3],[35,4,35,5],[35,6,35,7],[35,8,35,9],[35,10,35,11],[35,12,35,13],[35,14,35,15],[35,16,35,17],[35,18,35,19],[35,20,35,21],[34,2,34,3],[34,4,34,5],[34,6,34,7],[34,8,34,9],[34,10,34,11],[34,12,34,13],[34,14,34,15],[34,16,34,17],[34,18,34,19],[32,20,32,21],[33,2,33,3],[33,4,33,5],[33,6,33,7],[33,8,33,9],[33,10,33,11],[33,12,33,13],[33,14,33,15],[33,16,33,17],[33,18,33,19],[33,20,33,21],[32,2,32,3],[32,4,32,5],[32,6,32,7],[32,8,32,9],[32,10,32,11],[32,12,32,13],[32,14,32,15],[32,16,32,17],[32,18,32,19],[30,20,30,21],[31,2,31,3],[31,4,31,5],[31,6,31,7],[31,8,31,9],[31,10,31,11],[31,12,31,13],[31,14,31,15],[31,16,31,17],[31,18,31,19],[31,20,31,21],[30,2,30,3],[30,4,30,5],[30,6,30,7],[30,8,30,9],[30,10,30,11],[30,12,30,13],[30,14,30,15],[30,16,30,17],[30,18,30,19],[28,20,28,21],[29,2,29,3],[29,4,29,5],[29,6,29,7],[29,8,29,9],[29,10,29,11],[29,12,29,13],[29,14,29,15],[29,16,29,17],[29,18,29,19],[29,20,29,21],[28,2,28,3],[28,4,28,5],[28,6,28,7],[28,8,28,9],[28,10,28,11],[28,12,28,13],[28,14,28,15],[28,16,28,17],[28,18,28,19],[26,20,26,21],[27,2,27,3],[27,4,27,5],[27,6,27,7],[27,8,27,9],[27,10,27,11],[27,12,27,13],[27,14,27,15],[27,16,27,17],[27,18,27,19],[27,20,27,21],[26,2,26,3],[26,4,26,5],[26,6,26,7],[26,8,26,9],[26,10,26,11],[26,12,26,13],[26,14,26,15],[26,16,26,17],[26,18,26,19],[24,20,24,21],[25,2,25,3],[25,4,25,5],[25,6,25,7],[25,8,25,9],[25,10,25,11],[25,12,25,13],[25,14,25,15],[25,16,25,17],[25,18,25,19],[25,20,25,21],[24,2,24,3],[24,4,24,5],[24,6,24,7],[24,8,24,9],[24,10,24,11],[24,12,24,13],[24,14,24,15],[24,16,24,17],[24,18,24,19],[22,20,22,21],[23,2,23,3],[23,4,23,5],[23,6,23,7],[23,8,23,9],[23,10,23,11],[23,12,23,13],[23,14,23,15],[23,16,23,17],[23,18,23,19],[23,20,23,21],[22,2,22,3],[22,4,22,5],[22,6,22,7],[22,8,22,9],[22,10,22,11],[22,12,22,13],[22,14,22,15],[22,16,22,17],[22,18,22,19],[20,20,20,21],[21,2,21,3],[21,4,21,5],[21,6,21,7],[21,8,21,9],[21,10,21,11],[21,12,21,13],[21,14,21,15],[21,16,21,17],[21,18,21,19],[21,20,21,21],[20,2,20,3],[20,4,20,5],[20,6,20,7],[20,8,20,9],[20,10,20,11],[20,12,20,13],[20,14,20,15],[20,16,20,17],[20,18,20,19],[18,20,18,21],[19,2,19,3],[19,4,19,5],[19,6,19,7],[19,8,19,9],[19,10,19,11],[19,12,19,13],[19,14,19,15],[19,16,19,17],[19,18,19,19],[19,20,19,21],[18,2,18,3],[18,4,18,5],[18,6,18,7],[18,8,18,9],[18,10,18,11],[18,12,18,13],[18,14,18,15],[18,16,18,17],[18,18,18,19],[16,20,16,21],[17,2,17,3],[17,4,17,5],[17,6,17,7],[17,8,17,9],[17,10,17,11],[17,12,17,13],[17,14,17,15],[17,16,17,17],[17,18,17,19],[17,20,17,21],[16,2,16,3],[16,4,16,5],[16,6,16,7],[16,8,16,9],[16,10,16,11],[16,12,16,13],[16,14,16,15],[16,16,16,17],[16,18,16,19],[14,20,14,21],[15,2,15,3],[15,4,15,5],[15,6,15,7],[15,8,15,9],[15,10,15,11],[15,12,15,13],[15,14,15,15],[15,16,15,17],[15,18,15,19],[15,20,15,21],[14,2,14,3],[14,4,14,5],[14,6,14,7],[14,8,14,9],[14,10,14,11],[14,12,14,13],[14,14,14,15],[14,16,14,17],[14,18,14,19],[12,20,12,21],[13,2,13,3],[13,4,13,5],[13,6,13,7],[13,8,13,9],[13,10,13,11],[13,12,13,13],[13,14,13,15],[13,16,13,17],[13,18,13,19],[13,20,13,21],[12,2,12,3],[12,4,12,5],[12,6,12,7],[12,8,12,9],[12,10,12,11],[12,12,12,13],[12,14,12,15],[12,16,12,17],[12,18,12,19],[10,20,10,21],[11,2,11,3],[11,4,11,5],[11,6,11,7],[11,8,11,9],[11,10,11,11],[11,12,11,13],[11,14,11,15],[11,16,11,17],[11,18,11,19],[11,20,11,21],[10,2,10,3],[10,4,10,5],[10,6,10,7],[10,8,10,9],[10,10,10,11],[10,12,10,13],[10,14,10,15],[10,16,10,17],[10,18,10,19],[8,20,8,21],[9,2,9,3],[9,4,9,5],[9,6,9,7],[9,8,9,9],[9,10,9,11],[9,12,9,13],[9,14,9,15],[9,16,9,17],[9,18,9,19],[9,20,9,21],[8,2,8,3],[8,4,8,5],[8,6,8,7],[8,8,8,9],[8,10,8,11],[8,12,8,13],[8,14,8,15],[8,16,8,17],[8,18,8,19],[6,20,6,21],[7,2,7,3],[7,4,7,5],[7,6,7,7],[7,8,7,9],[7,10,7,11],[7,12,7,13],[7,14,7,15],[7,16,7,17],[7,18,7,19],[7,20,7,21],[5,14,5,15],[5,16,5,17],[5,18,5,19],[6,2,6,3],[6,4,6,5],[6,6,6,7],[6,8,6,9],[6,10,6,11],[6,12,6,13],[6,14,6,15],[5,2,5,3],[5,4,5,5],[5,6,5,7],[5,8,5,9],[5,10,5,11],[5,12,5,13],[6,16,6,17],[6,18,6,19],[3,16,4,17],[3,18,4,19],[3,20,4,21],[4,6,4,7],[4,8,4,9],[4,10,4,11],[0,3,0,4],[0,14,0,15],[1,3,1,4],[1,14,1,15],[3,2,4,3],[3,4,4,5],[3,6,3,11],[3,12,4,13],[3,14,4,15]]}
[null,"Classe",null,"Equipe observée",null,null,null,null,null,null,null,null,null,null,"Advsersaire"]
[null,{"$f":"'4EQUIPES'!B2","v":"1TV"},null,{"$f":"'4EQUIPES'!F3","v":"BLANC"},null,"score",{"$f":"$C$6*C37+$E$6*E37+G37*$G$6+M37*$M$6+O37*$O$6+S37*$S$6+$U$2+$U$3","v":0},"-",null,null,null,null,null,"score","JAUNE",null,null,null,null,"Nb de 3 PTS"]
[null,null,null,null,null,null,null,null,null,null,null,null,null,null,null,null,null,null,null,"Nb de lancers francs"]
[null,null,"FAUTE",null,"BALLON PERDU",null,"POSSESSION",null,null,null,null,null,"TIRS",null,"BONS TIRS",null,"PANIERS",null,"PANIERS",null,"% REUSSITE"]
[null,null,null,null,null,null,"RECUPERATION B",null,"BALLON PERDU",null,"RECUPERATION B"]
[null,null,{"$f":"'OBS1'!C6:D6","v":-3},null,{"$f":"'OBS1'!E6:F6","v":-1},null,{"$f":"'OBS1'!G6:H6","v":0},null,{"$f":"'OBS1'!I6:J6","v":0},null,{"$f":"'OBS1'!K6:L6","v":0},null,{"$f":"'OBS1'!M6:N6","v":1},null,{"$f":"'OBS1'!O6:P6","v":3},null,{"$f":"'OBS1'!Q6:R6","v":0},null,{"$f":"'OBS1'!S6:T6","v":6}]
[null,1]
[null,2]
[null,3]
[null,4]
[null,5]
[null,6]
[null,7]
[null,8]
[null,9]
[null,10]
[null,11]
[null,12]
[null,13]
[null,14]
[null,15]
[null,16]
[null,17]
[null,18]
[null,19]
[null,20]
[null,21]
[null,22]
[null,23]
[null,24]
[null,25]
[null,26]
[null,27]
[null,28]
[null,29]
[null,30,null,null,null,null,{"$f":"(SUMPRODUCT(N(ISTEXT(C7:T35))))","v":0}]
[null,{"$f":"D2","v":"BLANC"},{"$f":"(SUMPRODUCT(N(ISTEXT(C7:C36))))","v":0},null,{"$f":"(SUMPRODUCT(N(ISTEXT(E7:E36))))","v":0},null,{"$f":"(SUMPRODUCT(N(ISTEXT(G7:G36))))","v":0},null,{"$f":"(SUMPRODUCT(N(ISTEXT(I7:I36))))","v":0},null,{"$f":"(SUMPRODUCT(N(ISTEXT(K7:K36))))","v":0},null,{"$f":"(SUMPRODUCT(N(ISTEXT(M7:M36))))","v":0},null,{"$f":"(SUMPRODUCT(N(ISTEXT(O7:O36))))","v":0},null,{"$f":"(SUMPRODUCT(N(ISTEXT(Q7:Q36))))","v":0},null,{"$f":"(SUMPRODUCT(N(ISTEXT(S7:S36))))","v":0},null,{"$f":"IF(SUM(M37+O37+S37)=0,\"??\",S37/SUM(M37+O37+S37)*100)","v":"??"},null,{"$f":"B37","v":"BLANC"}]
[null,{"$f":"G2","v":0},null,null,null,null,null,null,null,null,null,null,null,null,null,null,null,null,null,null,null,null,"<-Contrats "]
[null,{"$f":"ECHFMTELEVE!B4","v":"Amira"},{"$f":"COUNTIF($C$7:$C$36,B39)","v":0},null,{"$f":"COUNTIF($E$7:$E$36,B39)","v":0},null,{"$f":"COUNTIF($G$7:$G$36,B39)","v":0},null,{"$f":"COUNTIF($I$7:$I$36,B39)","v":0},null,{"$f":"COUNTIF($K$7:$K$36,B39)","v":0},null,{"$f":"COUNTIF($M$7:$M$36,B39)","v":0},null,{"$f":"COUNTIF($O$7:$O$36,B39)","v":0},null,{"$f":"COUNTIF($Q$7:$Q$36,B39)","v":0},null,{"$f":"COUNTIF($S$7:$S$36,B39)","v":0},null,{"$f":"IF(SUM(M39+O39+S39)=0,\"??\",S39/SUM(M39+O39+S39)*100)","v":"??"},null,{"$f":"B39","v":"Amira"}]
[null,{"$f":"$C$6*C39+$E$6*E39+G39*$G$6+M39*$M$6+O39*$O$6+S39*$S$6","v":0},null,null,null,null,null,null,null,null,null,null,null,null,null,null,null,null,null,null,null,null,"<-Contrats "]
[null,{"$f":"ECHFMTELEVE!B5","v":"Estelle"},{"$f":"COUNTIF($C$7:$C$36,B41)","v":0},null,{"$f":"COUNTIF($E$7:$E$36,B41)","v":0},null,{"$f":"COUNTIF($G$7:$G$36,B41)","v":0},null,null,null,{"$f":"COUNTIF($K$7:$K$36,B41)","v":0},null,{"$f":"COUNTIF($M$7:$M$36,B41)","v":0},null,{"$f":"COUNTIF($O$7:$O$36,B41)","v":0},null,{"$f":"COUNTIF($Q$7:$Q$36,B41)","v":0},null,{"$f":"COUNTIF($S$7:$S$36,B41)","v":0},null,{"$f":"IF(SUM(M41+O41+S41)=0,\"??\",S41/SUM(M41+O41+S41)*100)","v":"??"},null,{"$f":"B41","v":"Estelle"}]
[null,{"$f":"$C$6*C41+$E$6*E41+G41*$G$6+M41*$M$6+O41*$O$6+S41*$S$6","v":0},null,null,null,null,null,null,null,null,null,null,null,null,null,null,null,null,null,null,null,null,"<-Contrats "]
[null,{"$f":"ECHFMTELEVE!B6","v":0},{"$f":"COUNTIF($C$7:$C$36,B43)","v":0},null,{"$f":"COUNTIF($E$7:$E$36,B43)","v":0},null,{"$f":"COUNTIF($G$7:$G$36,B43)","v":1},null,null,null,{"$f":"COUNTIF($K$7:$K$36,B43)","v":0},null,{"$f":"COUNTIF($M$7:$M$36,B43)","v":0},null,{"$f":"COUNTIF($O$7:$O$36,B43)","v":0},null,{"$f":"COUNTIF($Q$7:$Q$36,B43)","v":0},null,{"$f":"COUNTIF($S$7:$S$36,B43)","v":0},null,{"$f":"IF(SUM(M43+O43+S43)=0,\"??\",S43/SUM(M43+O43+S43)*100)","v":"??"},null,{"$f":"B43","v":0}]
[null,{"$f":"$C$6*C43+$E$6*E43+G43*$G$6+M43*$M$6+O43*$O$6+S43*$S$6","v":0},null,null,null,null,null,null,null,null,null,null,null,null,null,null,null,null,null,null,null,null,"<-Contrats "]
[null,{"$f":"ECHFMTELEVE!B7","v":0},{"$f":"COUNTIF($C$7:$C$36,B45)","v":0},null,{"$f":"COUNTIF($E$7:$E$36,B45)","v":0},null,{"$f":"COUNTIF($G$7:$G$36,B45)","v":1},null,null,null,{"$f":"COUNTIF($K$7:$K$36,B45)","v":0},null,{"$f":"COUNTIF($M$7:$M$36,B45)","v":0},null,{"$f":"COUNTIF($O$7:$O$36,B45)","v":0},null,{"$f":"COUNTIF($Q$7:$Q$36,B45)","v":0},null,{"$f":"COUNTIF($S$7:$S$36,B45)","v":0},null,{"$f":"IF(SUM(M45+O45+S45)=0,\"??\",S45/SUM(M45+O45+S45)*100)","v":"??"},null,{"$f":"B45","v":0}]
[null,{"$f":"$C$6*C45+$E$6*E45+G45*$G$6+M45*$M$6+O45*$O$6+S45*$S$6","v":0},null,null,null,null,null,null,null,null,null,null,null,null,null,null,null,null,null,null,null,null,"<-Contrats "]
[null,{"$f":"ECHFMTELEVE!B8","v":0},{"$f":"COUNTIF($C$7:$C$36,B47)","v":0},null,{"$f":"COUNTIF($E$7:$E$36,B47)","v":0},null,{"$f":"COUNTIF($G$7:$G$36,B47)","v":1},null,null,null,{"$f":"COUNTIF($K$7:$K$36,B47)","v":0},null,{"$f":"COUNTIF($M$7:$M$36,B47)","v":0},null,{"$f":"COUNTIF($O$7:$O$36,B47)","v":0},null,{"$f":"COUNTIF($Q$7:$Q$36,B47)","v":0},null,{"$f":"COUNTIF($S$7:$S$36,B47)","v":0},null,{"$f":"IF(SUM(M47+O47+S47)=0,\"??\",S47/SUM(M47+O47+S47)*100)","v":"??"},null,{"$f":"B47","v":0}]
[null,{"$f":"$C$6*C47+$E$6*E47+G47*$G$6+M47*$M$6+O47*$O$6+S47*$S$6","v":0},null,null,null,null,null,null,null,null,null,null,null,null,null,null,null,null,null,null,null,null,"<-Contrats "]
[null,{"$f":"ECHFMTELEVE!B9","v":0},{"$f":"COUNTIF($C$7:$C$36,B49)","v":0},null,{"$f":"COUNTIF($E$7:$E$36,B49)","v":0},null,{"$f":"COUNTIF($G$7:$G$36,B49)","v":1},null,null,null,{"$f":"COUNTIF($K$7:$K$36,B49)","v":0},null,{"$f":"COUNTIF($M$7:$M$36,B49)","v":0},null,{"$f":"COUNTIF($O$7:$O$36,B49)","v":0},null,{"$f":"COUNTIF($Q$7:$Q$36,B49)","v":0},null,{"$f":"COUNTIF($S$7:$S$36,B49)","v":0},null,{"$f":"IF(SUM(M49+O49+S49)=0,\"??\",S49/SUM(M49+O49+S49)*100)","v":"??"},null,{"$f":"B49","v":0}]
[null,{"$f":"$C$6*C49+$E$6*E49+G49*$G$6+M49*$M$6+O49*$O$6+S49*$S$6","v":0},null,null,null,null,null,null,null,null,null,null,null,null,null,null,null,null,null,null,null,null,"<-Contrats "]
[null,{"$f":"ECHFMTELEVE!B10","v":0},{"$f":"COUNTIF($C$7:$C$36,B51)","v":0},null,{"$f":"COUNTIF($E$7:$E$36,B51)","v":0},null,{"$f":"COUNTIF($G$7:$G$36,B51)","v":1},null,null,null,{"$f":"COUNTIF($K$7:$K$36,B51)","v":0},null,{"$f":"COUNTIF($M$7:$M$36,B51)","v":0},null,{"$f":"COUNTIF($O$7:$O$36,B51)","v":0},null,{"$f":"COUNTIF($Q$7:$Q$36,B51)","v":0},null,{"$f":"COUNTIF($S$7:$S$36,B51)","v":0},null,{"$f":"IF(SUM(M51+O51+S51)=0,\"??\",S51/SUM(M51+O51+S51)*100)","v":"??"},null,{"$f":"B51","v":0}]
[null,{"$f":"$C$6*C51+$E$6*E51+G51*$G$6+M51*$M$6+O51*$O$6+S51*$S$6","v":0},null,null,null,null,null,null,null,null,null,null,null,null,null,null,null,null,null,null,null,null,"<-Contrats "]
[null,{"$f":"ECHFMTELEVE!B11","v":0},{"$f":"COUNTIF($C$7:$C$36,B53)","v":0},null,{"$f":"COUNTIF($E$7:$E$36,B53)","v":0},null,{"$f":"COUNTIF($G$7:$G$36,B53)","v":1},null,null,null,{"$f":"COUNTIF($K$7:$K$36,B53)","v":0},null,{"$f":"COUNTIF($M$7:$M$36,B53)","v":0},null,{"$f":"COUNTIF($O$7:$O$36,B53)","v":0},null,{"$f":"COUNTIF($Q$7:$Q$36,B53)","v":0},null,{"$f":"COUNTIF($S$7:$S$36,B53)","v":0},null,{"$f":"IF(SUM(M53+O53+S53)=0,\"??\",S53/SUM(M53+O53+S53)*100)","v":"??"},null,{"$f":"B53","v":0}]
[null,{"$f":"$C$6*C53+$E$6*E53+G53*$G$6+M53*$M$6+O53*$O$6+S53*$S$6","v":0},null,null,null,null,null,null,null,null,0,null,null,null,null,null,null,null,null,null,null,null,"<-Contrats "]
[]
[null,{"$f":"B37","v":"BLANC"},{"$f":"C37","v":0},null,0,null,0,null,0,null,0,null,0,null,0,null,0,null,0,null,{"$f":"IF(SUM(M56+O56+S56)=0,\"??\",S56/SUM(M56+O56+S56)*100)","v":"??"}]
[null,"Contrats ->"]
[]
[null,"EQUIPE",{"$f":"CONCATENATE(C4,\" / POSSESSION\")","v":"FAUTE / POSSESSION"},null,{"$f":"CONCATENATE(E4,\" / POSSESSION\")","v":"BALLON PERDU / POSSESSION"},null,{"$f":"CONCATENATE(G5,\" / POSSESSION\")","v":"RECUPERATION B / POSSESSION"},null,{"$f":"CONCATENATE(I4,\" / POSSESSION\")","v":" / POSSESSION"},null,{"$f":"CONCATENATE(K4,\" / POSSESSION\")","v":" / POSSESSION"},null,{"$f":"CONCATENATE(M4,\" / POSSESSION\")","v":"TIRS / POSSESSION"},null,{"$f":"CONCATENATE(O4,\" / POSSESSION\")","v":"BONS TIRS / POSSESSION"},null,{"$f":"CONCATENATE(Q4,\" / POSSESSION\")","v":"PANIERS / POSSESSION"},null,{"$f":"CONCATENATE(S4,\" / POSSESSION\")","v":"PANIERS / POSSESSION"},null,"TIR REUSSI\n/TIR TENTE"]
[null,{"$f":"B56","v":"BLANC"},null,{"$f":"C56/$G$36","v":{"$error":"#DIV/0!"}},null,{"$f":"E56/$G$36","v":{"$error":"#DIV/0!"}},null,{"$f":"G56/$G$36","v":{"$error":"#DIV/0!"}},null,null,{"$f":"K56/K36","v":{"$error":"#DIV/0!"}},null,null,{"$f":"M56/$G$36","v":{"$error":"#DIV/0!"}},null,{"$f":"O56/$G$36","v":{"$error":"#DIV/0!"}},null,null,null,{"$f":"S56/$G$36","v":{"$error":"#DIV/0!"}},null,{"$f":"U56","v":"??"}]
[null,"Contrats ->"]
[null,"PROFILS DE JEU ET SITUATIONS A TRAVAILLER"]
[null,null,"MON POINT FORT",null,"MON POINT FAIBLE",null,"JE VEUX TRAVAILLER …",null,null,null,"SITUATIONS A TRAVAILLER n°",null,"Nom de la situation A TRAVAILLER",null,null,null,null,null,"PROFIL DE JEU DE NOTRE EQUIPE",null,"Nom de la SITUATION A TRAVAILLER"]
[null,{"$f":"B39","v":"Amira"},"TIR",null,"DEFENSE INDIVIDUELLE",null,"PASSE",null,null,null,{"$f":"VLOOKUP(C64,#REF!,4,TRUE)","v":{"$error":"#REF!"}},null,{"$f":"VLOOKUP(G64,DEBUT!$R$3:$V$12,2,FALSE)","v":0},null,null,null,null,null,"Contre attaque",null,{"$f":"VLOOKUP(S64,DEBUT!R13:V26,2,FALSE)","v":0}]
[null,{"$f":"B41","v":"Estelle"},"PASSE",null,"DEFENSE INDIVIDUELLE",null,"TIR",null,null,null,{"$f":"VLOOKUP(C65,#REF!,4,TRUE)","v":{"$error":"#REF!"}},null,{"$f":"VLOOKUP(G65,DEBUT!$R$3:$V$12,2,FALSE)","v":0}]
[null,{"$f":"B43","v":0},null,null,"DEFENSE INDIVIDUELLE",null,"TIR",null,null,null,{"$f":"VLOOKUP(C66,#REF!,4,TRUE)","v":{"$error":"#REF!"}},null,{"$f":"VLOOKUP(G66,DEBUT!$R$3:$V$12,2,FALSE)","v":0}]
[null,{"$f":"B45","v":0},null,null,"DEFENSE INDIVIDUELLE",null,"TIR",null,null,null,{"$f":"VLOOKUP(C67,#REF!,4,TRUE)","v":{"$error":"#REF!"}},null,{"$f":"VLOOKUP(G67,DEBUT!$R$3:$V$12,2,FALSE)","v":0}]
[null,{"$f":"B47","v":0},null,null,"DEFENSE INDIVIDUELLE",null,"TIR",null,null,null,{"$f":"VLOOKUP(C68,#REF!,4,TRUE)","v":{"$error":"#REF!"}},null,{"$f":"VLOOKUP(G68,DEBUT!$R$3:$V$12,2,FALSE)","v":0}]
[null,{"$f":"B49","v":0},null,null,"DEFENSE INDIVIDUELLE",null,"TIR",null,null,null,{"$f":"VLOOKUP(C69,#REF!,4,TRUE)","v":{"$error":"#REF!"}},null,{"$f":"VLOOKUP(G69,DEBUT!$R$3:$V$12,2,FALSE)","v":0}]
[null,{"$f":"B51","v":0},null,null,"DEFENSE INDIVIDUELLE",null,"TIR",null,null,null,{"$f":"VLOOKUP(C70,#REF!,4,TRUE)","v":{"$error":"#REF!"}},null,{"$f":"VLOOKUP(G70,DEBUT!$R$3:$V$12,2,FALSE)","v":0}]
[null,{"$f":"B53","v":0},null,null,"DEFENSE INDIVIDUELLE",null,"TIR",null,null,null,{"$f":"VLOOKUP(C71,#REF!,4,TRUE)","v":{"$error":"#REF!"}},null,{"$f":"VLOOKUP(G71,DEBUT!$R$3:$V$12,2,FALSE)","v":0}]
[]
[null,null,null,"Le profil de jeu peut être choisi par l'élève à partir de l'analyse de ses stats ou alors à partir d'une formule du type : si TIR = 0 alors travailler SA1"]

{"sheet":"OBS3","index":7,"n_rows":73,"n_cols":23,"rows_kept":73,"cut":false,"hidden":false,"merged":[[67,12,67,14],[70,2,70,3],[70,4,70,5],[70,6,70,7],[70,10,70,11],[70,12,70,14],[68,2,68,3],[68,4,68,5],[68,6,68,7],[68,10,68,11],[68,12,68,14],[69,2,69,3],[69,4,69,5],[69,6,69,7],[69,10,69,11],[69,12,69,14],[65,2,65,3],[65,4,65,5],[65,6,65,7],[65,10,65,11],[65,12,65,14],[62,20,62,21],[63,2,63,3],[63,4,63,5],[63,6,63,7],[63,10,63,11],[63,12,63,14],[63,18,70,19],[63,20,70,21],[64,2,64,3],[64,4,64,5],[66,2,66,3],[66,4,66,5],[66,6,66,7],[66,10,66,11],[66,12,66,14],[67,2,67,3],[67,4,67,5],[67,6,67,7],[67,10,67,11],[61,1,61,21],[62,2,62,3],[62,4,62,5],[62,6,62,7],[62,10,62,11],[62,12,62,14],[62,18,62,19],[64,6,64,7],[64,10,64,11],[64,12,64,14],[58,20,58,21],[59,3,60,3],[59,5,60,5],[59,7,60,7],[59,9,60,9],[59,11,60,11],[59,13,60,13],[59,15,60,15],[59,17,60,17],[59,19,60,19],[59,21,60,21],[58,2,58,3],[58,4,58,5],[58,6,58,7],[58,8,58,9],[58,10,58,11],[58,12,58,13],[58,14,58,15],[58,16,58,17],[58,18,58,19],[52,21,53,21],[55,3,56,3],[55,5,56,5],[55,7,56,7],[55,9,56,9],[55,11,56,11],[55,13,56,13],[55,15,56,15],[55,17,56,17],[55,19,56,19],[55,21,56,21],[52,3,53,3],[52,5,53,5],[52,7,53,7],[52,9,53,9],[52,11,53,11],[52,13,53,13],[52,15,53,15],[52,17,53,17],[52,19,53,19],[48,21,49,21],[50,3,51,3],[50,5,51,5],[50,7,51,7],[50,9,51,9],[50,11,51,11],[50,13,51,13],[50,15,51,15],[50,17,51,17],[50,19,51,19],[50,21,51,21],[48,3,49,3],[48,5,49,5],[48,7,49,7],[48,9,49,9],[48,11,49,11],[48,13,49,13],[48,15,49,15],[48,17,49,17],[48,19,49,19],[44,21,45,21],[46,3,47,3],[46,5,47,5],[46,7,47,7],[46,9,47,9],[46,11,47,11],[46,13,47,13],[46,15,47,15],[46,17,47,17],[46,19,47,19],[46,21,47,21],[44,3,45,3],[44,5,45,5],[44,7,45,7],[44,9,45,9],[44,11,45,11],[44,13,45,13],[44,15,45,15],[44,17,45,17],[44,19,45,19],[40,21,41,21],[42,3,43,3],[42,5,43,5],[42,7,43,7],[42,9,43,9],[42,11,43,11],[42,13,43,13],[42,15,43,15],[42,17,43,17],[42,19,43,19],[42,21,43,21],[40,3,41,3],[40,5,41,5],[40,7,41,7],[40,9,41,9],[40,11,41,11],[40,13,41,13],[40,15,41,15],[40,17,41,17],[40,19,41,19],[36,21,37,21],[38,3,39,3],[38,5,39,5],[38,7,39,7],[38,9,39,9],[38,11,39,11],[38,13,39,13],[38,15,39,15],[38,17,39,17],[38,19,39,19],[38,21,39,21],[36,3,37,3],[36,5,37,5],[36,7,37,7],[36,9,37,9],[36,11,37,11],[36,13,37,13],[36,15,37,15],[36,17,37,17],[36,19,37,19],[34,20,34,21],[35,2,35,3],[35,4,35,5],[35,6,35,7],[35,8,35,9],[35,10,35,11],[35,12,35,13],[35,14,35,15],[35,16,35,17],[35,18,35,19],[35,20,35,21],[34,2,34,3],[34,4,34,5],[34,6,34,7],[34,8,34,9],[34,10,34,11],[34,12,34,13],[34,14,34,15],[34,16,34,17],[34,18,34,19],[32,20,32,21],[33,2,33,3],[33,4,33,5],[33,6,33,7],[33,8,33,9],[33,10,33,11],[33,12,33,13],[33,14,33,15],[33,16,33,17],[33,18,33,19],[33,20,33,21],[32,2,32,3],[32,4,32,5],[32,6,32,7],[32,8,32,9],[32,10,32,11],[32,12,32,13],[32,14,32,15],[32,16,32,17],[32,18,32,19],[30,20,30,21],[31,2,31,3],[31,4,31,5],[31,6,31,7],[31,8,31,9],[31,10,31,11],[31,12,31,13],[31,14,31,15],[31,16,31,17],[31,18,31,19],[31,20,31,21],[30,2,30,3],[30,4,30,5],[30,6,30,7],[30,8,30,9],[30,10,30,11],[30,12,30,13],[30,14,30,15],[30,16,30,17],[30,18,30,19],[28,20,28,21],[29,2,29,3],[29,4,29,5],[29,6,29,7],[29,8,29,9],[29,10,29,11],[29,12,29,13],[29,14,29,15],[29,16,29,17],[29,18,29,19],[29,20,29,21],[28,2,28,3],[28,4,28,5],[28,6,28,7],[28,8,28,9],[28,10,28,11],[28,12,28,13],[28,14,28,15],[28,16,28,17],[28,18,28,19],[26,20,26,21],[27,2,27,3],[27,4,27,5],[27,6,27,7],[27,8,27,9],[27,10,27,11],[27,12,27,13],[27,14,27,15],[27,16,27,17],[27,18,27,19],[27,20,27,21],[26,2,26,3],[26,4,26,5],[26,6,26,7],[26,8,26,9],[26,10,26,11],[26,12,26,13],[26,14,26,15],[26,16,26,17],[26,18,26,19],[24,20,24,21],[25,2,25,3],[25,4,25,5],[25,6,25,7],[25,8,25,9],[25,10,25,11],[25,12,25,13],[25,14,25,15],[25,16,25,17],[25,18,25,19],[25,20,25,21],[24,2,24,3],[24,4,24,5],[24,6,24,7],[24,8,24,9],[24,10,24,11],[24,12,24,13],[24,14,24,15],[24,16,24,17],[24,18,24,19],[22,20,22,21],[23,2,23,3],[23,4,23,5],[23,6,23,7],[23,8,23,9],[23,10,23,11],[23,12,23,13],[23,14,23,15],[23,16,23,17],[23,18,23,19],[23,20,23,21],[22,2,22,3],[22,4,22,5],[22,6,22,7],[22,8,22,9],[22,10,22,11],[22,12,22,13],[22,14,22,15],[22,16,22,17],[22,18,22,19],[20,20,20,21],[21,2,21,3],[21,4,21,5],[21,6,21,7],[21,8,21,9],[21,10,21,11],[21,12,21,13],[21,14,21,15],[21,16,21,17],[21,18,21,19],[21,20,21,21],[20,2,20,3],[20,4,20,5],[20,6,20,7],[20,8,20,9],[20,10,20,11],[20,12,20,13],[20,14,20,15],[20,16,20,17],[20,18,20,19],[18,20,18,21],[19,2,19,3],[19,4,19,5],[19,6,19,7],[19,8,19,9],[19,10,19,11],[19,12,19,13],[19,14,19,15],[19,16,19,17],[19,18,19,19],[19,20,19,21],[18,2,18,3],[18,4,18,5],[18,6,18,7],[18,8,18,9],[18,10,18,11],[18,12,18,13],[18,14,18,15],[18,16,18,17],[18,18,18,19],[16,20,16,21],[17,2,17,3],[17,4,17,5],[17,6,17,7],[17,8,17,9],[17,10,17,11],[17,12,17,13],[17,14,17,15],[17,16,17,17],[17,18,17,19],[17,20,17,21],[16,2,16,3],[16,4,16,5],[16,6,16,7],[16,8,16,9],[16,10,16,11],[16,12,16,13],[16,14,16,15],[16,16,16,17],[16,18,16,19],[14,20,14,21],[15,2,15,3],[15,4,15,5],[15,6,15,7],[15,8,15,9],[15,10,15,11],[15,12,15,13],[15,14,15,15],[15,16,15,17],[15,18,15,19],[15,20,15,21],[14,2,14,3],[14,4,14,5],[14,6,14,7],[14,8,14,9],[14,10,14,11],[14,12,14,13],[14,14,14,15],[14,16,14,17],[14,18,14,19],[12,20,12,21],[13,2,13,3],[13,4,13,5],[13,6,13,7],[13,8,13,9],[13,10,13,11],[13,12,13,13],[13,14,13,15],[13,16,13,17],[13,18,13,19],[13,20,13,21],[12,2,12,3],[12,4,12,5],[12,6,12,7],[12,8,12,9],[12,10,12,11],[12,12,12,13],[12,14,12,15],[12,16,12,17],[12,18,12,19],[10,20,10,21],[11,2,11,3],[11,4,11,5],[11,6,11,7],[11,8,11,9],[11,10,11,11],[11,12,11,13],[11,14,11,15],[11,16,11,17],[11,18,11,19],[11,20,11,21],[10,2,10,3],[10,4,10,5],[10,6,10,7],[10,8,10,9],[10,10,10,11],[10,12,10,13],[10,14,10,15],[10,16,10,17],[10,18,10,19],[8,20,8,21],[9,2,9,3],[9,4,9,5],[9,6,9,7],[9,8,9,9],[9,10,9,11],[9,12,9,13],[9,14,9,15],[9,16,9,17],[9,18,9,19],[9,20,9,21],[8,2,8,3],[8,4,8,5],[8,6,8,7],[8,8,8,9],[8,10,8,11],[8,12,8,13],[8,14,8,15],[8,16,8,17],[8,18,8,19],[6,20,6,21],[7,2,7,3],[7,4,7,5],[7,6,7,7],[7,8,7,9],[7,10,7,11],[7,12,7,13],[7,14,7,15],[7,16,7,17],[7,18,7,19],[7,20,7,21],[5,14,5,15],[5,16,5,17],[5,18,5,19],[6,2,6,3],[6,4,6,5],[6,6,6,7],[6,8,6,9],[6,10,6,11],[6,12,6,13],[6,14,6,15],[5,2,5,3],[5,4,5,5],[5,6,5,7],[5,8,5,9],[5,10,5,11],[5,12,5,13],[6,16,6,17],[6,18,6,19],[3,16,4,17],[3,18,4,19],[3,20,4,21],[4,6,4,7],[4,8,4,9],[4,10,4,11],[0,3,0,4],[0,14,0,15],[1,3,1,4],[1,14,1,15],[3,2,4,3],[3,4,4,5],[3,6,3,11],[3,12,4,13],[3,14,4,15]]}
[null,"Classe",null,"Equipe observée",null,null,null,null,null,null,null,null,null,null,"Advsersaire"]
[null,{"$f":"'4EQUIPES'!B2","v":"1TV"},null,{"$f":"'4EQUIPES'!J3","v":"ORANGE"},null,"score",{"$f":"$C$6*C37+$E$6*E37+G37*$G$6+M37*$M$6+O37*$O$6+S37*$S$6+$U$2+$U$3","v":0},"-",null,null,null,null,null,"score","ROUGE",null,null,null,null,"Nb de 3 PTS"]
[null,null,null,null,null,null,null,null,null,null,null,null,null,null,null,null,null,null,null,"Nb de lancers francs"]
[null,null,"FAUTE",null,"BALLON PERDU",null,"POSSESSION",null,null,null,null,null,"TIRS",null,"BONS TIRS",null,"PANIERS",null,"PANIERS",null,"% REUSSITE"]
[null,null,null,null,null,null,"RECUPERATION B",null,"BALLON PERDU",null,"RECUPERATION B"]
[null,null,{"$f":"'OBS1'!C6:D6","v":-3},null,{"$f":"'OBS1'!E6:F6","v":-1},null,{"$f":"'OBS1'!G6:H6","v":0},null,{"$f":"'OBS1'!I6:J6","v":0},null,{"$f":"'OBS1'!K6:L6","v":0},null,{"$f":"'OBS1'!M6:N6","v":1},null,{"$f":"'OBS1'!O6:P6","v":3},null,{"$f":"'OBS1'!Q6:R6","v":0},null,{"$f":"'OBS1'!S6:T6","v":6}]
[null,1]
[null,2]
[null,3]
[null,4]
[null,5]
[null,6]
[null,7]
[null,8]
[null,9]
[null,10]
[null,11]
[null,12]
[null,13]
[null,14]
[null,15]
[null,16]
[null,17]
[null,18]
[null,19]
[null,20]
[null,21]
[null,22]
[null,23]
[null,24]
[null,25]
[null,26]
[null,27]
[null,28]
[null,29]
[null,30,null,null,null,null,{"$f":"(SUMPRODUCT(N(ISTEXT(C7:T35))))","v":0}]
[null,{"$f":"D2","v":"ORANGE"},{"$f":"(SUMPRODUCT(N(ISTEXT(C7:C36))))","v":0},null,{"$f":"(SUMPRODUCT(N(ISTEXT(E7:E36))))","v":0},null,{"$f":"(SUMPRODUCT(N(ISTEXT(G7:G36))))","v":0},null,{"$f":"(SUMPRODUCT(N(ISTEXT(I7:I36))))","v":0},null,{"$f":"(SUMPRODUCT(N(ISTEXT(K7:K36))))","v":0},null,{"$f":"(SUMPRODUCT(N(ISTEXT(M7:M36))))","v":0},null,{"$f":"(SUMPRODUCT(N(ISTEXT(O7:O36))))","v":0},null,{"$f":"(SUMPRODUCT(N(ISTEXT(Q7:Q36))))","v":0},null,{"$f":"(SUMPRODUCT(N(ISTEXT(S7:S36))))","v":0},null,{"$f":"IF(SUM(M37+O37+S37)=0,\"??\",S37/SUM(M37+O37+S37)*100)","v":"??"},null,{"$f":"B37","v":"ORANGE"}]
[null,{"$f":"G2","v":0},null,null,null,null,null,null,null,null,null,null,null,null,null,null,null,null,null,null,null,null,"<-Contrats "]
[null,{"$f":"ECHFMTELEVE!B4","v":"Amira"},{"$f":"COUNTIF($C$7:$C$36,B39)","v":0},null,{"$f":"COUNTIF($E$7:$E$36,B39)","v":0},null,{"$f":"COUNTIF($G$7:$G$36,B39)","v":0},null,{"$f":"COUNTIF($I$7:$I$36,B39)","v":0},null,{"$f":"COUNTIF($K$7:$K$36,B39)","v":0},null,{"$f":"COUNTIF($M$7:$M$36,B39)","v":0},null,{"$f":"COUNTIF($O$7:$O$36,B39)","v":0},null,{"$f":"COUNTIF($Q$7:$Q$36,B39)","v":0},null,{"$f":"COUNTIF($S$7:$S$36,B39)","v":0},null,{"$f":"IF(SUM(M39+O39+S39)=0,\"??\",S39/SUM(M39+O39+S39)*100)","v":"??"},null,{"$f":"B39","v":"Amira"}]
[null,{"$f":"$C$6*C39+$E$6*E39+G39*$G$6+M39*$M$6+O39*$O$6+S39*$S$6","v":0},null,null,null,null,null,null,null,null,null,null,null,null,null,null,null,null,null,null,null,null,"<-Contrats "]
[null,{"$f":"ECHFMTELEVE!B5","v":"Estelle"},{"$f":"COUNTIF($C$7:$C$36,B41)","v":0},null,{"$f":"COUNTIF($E$7:$E$36,B41)","v":0},null,{"$f":"COUNTIF($G$7:$G$36,B41)","v":0},null,null,null,{"$f":"COUNTIF($K$7:$K$36,B41)","v":0},null,{"$f":"COUNTIF($M$7:$M$36,B41)","v":0},null,{"$f":"COUNTIF($O$7:$O$36,B41)","v":0},null,{"$f":"COUNTIF($Q$7:$Q$36,B41)","v":0},null,{"$f":"COUNTIF($S$7:$S$36,B41)","v":0},null,{"$f":"IF(SUM(M41+O41+S41)=0,\"??\",S41/SUM(M41+O41+S41)*100)","v":"??"},null,{"$f":"B41","v":"Estelle"}]
[null,{"$f":"$C$6*C41+$E$6*E41+G41*$G$6+M41*$M$6+O41*$O$6+S41*$S$6","v":0},null,null,null,null,null,null,null,null,null,null,null,null,null,null,null,null,null,null,null,null,"<-Contrats "]
[null,{"$f":"ECHFMTELEVE!B6","v":0},{"$f":"COUNTIF($C$7:$C$36,B43)","v":0},null,{"$f":"COUNTIF($E$7:$E$36,B43)","v":0},null,{"$f":"COUNTIF($G$7:$G$36,B43)","v":1},null,null,null,{"$f":"COUNTIF($K$7:$K$36,B43)","v":0},null,{"$f":"COUNTIF($M$7:$M$36,B43)","v":0},null,{"$f":"COUNTIF($O$7:$O$36,B43)","v":0},null,{"$f":"COUNTIF($Q$7:$Q$36,B43)","v":0},null,{"$f":"COUNTIF($S$7:$S$36,B43)","v":0},null,{"$f":"IF(SUM(M43+O43+S43)=0,\"??\",S43/SUM(M43+O43+S43)*100)","v":"??"},null,{"$f":"B43","v":0}]
[null,{"$f":"$C$6*C43+$E$6*E43+G43*$G$6+M43*$M$6+O43*$O$6+S43*$S$6","v":0},null,null,null,null,null,null,null,null,null,null,null,null,null,null,null,null,null,null,null,null,"<-Contrats "]
[null,{"$f":"ECHFMTELEVE!B7","v":0},{"$f":"COUNTIF($C$7:$C$36,B45)","v":0},null,{"$f":"COUNTIF($E$7:$E$36,B45)","v":0},null,{"$f":"COUNTIF($G$7:$G$36,B45)","v":1},null,null,null,{"$f":"COUNTIF($K$7:$K$36,B45)","v":0},null,{"$f":"COUNTIF($M$7:$M$36,B45)","v":0},null,{"$f":"COUNTIF($O$7:$O$36,B45)","v":0},null,{"$f":"COUNTIF($Q$7:$Q$36,B45)","v":0},null,{"$f":"COUNTIF($S$7:$S$36,B45)","v":0},null,{"$f":"IF(SUM(M45+O45+S45)=0,\"??\",S45/SUM(M45+O45+S45)*100)","v":"??"},null,{"$f":"B45","v":0}]
[null,{"$f":"$C$6*C45+$E$6*E45+G45*$G$6+M45*$M$6+O45*$O$6+S45*$S$6","v":0},null,null,null,null,null,null,null,null,null,null,null,null,null,null,null,null,null,null,null,null,"<-Contrats "]
[null,{"$f":"ECHFMTELEVE!B8","v":0},{"$f":"COUNTIF($C$7:$C$36,B47)","v":0},null,{"$f":"COUNTIF($E$7:$E$36,B47)","v":0},null,{"$f":"COUNTIF($G$7:$G$36,B47)","v":1},null,null,null,{"$f":"COUNTIF($K$7:$K$36,B47)","v":0},null,{"$f":"COUNTIF($M$7:$M$36,B47)","v":0},null,{"$f":"COUNTIF($O$7:$O$36,B47)","v":0},null,{"$f":"COUNTIF($Q$7:$Q$36,B47)","v":0},null,{"$f":"COUNTIF($S$7:$S$36,B47)","v":0},null,{"$f":"IF(SUM(M47+O47+S47)=0,\"??\",S47/SUM(M47+O47+S47)*100)","v":"??"},null,{"$f":"B47","v":0}]
[null,{"$f":"$C$6*C47+$E$6*E47+G47*$G$6+M47*$M$6+O47*$O$6+S47*$S$6","v":0},null,null,null,null,null,null,null,null,null,null,null,null,null,null,null,null,null,null,null,null,"<-Contrats "]
[null,{"$f":"ECHFMTELEVE!B9","v":0},{"$f":"COUNTIF($C$7:$C$36,B49)","v":0},null,{"$f":"COUNTIF($E$7:$E$36,B49)","v":0},null,{"$f":"COUNTIF($G$7:$G$36,B49)","v":1},null,null,null,{"$f":"COUNTIF($K$7:$K$36,B49)","v":0},null,{"$f":"COUNTIF($M$7:$M$36,B49)","v":0},null,{"$f":"COUNTIF($O$7:$O$36,B49)","v":0},null,{"$f":"COUNTIF($Q$7:$Q$36,B49)","v":0},null,{"$f":"COUNTIF($S$7:$S$36,B49)","v":0},null,{"$f":"IF(SUM(M49+O49+S49)=0,\"??\",S49/SUM(M49+O49+S49)*100)","v":"??"},null,{"$f":"B49","v":0}]
[null,{"$f":"$C$6*C49+$E$6*E49+G49*$G$6+M49*$M$6+O49*$O$6+S49*$S$6","v":0},null,null,null,null,null,null,null,null,null,null,null,null,null,null,null,null,null,null,null,null,"<-Contrats "]
[null,{"$f":"ECHFMTELEVE!B10","v":0},{"$f":"COUNTIF($C$7:$C$36,B51)","v":0},null,{"$f":"COUNTIF($E$7:$E$36,B51)","v":0},null,{"$f":"COUNTIF($G$7:$G$36,B51)","v":1},null,null,null,{"$f":"COUNTIF($K$7:$K$36,B51)","v":0},null,{"$f":"COUNTIF($M$7:$M$36,B51)","v":0},null,{"$f":"COUNTIF($O$7:$O$36,B51)","v":0},null,{"$f":"COUNTIF($Q$7:$Q$36,B51)","v":0},null,{"$f":"COUNTIF($S$7:$S$36,B51)","v":0},null,{"$f":"IF(SUM(M51+O51+S51)=0,\"??\",S51/SUM(M51+O51+S51)*100)","v":"??"},null,{"$f":"B51","v":0}]
[null,{"$f":"$C$6*C51+$E$6*E51+G51*$G$6+M51*$M$6+O51*$O$6+S51*$S$6","v":0},null,null,null,null,null,null,null,null,null,null,null,null,null,null,null,null,null,null,null,null,"<-Contrats "]
[null,{"$f":"ECHFMTELEVE!B11","v":0},{"$f":"COUNTIF($C$7:$C$36,B53)","v":0},null,{"$f":"COUNTIF($E$7:$E$36,B53)","v":0},null,{"$f":"COUNTIF($G$7:$G$36,B53)","v":1},null,null,null,{"$f":"COUNTIF($K$7:$K$36,B53)","v":0},null,{"$f":"COUNTIF($M$7:$M$36,B53)","v":0},null,{"$f":"COUNTIF($O$7:$O$36,B53)","v":0},null,{"$f":"COUNTIF($Q$7:$Q$36,B53)","v":0},null,{"$f":"COUNTIF($S$7:$S$36,B53)","v":0},null,{"$f":"IF(SUM(M53+O53+S53)=0,\"??\",S53/SUM(M53+O53+S53)*100)","v":"??"},null,{"$f":"B53","v":0}]
[null,{"$f":"$C$6*C53+$E$6*E53+G53*$G$6+M53*$M$6+O53*$O$6+S53*$S$6","v":0},null,null,null,null,null,null,null,null,0,null,null,null,null,null,null,null,null,null,null,null,"<-Contrats "]
[]
[null,{"$f":"B37","v":"ORANGE"},{"$f":"C37","v":0},null,0,null,0,null,0,null,0,null,0,null,0,null,0,null,0,null,{"$f":"IF(SUM(M56+O56+S56)=0,\"??\",S56/SUM(M56+O56+S56)*100)","v":"??"}]
[null,"Contrats ->"]
[]
[null,"EQUIPE",{"$f":"CONCATENATE(C4,\" / POSSESSION\")","v":"FAUTE / POSSESSION"},null,{"$f":"CONCATENATE(E4,\" / POSSESSION\")","v":"BALLON PERDU / POSSESSION"},null,{"$f":"CONCATENATE(G5,\" / POSSESSION\")","v":"RECUPERATION B / POSSESSION"},null,{"$f":"CONCATENATE(I4,\" / POSSESSION\")","v":" / POSSESSION"},null,{"$f":"CONCATENATE(K4,\" / POSSESSION\")","v":" / POSSESSION"},null,{"$f":"CONCATENATE(M4,\" / POSSESSION\")","v":"TIRS / POSSESSION"},null,{"$f":"CONCATENATE(O4,\" / POSSESSION\")","v":"BONS TIRS / POSSESSION"},null,{"$f":"CONCATENATE(Q4,\" / POSSESSION\")","v":"PANIERS / POSSESSION"},null,{"$f":"CONCATENATE(S4,\" / POSSESSION\")","v":"PANIERS / POSSESSION"},null,"TIR REUSSI\n/TIR TENTE"]
[null,{"$f":"B56","v":"ORANGE"},null,{"$f":"C56/$G$36","v":{"$error":"#DIV/0!"}},null,{"$f":"E56/$G$36","v":{"$error":"#DIV/0!"}},null,{"$f":"G56/$G$36","v":{"$error":"#DIV/0!"}},null,null,{"$f":"K56/K36","v":{"$error":"#DIV/0!"}},null,null,{"$f":"M56/$G$36","v":{"$error":"#DIV/0!"}},null,{"$f":"O56/$G$36","v":{"$error":"#DIV/0!"}},null,null,null,{"$f":"S56/$G$36","v":{"$error":"#DIV/0!"}},null,{"$f":"U56","v":"??"}]
[null,"Contrats ->"]
[null,"PROFILS DE JEU ET SITUATIONS A TRAVAILLER"]
[null,null,"MON POINT FORT",null,"MON POINT FAIBLE",null,"JE VEUX TRAVAILLER …",null,null,null,"SITUATIONS A TRAVAILLER n°",null,"Nom de la situation A TRAVAILLER",null,null,null,null,null,"PROFIL DE JEU DE NOTRE EQUIPE",null,"Nom de la SITUATION A TRAVAILLER"]
[null,{"$f":"B39","v":"Amira"},"TIR",null,"DEFENSE INDIVIDUELLE",null,"PASSE",null,null,null,{"$f":"VLOOKUP(C64,#REF!,4,TRUE)","v":{"$error":"#REF!"}},null,{"$f":"VLOOKUP(G64,DEBUT!$R$3:$V$12,2,FALSE)","v":0},null,null,null,null,null,"Contre attaque",null,{"$f":"VLOOKUP(S64,DEBUT!R13:V26,2,FALSE)","v":0}]
[null,{"$f":"B41","v":"Estelle"},"PASSE",null,"DEFENSE INDIVIDUELLE",null,"TIR",null,null,null,{"$f":"VLOOKUP(C65,#REF!,4,TRUE)","v":{"$error":"#REF!"}},null,{"$f":"VLOOKUP(G65,DEBUT!$R$3:$V$12,2,FALSE)","v":0}]
[null,{"$f":"B43","v":0},null,null,"DEFENSE INDIVIDUELLE",null,"TIR",null,null,null,{"$f":"VLOOKUP(C66,#REF!,4,TRUE)","v":{"$error":"#REF!"}},null,{"$f":"VLOOKUP(G66,DEBUT!$R$3:$V$12,2,FALSE)","v":0}]
[null,{"$f":"B45","v":0},null,null,"DEFENSE INDIVIDUELLE",null,"TIR",null,null,null,{"$f":"VLOOKUP(C67,#REF!,4,TRUE)","v":{"$error":"#REF!"}},null,{"$f":"VLOOKUP(G67,DEBUT!$R$3:$V$12,2,FALSE)","v":0}]
[null,{"$f":"B47","v":0},null,null,"DEFENSE INDIVIDUELLE",null,"TIR",null,null,null,{"$f":"VLOOKUP(C68,#REF!,4,TRUE)","v":{"$error":"#REF!"}},null,{"$f":"VLOOKUP(G68,DEBUT!$R$3:$V$12,2,FALSE)","v":0}]
[null,{"$f":"B49","v":0},null,null,"DEFENSE INDIVIDUELLE",null,"TIR",null,null,null,{"$f":"VLOOKUP(C69,#REF!,4,TRUE)","v":{"$error":"#REF!"}},null,{"$f":"VLOOKUP(G69,DEBUT!$R$3:$V$12,2,FALSE)","v":0}]
[null,{"$f":"B51","v":0},null,null,"DEFENSE INDIVIDUELLE",null,"TIR",null,null,null,{"$f":"VLOOKUP(C70,#REF!,4,TRUE)","v":{"$error":"#REF!"}},null,{"$f":"VLOOKUP(G70,DEBUT!$R$3:$V$12,2,FALSE)","v":0}]
[null,{"$f":"B53","v":0},null,null,"DEFENSE INDIVIDUELLE",null,"TIR",null,null,null,{"$f":"VLOOKUP(C71,#REF!,4,TRUE)","v":{"$error":"#REF!"}},null,{"$f":"VLOOKUP(G71,DEBUT!$R$3:$V$12,2,FALSE)","v":0}]
[]
[null,null,null,"Le profil de jeu peut être choisi par l'élève à partir de l'analyse de ses stats ou alors à partir d'une formule du type : si TIR = 0 alors travailler SA1"]

{"sheet":"OBS4","index":8,"n_rows":73,"n_cols":23,"rows_kept":73,"cut":false,"hidden":false,"merged":[[67,12,67,14],[70,2,70,3],[70,4,70,5],[70,6,70,7],[70,10,70,11],[70,12,70,14],[68,2,68,3],[68,4,68,5],[68,6,68,7],[68,10,68,11],[68,12,68,14],[69,2,69,3],[69,4,69,5],[69,6,69,7],[69,10,69,11],[69,12,69,14],[65,2,65,3],[65,4,65,5],[65,6,65,7],[65,10,65,11],[65,12,65,14],[62,20,62,21],[63,2,63,3],[63,4,63,5],[63,6,63,7],[63,10,63,11],[63,12,63,14],[63,18,70,19],[63,20,70,21],[64,2,64,3],[64,4,64,5],[66,2,66,3],[66,4,66,5],[66,6,66,7],[66,10,66,11],[66,12,66,14],[67,2,67,3],[67,4,67,5],[67,6,67,7],[67,10,67,11],[61,1,61,21],[62,2,62,3],[62,4,62,5],[62,6,62,7],[62,10,62,11],[62,12,62,14],[62,18,62,19],[64,6,64,7],[64,10,64,11],[64,12,64,14],[58,20,58,21],[59,3,60,3],[59,5,60,5],[59,7,60,7],[59,9,60,9],[59,11,60,11],[59,13,60,13],[59,15,60,15],[59,17,60,17],[59,19,60,19],[59,21,60,21],[58,2,58,3],[58,4,58,5],[58,6,58,7],[58,8,58,9],[58,10,58,11],[58,12,58,13],[58,14,58,15],[58,16,58,17],[58,18,58,19],[52,21,53,21],[55,3,56,3],[55,5,56,5],[55,7,56,7],[55,9,56,9],[55,11,56,11],[55,13,56,13],[55,15,56,15],[55,17,56,17],[55,19,56,19],[55,21,56,21],[52,3,53,3],[52,5,53,5],[52,7,53,7],[52,9,53,9],[52,11,53,11],[52,13,53,13],[52,15,53,15],[52,17,53,17],[52,19,53,19],[48,21,49,21],[50,3,51,3],[50,5,51,5],[50,7,51,7],[50,9,51,9],[50,11,51,11],[50,13,51,13],[50,15,51,15],[50,17,51,17],[50,19,51,19],[50,21,51,21],[48,3,49,3],[48,5,49,5],[48,7,49,7],[48,9,49,9],[48,11,49,11],[48,13,49,13],[48,15,49,15],[48,17,49,17],[48,19,49,19],[44,21,45,21],[46,3,47,3],[46,5,47,5],[46,7,47,7],[46,9,47,9],[46,11,47,11],[46,13,47,13],[46,15,47,15],[46,17,47,17],[46,19,47,19],[46,21,47,21],[44,3,45,3],[44,5,45,5],[44,7,45,7],[44,9,45,9],[44,11,45,11],[44,13,45,13],[44,15,45,15],[44,17,45,17],[44,19,45,19],[40,21,41,21],[42,3,43,3],[42,5,43,5],[42,7,43,7],[42,9,43,9],[42,11,43,11],[42,13,43,13],[42,15,43,15],[42,17,43,17],[42,19,43,19],[42,21,43,21],[40,3,41,3],[40,5,41,5],[40,7,41,7],[40,9,41,9],[40,11,41,11],[40,13,41,13],[40,15,41,15],[40,17,41,17],[40,19,41,19],[36,21,37,21],[38,3,39,3],[38,5,39,5],[38,7,39,7],[38,9,39,9],[38,11,39,11],[38,13,39,13],[38,15,39,15],[38,17,39,17],[38,19,39,19],[38,21,39,21],[36,3,37,3],[36,5,37,5],[36,7,37,7],[36,9,37,9],[36,11,37,11],[36,13,37,13],[36,15,37,15],[36,17,37,17],[36,19,37,19],[34,20,34,21],[35,2,35,3],[35,4,35,5],[35,6,35,7],[35,8,35,9],[35,10,35,11],[35,12,35,13],[35,14,35,15],[35,16,35,17],[35,18,35,19],[35,20,35,21],[34,2,34,3],[34,4,34,5],[34,6,34,7],[34,8,34,9],[34,10,34,11],[34,12,34,13],[34,14,34,15],[34,16,34,17],[34,18,34,19],[32,20,32,21],[33,2,33,3],[33,4,33,5],[33,6,33,7],[33,8,33,9],[33,10,33,11],[33,12,33,13],[33,14,33,15],[33,16,33,17],[33,18,33,19],[33,20,33,21],[32,2,32,3],[32,4,32,5],[32,6,32,7],[32,8,32,9],[32,10,32,11],[32,12,32,13],[32,14,32,15],[32,16,32,17],[32,18,32,19],[30,20,30,21],[31,2,31,3],[31,4,31,5],[31,6,31,7],[31,8,31,9],[31,10,31,11],[31,12,31,13],[31,14,31,15],[31,16,31,17],[31,18,31,19],[31,20,31,21],[30,2,30,3],[30,4,30,5],[30,6,30,7],[30,8,30,9],[30,10,30,11],[30,12,30,13],[30,14,30,15],[30,16,30,17],[30,18,30,19],[28,20,28,21],[29,2,29,3],[29,4,29,5],[29,6,29,7],[29,8,29,9],[29,10,29,11],[29,12,29,13],[29,14,29,15],[29,16,29,17],[29,18,29,19],[29,20,29,21],[28,2,28,3],[28,4,28,5],[28,6,28,7],[28,8,28,9],[28,10,28,11],[28,12,28,13],[28,14,28,15],[28,16,28,17],[28,18,28,19],[26,20,26,21],[27,2,27,3],[27,4,27,5],[27,6,27,7],[27,8,27,9],[27,10,27,11],[27,12,27,13],[27,14,27,15],[27,16,27,17],[27,18,27,19],[27,20,27,21],[26,2,26,3],[26,4,26,5],[26,6,26,7],[26,8,26,9],[26,10,26,11],[26,12,26,13],[26,14,26,15],[26,16,26,17],[26,18,26,19],[24,20,24,21],[25,2,25,3],[25,4,25,5],[25,6,25,7],[25,8,25,9],[25,10,25,11],[25,12,25,13],[25,14,25,15],[25,16,25,17],[25,18,25,19],[25,20,25,21],[24,2,24,3],[24,4,24,5],[24,6,24,7],[24,8,24,9],[24,10,24,11],[24,12,24,13],[24,14,24,15],[24,16,24,17],[24,18,24,19],[22,20,22,21],[23,2,23,3],[23,4,23,5],[23,6,23,7],[23,8,23,9],[23,10,23,11],[23,12,23,13],[23,14,23,15],[23,16,23,17],[23,18,23,19],[23,20,23,21],[22,2,22,3],[22,4,22,5],[22,6,22,7],[22,8,22,9],[22,10,22,11],[22,12,22,13],[22,14,22,15],[22,16,22,17],[22,18,22,19],[20,20,20,21],[21,2,21,3],[21,4,21,5],[21,6,21,7],[21,8,21,9],[21,10,21,11],[21,12,21,13],[21,14,21,15],[21,16,21,17],[21,18,21,19],[21,20,21,21],[20,2,20,3],[20,4,20,5],[20,6,20,7],[20,8,20,9],[20,10,20,11],[20,12,20,13],[20,14,20,15],[20,16,20,17],[20,18,20,19],[18,20,18,21],[19,2,19,3],[19,4,19,5],[19,6,19,7],[19,8,19,9],[19,10,19,11],[19,12,19,13],[19,14,19,15],[19,16,19,17],[19,18,19,19],[19,20,19,21],[18,2,18,3],[18,4,18,5],[18,6,18,7],[18,8,18,9],[18,10,18,11],[18,12,18,13],[18,14,18,15],[18,16,18,17],[18,18,18,19],[16,20,16,21],[17,2,17,3],[17,4,17,5],[17,6,17,7],[17,8,17,9],[17,10,17,11],[17,12,17,13],[17,14,17,15],[17,16,17,17],[17,18,17,19],[17,20,17,21],[16,2,16,3],[16,4,16,5],[16,6,16,7],[16,8,16,9],[16,10,16,11],[16,12,16,13],[16,14,16,15],[16,16,16,17],[16,18,16,19],[14,20,14,21],[15,2,15,3],[15,4,15,5],[15,6,15,7],[15,8,15,9],[15,10,15,11],[15,12,15,13],[15,14,15,15],[15,16,15,17],[15,18,15,19],[15,20,15,21],[14,2,14,3],[14,4,14,5],[14,6,14,7],[14,8,14,9],[14,10,14,11],[14,12,14,13],[14,14,14,15],[14,16,14,17],[14,18,14,19],[12,20,12,21],[13,2,13,3],[13,4,13,5],[13,6,13,7],[13,8,13,9],[13,10,13,11],[13,12,13,13],[13,14,13,15],[13,16,13,17],[13,18,13,19],[13,20,13,21],[12,2,12,3],[12,4,12,5],[12,6,12,7],[12,8,12,9],[12,10,12,11],[12,12,12,13],[12,14,12,15],[12,16,12,17],[12,18,12,19],[10,20,10,21],[11,2,11,3],[11,4,11,5],[11,6,11,7],[11,8,11,9],[11,10,11,11],[11,12,11,13],[11,14,11,15],[11,16,11,17],[11,18,11,19],[11,20,11,21],[10,2,10,3],[10,4,10,5],[10,6,10,7],[10,8,10,9],[10,10,10,11],[10,12,10,13],[10,14,10,15],[10,16,10,17],[10,18,10,19],[8,20,8,21],[9,2,9,3],[9,4,9,5],[9,6,9,7],[9,8,9,9],[9,10,9,11],[9,12,9,13],[9,14,9,15],[9,16,9,17],[9,18,9,19],[9,20,9,21],[8,2,8,3],[8,4,8,5],[8,6,8,7],[8,8,8,9],[8,10,8,11],[8,12,8,13],[8,14,8,15],[8,16,8,17],[8,18,8,19],[6,20,6,21],[7,2,7,3],[7,4,7,5],[7,6,7,7],[7,8,7,9],[7,10,7,11],[7,12,7,13],[7,14,7,15],[7,16,7,17],[7,18,7,19],[7,20,7,21],[5,14,5,15],[5,16,5,17],[5,18,5,19],[6,2,6,3],[6,4,6,5],[6,6,6,7],[6,8,6,9],[6,10,6,11],[6,12,6,13],[6,14,6,15],[5,2,5,3],[5,4,5,5],[5,6,5,7],[5,8,5,9],[5,10,5,11],[5,12,5,13],[6,16,6,17],[6,18,6,19],[3,16,4,17],[3,18,4,19],[3,20,4,21],[4,6,4,7],[4,8,4,9],[4,10,4,11],[0,3,0,4],[0,14,0,15],[1,3,1,4],[1,14,1,15],[3,2,4,3],[3,4,4,5],[3,6,3,11],[3,12,4,13],[3,14,4,15]]}
[null,"Classe",null,"Equipe observée",null,null,null,null,null,null,null,null,null,null,"Advsersaire"]
[null,{"$f":"'4EQUIPES'!B2","v":"1TV"},null,{"$f":"'4EQUIPES'!N3","v":"ROUGE"},null,"score",{"$f":"$C$6*C37+$E$6*E37+G37*$G$6+M37*$M$6+O37*$O$6+S37*$S$6+$U$2+$U$3","v":0},"-",null,null,null,null,null,"score","VERT",null,null,null,null,"Nb de 3 PTS"]
[null,null,null,null,null,null,null,null,null,null,null,null,null,null,null,null,null,null,null,"Nb de lancers francs"]
[null,null,"FAUTE",null,"BALLON PERDU",null,"POSSESSION",null,null,null,null,null,"TIRS",null,"BONS TIRS",null,"PANIERS",null,"PANIERS",null,"% REUSSITE"]
[null,null,null,null,null,null,"RECUPERATION B",null,"BALLON PERDU",null,"RECUPERATION B"]
[null,null,{"$f":"'OBS1'!C6:D6","v":-3},null,{"$f":"'OBS1'!E6:F6","v":-1},null,{"$f":"'OBS1'!G6:H6","v":0},null,{"$f":"'OBS1'!I6:J6","v":0},null,{"$f":"'OBS1'!K6:L6","v":0},null,{"$f":"'OBS1'!M6:N6","v":1},null,{"$f":"'OBS1'!O6:P6","v":3},null,{"$f":"'OBS1'!Q6:R6","v":0},null,{"$f":"'OBS1'!S6:T6","v":6}]
[null,1]
[null,2]
[null,3]
[null,4]
[null,5]
[null,6]
[null,7]
[null,8]
[null,9]
[null,10]
[null,11]
[null,12]
[null,13]
[null,14]
[null,15]
[null,16]
[null,17]
[null,18]
[null,19]
[null,20]
[null,21]
[null,22]
[null,23]
[null,24]
[null,25]
[null,26]
[null,27]
[null,28]
[null,29]
[null,30,null,null,null,null,{"$f":"(SUMPRODUCT(N(ISTEXT(C7:T35))))","v":0}]
[null,{"$f":"D2","v":"ROUGE"},{"$f":"(SUMPRODUCT(N(ISTEXT(C7:C36))))","v":0},null,{"$f":"(SUMPRODUCT(N(ISTEXT(E7:E36))))","v":0},null,{"$f":"(SUMPRODUCT(N(ISTEXT(G7:G36))))","v":0},null,{"$f":"(SUMPRODUCT(N(ISTEXT(I7:I36))))","v":0},null,{"$f":"(SUMPRODUCT(N(ISTEXT(K7:K36))))","v":0},null,{"$f":"(SUMPRODUCT(N(ISTEXT(M7:M36))))","v":0},null,{"$f":"(SUMPRODUCT(N(ISTEXT(O7:O36))))","v":0},null,{"$f":"(SUMPRODUCT(N(ISTEXT(Q7:Q36))))","v":0},null,{"$f":"(SUMPRODUCT(N(ISTEXT(S7:S36))))","v":0},null,{"$f":"IF(SUM(M37+O37+S37)=0,\"??\",S37/SUM(M37+O37+S37)*100)","v":"??"},null,{"$f":"B37","v":"ROUGE"}]
[null,{"$f":"G2","v":0},null,null,null,null,null,null,null,null,null,null,null,null,null,null,null,null,null,null,null,null,"<-Contrats "]
[null,{"$f":"ECHFMTELEVE!B4","v":"Amira"},{"$f":"COUNTIF($C$7:$C$36,B39)","v":0},null,{"$f":"COUNTIF($E$7:$E$36,B39)","v":0},null,{"$f":"COUNTIF($G$7:$G$36,B39)","v":0},null,{"$f":"COUNTIF($I$7:$I$36,B39)","v":0},null,{"$f":"COUNTIF($K$7:$K$36,B39)","v":0},null,{"$f":"COUNTIF($M$7:$M$36,B39)","v":0},null,{"$f":"COUNTIF($O$7:$O$36,B39)","v":0},null,{"$f":"COUNTIF($Q$7:$Q$36,B39)","v":0},null,{"$f":"COUNTIF($S$7:$S$36,B39)","v":0},null,{"$f":"IF(SUM(M39+O39+S39)=0,\"??\",S39/SUM(M39+O39+S39)*100)","v":"??"},null,{"$f":"B39","v":"Amira"}]
[null,{"$f":"$C$6*C39+$E$6*E39+G39*$G$6+M39*$M$6+O39*$O$6+S39*$S$6","v":0},null,null,null,null,null,null,null,null,null,null,null,null,null,null,null,null,null,null,null,null,"<-Contrats "]
[null,{"$f":"ECHFMTELEVE!B5","v":"Estelle"},{"$f":"COUNTIF($C$7:$C$36,B41)","v":0},null,{"$f":"COUNTIF($E$7:$E$36,B41)","v":0},null,{"$f":"COUNTIF($G$7:$G$36,B41)","v":0},null,null,null,{"$f":"COUNTIF($K$7:$K$36,B41)","v":0},null,{"$f":"COUNTIF($M$7:$M$36,B41)","v":0},null,{"$f":"COUNTIF($O$7:$O$36,B41)","v":0},null,{"$f":"COUNTIF($Q$7:$Q$36,B41)","v":0},null,{"$f":"COUNTIF($S$7:$S$36,B41)","v":0},null,{"$f":"IF(SUM(M41+O41+S41)=0,\"??\",S41/SUM(M41+O41+S41)*100)","v":"??"},null,{"$f":"B41","v":"Estelle"}]
[null,{"$f":"$C$6*C41+$E$6*E41+G41*$G$6+M41*$M$6+O41*$O$6+S41*$S$6","v":0},null,null,null,null,null,null,null,null,null,null,null,null,null,null,null,null,null,null,null,null,"<-Contrats "]
[null,{"$f":"ECHFMTELEVE!B6","v":0},{"$f":"COUNTIF($C$7:$C$36,B43)","v":0},null,{"$f":"COUNTIF($E$7:$E$36,B43)","v":0},null,{"$f":"COUNTIF($G$7:$G$36,B43)","v":1},null,null,null,{"$f":"COUNTIF($K$7:$K$36,B43)","v":0},null,{"$f":"COUNTIF($M$7:$M$36,B43)","v":0},null,{"$f":"COUNTIF($O$7:$O$36,B43)","v":0},null,{"$f":"COUNTIF($Q$7:$Q$36,B43)","v":0},null,{"$f":"COUNTIF($S$7:$S$36,B43)","v":0},null,{"$f":"IF(SUM(M43+O43+S43)=0,\"??\",S43/SUM(M43+O43+S43)*100)","v":"??"},null,{"$f":"B43","v":0}]
[null,{"$f":"$C$6*C43+$E$6*E43+G43*$G$6+M43*$M$6+O43*$O$6+S43*$S$6","v":0},null,null,null,null,null,null,null,null,null,null,null,null,null,null,null,null,null,null,null,null,"<-Contrats "]
[null,{"$f":"ECHFMTELEVE!B7","v":0},{"$f":"COUNTIF($C$7:$C$36,B45)","v":0},null,{"$f":"COUNTIF($E$7:$E$36,B45)","v":0},null,{"$f":"COUNTIF($G$7:$G$36,B45)","v":1},null,null,null,{"$f":"COUNTIF($K$7:$K$36,B45)","v":0},null,{"$f":"COUNTIF($M$7:$M$36,B45)","v":0},null,{"$f":"COUNTIF($O$7:$O$36,B45)","v":0},null,{"$f":"COUNTIF($Q$7:$Q$36,B45)","v":0},null,{"$f":"COUNTIF($S$7:$S$36,B45)","v":0},null,{"$f":"IF(SUM(M45+O45+S45)=0,\"??\",S45/SUM(M45+O45+S45)*100)","v":"??"},null,{"$f":"B45","v":0}]
[null,{"$f":"$C$6*C45+$E$6*E45+G45*$G$6+M45*$M$6+O45*$O$6+S45*$S$6","v":0},null,null,null,null,null,null,null,null,null,null,null,null,null,null,null,null,null,null,null,null,"<-Contrats "]
[null,{"$f":"ECHFMTELEVE!B8","v":0},{"$f":"COUNTIF($C$7:$C$36,B47)","v":0},null,{"$f":"COUNTIF($E$7:$E$36,B47)","v":0},null,{"$f":"COUNTIF($G$7:$G$36,B47)","v":1},null,null,null,{"$f":"COUNTIF($K$7:$K$36,B47)","v":0},null,{"$f":"COUNTIF($M$7:$M$36,B47)","v":0},null,{"$f":"COUNTIF($O$7:$O$36,B47)","v":0},null,{"$f":"COUNTIF($Q$7:$Q$36,B47)","v":0},null,{"$f":"COUNTIF($S$7:$S$36,B47)","v":0},null,{"$f":"IF(SUM(M47+O47+S47)=0,\"??\",S47/SUM(M47+O47+S47)*100)","v":"??"},null,{"$f":"B47","v":0}]
[null,{"$f":"$C$6*C47+$E$6*E47+G47*$G$6+M47*$M$6+O47*$O$6+S47*$S$6","v":0},null,null,null,null,null,null,null,null,null,null,null,null,null,null,null,null,null,null,null,null,"<-Contrats "]
[null,{"$f":"ECHFMTELEVE!B9","v":0},{"$f":"COUNTIF($C$7:$C$36,B49)","v":0},null,{"$f":"COUNTIF($E$7:$E$36,B49)","v":0},null,{"$f":"COUNTIF($G$7:$G$36,B49)","v":1},null,null,null,{"$f":"COUNTIF($K$7:$K$36,B49)","v":0},null,{"$f":"COUNTIF($M$7:$M$36,B49)","v":0},null,{"$f":"COUNTIF($O$7:$O$36,B49)","v":0},null,{"$f":"COUNTIF($Q$7:$Q$36,B49)","v":0},null,{"$f":"COUNTIF($S$7:$S$36,B49)","v":0},null,{"$f":"IF(SUM(M49+O49+S49)=0,\"??\",S49/SUM(M49+O49+S49)*100)","v":"??"},null,{"$f":"B49","v":0}]
[null,{"$f":"$C$6*C49+$E$6*E49+G49*$G$6+M49*$M$6+O49*$O$6+S49*$S$6","v":0},null,null,null,null,null,null,null,null,null,null,null,null,null,null,null,null,null,null,null,null,"<-Contrats "]
[null,{"$f":"ECHFMTELEVE!B10","v":0},{"$f":"COUNTIF($C$7:$C$36,B51)","v":0},null,{"$f":"COUNTIF($E$7:$E$36,B51)","v":0},null,{"$f":"COUNTIF($G$7:$G$36,B51)","v":1},null,null,null,{"$f":"COUNTIF($K$7:$K$36,B51)","v":0},null,{"$f":"COUNTIF($M$7:$M$36,B51)","v":0},null,{"$f":"COUNTIF($O$7:$O$36,B51)","v":0},null,{"$f":"COUNTIF($Q$7:$Q$36,B51)","v":0},null,{"$f":"COUNTIF($S$7:$S$36,B51)","v":0},null,{"$f":"IF(SUM(M51+O51+S51)=0,\"??\",S51/SUM(M51+O51+S51)*100)","v":"??"},null,{"$f":"B51","v":0}]
[null,{"$f":"$C$6*C51+$E$6*E51+G51*$G$6+M51*$M$6+O51*$O$6+S51*$S$6","v":0},null,null,null,null,null,null,null,null,null,null,null,null,null,null,null,null,null,null,null,null,"<-Contrats "]
[null,{"$f":"ECHFMTELEVE!B11","v":0},{"$f":"COUNTIF($C$7:$C$36,B53)","v":0},null,{"$f":"COUNTIF($E$7:$E$36,B53)","v":0},null,{"$f":"COUNTIF($G$7:$G$36,B53)","v":1},null,null,null,{"$f":"COUNTIF($K$7:$K$36,B53)","v":0},null,{"$f":"COUNTIF($M$7:$M$36,B53)","v":0},null,{"$f":"COUNTIF($O$7:$O$36,B53)","v":0},null,{"$f":"COUNTIF($Q$7:$Q$36,B53)","v":0},null,{"$f":"COUNTIF($S$7:$S$36,B53)","v":0},null,{"$f":"IF(SUM(M53+O53+S53)=0,\"??\",S53/SUM(M53+O53+S53)*100)","v":"??"},null,{"$f":"B53","v":0}]
[null,{"$f":"$C$6*C53+$E$6*E53+G53*$G$6+M53*$M$6+O53*$O$6+S53*$S$6","v":0},null,null,null,null,null,null,null,null,0,null,null,null,null,null,null,null,null,null,null,null,"<-Contrats "]
[]
[null,{"$f":"B37","v":"ROUGE"},{"$f":"C37","v":0},null,0,null,0,null,0,null,0,null,0,null,0,null,0,null,0,null,{"$f":"IF(SUM(M56+O56+S56)=0,\"??\",S56/SUM(M56+O56+S56)*100)","v":"??"}]
[null,"Contrats ->"]
[]
[null,"EQUIPE",{"$f":"CONCATENATE(C4,\" / POSSESSION\")","v":"FAUTE / POSSESSION"},null,{"$f":"CONCATENATE(E4,\" / POSSESSION\")","v":"BALLON PERDU / POSSESSION"},null,{"$f":"CONCATENATE(G5,\" / POSSESSION\")","v":"RECUPERATION B / POSSESSION"},null,{"$f":"CONCATENATE(I4,\" / POSSESSION\")","v":" / POSSESSION"},null,{"$f":"CONCATENATE(K4,\" / POSSESSION\")","v":" / POSSESSION"},null,{"$f":"CONCATENATE(M4,\" / POSSESSION\")","v":"TIRS / POSSESSION"},null,{"$f":"CONCATENATE(O4,\" / POSSESSION\")","v":"BONS TIRS / POSSESSION"},null,{"$f":"CONCATENATE(Q4,\" / POSSESSION\")","v":"PANIERS / POSSESSION"},null,{"$f":"CONCATENATE(S4,\" / POSSESSION\")","v":"PANIERS / POSSESSION"},null,"TIR REUSSI\n/TIR TENTE"]
[null,{"$f":"B56","v":"ROUGE"},null,{"$f":"C56/$G$36","v":{"$error":"#DIV/0!"}},null,{"$f":"E56/$G$36","v":{"$error":"#DIV/0!"}},null,{"$f":"G56/$G$36","v":{"$error":"#DIV/0!"}},null,null,{"$f":"K56/K36","v":{"$error":"#DIV/0!"}},null,null,{"$f":"M56/$G$36","v":{"$error":"#DIV/0!"}},null,{"$f":"O56/$G$36","v":{"$error":"#DIV/0!"}},null,null,null,{"$f":"S56/$G$36","v":{"$error":"#DIV/0!"}},null,{"$f":"U56","v":"??"}]
[null,"Contrats ->"]
[null,"PROFILS DE JEU ET SITUATIONS A TRAVAILLER"]
[null,null,"MON POINT FORT",null,"MON POINT FAIBLE",null,"JE VEUX TRAVAILLER …",null,null,null,"SITUATIONS A TRAVAILLER n°",null,"Nom de la situation A TRAVAILLER",null,null,null,null,null,"PROFIL DE JEU DE NOTRE EQUIPE",null,"Nom de la SITUATION A TRAVAILLER"]
[null,{"$f":"B39","v":"Amira"},"TIR",null,"DEFENSE INDIVIDUELLE",null,"PASSE",null,null,null,{"$f":"VLOOKUP(C64,#REF!,4,TRUE)","v":{"$error":"#REF!"}},null,{"$f":"VLOOKUP(G64,DEBUT!$R$3:$V$12,2,FALSE)","v":0},null,null,null,null,null,"Contre attaque",null,{"$f":"VLOOKUP(S64,DEBUT!R13:V26,2,FALSE)","v":0}]
[null,{"$f":"B41","v":"Estelle"},"PASSE",null,"DEFENSE INDIVIDUELLE",null,"TIR",null,null,null,{"$f":"VLOOKUP(C65,#REF!,4,TRUE)","v":{"$error":"#REF!"}},null,{"$f":"VLOOKUP(G65,DEBUT!$R$3:$V$12,2,FALSE)","v":0}]
[null,{"$f":"B43","v":0},null,null,"DEFENSE INDIVIDUELLE",null,"TIR",null,null,null,{"$f":"VLOOKUP(C66,#REF!,4,TRUE)","v":{"$error":"#REF!"}},null,{"$f":"VLOOKUP(G66,DEBUT!$R$3:$V$12,2,FALSE)","v":0}]
[null,{"$f":"B45","v":0},null,null,"DEFENSE INDIVIDUELLE",null,"TIR",null,null,null,{"$f":"VLOOKUP(C67,#REF!,4,TRUE)","v":{"$error":"#REF!"}},null,{"$f":"VLOOKUP(G67,DEBUT!$R$3:$V$12,2,FALSE)","v":0}]
[null,{"$f":"B47","v":0},null,null,"DEFENSE INDIVIDUELLE",null,"TIR",null,null,null,{"$f":"VLOOKUP(C68,#REF!,4,TRUE)","v":{"$error":"#REF!"}},null,{"$f":"VLOOKUP(G68,DEBUT!$R$3:$V$12,2,FALSE)","v":0}]
[null,{"$f":"B49","v":0},null,null,"DEFENSE INDIVIDUELLE",null,"TIR",null,null,null,{"$f":"VLOOKUP(C69,#REF!,4,TRUE)","v":{"$error":"#REF!"}},null,{"$f":"VLOOKUP(G69,DEBUT!$R$3:$V$12,2,FALSE)","v":0}]
[null,{"$f":"B51","v":0},null,null,"DEFENSE INDIVIDUELLE",null,"TIR",null,null,null,{"$f":"VLOOKUP(C70,#REF!,4,TRUE)","v":{"$error":"#REF!"}},null,{"$f":"VLOOKUP(G70,DEBUT!$R$3:$V$12,2,FALSE)","v":0}]
[null,{"$f":"B53","v":0},null,null,"DEFENSE INDIVIDUELLE",null,"TIR",null,null,null,{"$f":"VLOOKUP(C71,#REF!,4,TRUE)","v":{"$error":"#REF!"}},null,{"$f":"VLOOKUP(G71,DEBUT!$R$3:$V$12,2,FALSE)","v":0}]
[]
[null,null,null,"Le profil de jeu peut être choisi par l'élève à partir de l'analyse de ses stats ou alors à partir d'une formule du type : si TIR = 0 alors travailler SA1"]

{"sheet":"DEBUT","index":9,"n_rows":60,"n_cols":41,"rows_kept":60,"cut":false,"hidden":false,"merged":[[61,29,62,29],[61,30,62,30],[61,31,62,31],[63,24,64,24],[63,25,64,25],[63,26,64,26],[63,27,64,27],[63,28,64,28],[63,29,64,29],[63,30,64,30],[63,31,64,31],[61,24,62,24],[61,25,62,25],[61,26,62,26],[61,27,62,27],[61,28,62,28],[57,29,58,29],[57,30,58,30],[57,31,58,31],[59,24,60,24],[59,25,60,25],[59,26,60,26],[59,27,60,27],[59,28,60,28],[59,29,60,29],[59,30,60,30],[59,31,60,31],[57,24,58,24],[57,25,58,25],[57,26,58,26],[57,27,58,27],[57,28,58,28],[45,29,46,29],[45,30,46,30],[45,31,46,31],[45,24,46,24],[45,25,46,25],[45,26,46,26],[45,27,46,27],[45,28,46,28],[39,28,40,28],[39,29,40,29],[39,30,40,30],[39,31,40,31],[41,24,42,24],[41,25,42,25],[41,26,42,26],[41,27,42,27],[41,28,42,28],[41,29,42,29],[41,30,42,30],[41,31,42,31],[37,27,38,27],[37,26,38,26],[37,25,38,25],[37,24,38,24],[39,24,40,24],[39,25,40,25],[39,26,40,26],[39,27,40,27],[0,15,0,21],[35,24,36,24],[35,25,36,25],[35,26,36,26],[35,27,36,27],[28,3,29,3],[62,4,62,6],[62,7,62,9],[62,10,62,12],[43,1,49,1],[50,1,57,1],[47,29,48,29],[47,30,48,30],[47,31,48,31],[35,31,36,31],[47,24,48,24],[47,25,48,25],[47,26,48,26],[47,27,48,27],[47,28,48,28],[35,28,36,28],[35,29,36,29],[35,30,36,30],[37,31,38,31],[37,30,38,30],[37,29,38,29],[37,28,38,28]]}
["ECHAUFFEMENT","Parties ","Consignes","Durée","Logique","Parties ","Consignes","Durée","Logique","Parties ","Consignes","Durée","Logique",null,null,"CRITERES SERVANT A L'ANALYSE DES STATS"]
["ECHAUFFEMENT détaillé","Echauffement cardio-pulmonaire","3 A-R course / Montée genoux / Talons fesses / Pas chassés / Pas croisés / Flexions / Extensions / Course arrière / Appuis arrières / Accélération progressive (60% - 70% - 80% - 90%)","5 min","Progressivité / Complet / ","Mobilisation articulaire","Cou / Epaules / Coudes / Poignets / Bassin / Genoux / Chevilles","3 min","Du haut vers le bas","Etirements","Triceps / Biceps / Epaules / Adducteurs / ischios / Quadriceps / Mollets","3 min","Du haut vers le bas / Tenir 7\"",null,null,null,null,"MON POINT FORT","N1","N2","N3","N4"]
["ECHAUFFEMENT simplifié","Echauffement cardio-pulmonaire","Ne pas oublier tous les exercices en finissant par des accélérations progressives","5 min",null,"Mobilisation articulaire","Commencer par le haut ou le bas pour ne rien oublier","3 min",null,"Etirements","Essayer d'associer un étirement actif avec un mouvement dynamique","3 min",null,null,null,null,0,"POINTS FORTS-FAIBLES-PREFERES",null,null,null,null,null,null,"CRITERES","FAUTE","BALLON PERDU","POSSESSION","RECUPERATION B","TIRS","BONS TIRS","PANIERS","PASSE DECISIVE","INTERCEPTION","% REUSSITE","UNE-DEUX"]
["ECHAUFFEMENT-grandes parties","Echauffement cardio-pulmonaire",null,null,null,"Mobilisation articulaire",null,null,null,"Etirements",null,null,null,null,null,null,1,"TIR",null,null,null,null,null,null,"OBJECTIFS INDIVIDUELS",2,2,2,2,2,2,2,2,2,0.2,2]
["ECHAUFFEMENT ritualisé",null,null,null,null,null,null,null,null,null,null,null,null,null,null,null,2,"PASSE",null,null,null,null,null,null,"Commentaires si inférieur","C'est bien tu gères la distance","Bien tu lèves la tête","Tu touches le ballon","Faut se bouger davantage","Faut oser tirer","Pourquoi tes tirs ne rentrent pas ?","SI tu tires il faudra être plus précis",null,null,"Pas de chance"]
["ECHAUFFEMENT-S5",null,null,null,null,null,null,null,null,null,null,null,null,null,null,null,3,"REBOND",null,null,null,null,null,null,"Commentaires si supérieur ou égal","Doucement ","A qui tu fais la passe?","T'es plutot actif","Bien harcelé","Bien essayé mais faudra travailler l'adresse","On va travailler la précision","Joli",null,null,"Bien visé"]
["ECHAUFFEMENT-S6",null,null,null,null,null,null,null,null,null,null,null,null,null,null,null,4,"DEFENSE INDIVIDUELLE",null,null,null,null,null,null,null,1,2,3,4,5,6,7,8,9,10,11,12,13,14,15,16]
["ECHAUFFEMENT-S7",null,null,null,null,null,null,null,null,null,null,null,null,null,null,null,5,"UNE-DEUX"]
["ECHAUFFEMENT-S8",null,null,null,null,null,null,null,null,null,null,null,null,null,null,null,6,"SOUTIEN",null,null,null,null,null,null,"OBJECTIFS COLLECTIFS",3,5,15,5,5,6,5,0.25]
["ECHAUFFEMENT-S9",null,null,null,null,null,null,null,null,null,null,null,null,null,null,null,7,"REPLI DEFENSIF",null,null,null,null,null,null,"Commentaires si inférieur","Vous êtes bien organisé","C'est bien vous faites des passes","Vous êtes où?","Faut se bouger davantage","Faut oser tirer","Pourquoi vos tirs ne rentrent pas ? ","SI vous tirez il faudra être plus précis","Pas de chance"]
["ECHAUFFEMENT-S10",null,null,null,null,null,null,null,null,null,null,null,null,null,null,null,8,null,null,null,null,null,null,null,"Commentaires si supérieur ou égal","Trop de fautes collectives","Trop de ballons perdus","Bonne activité collective","Bien harcelé","Bien essayé mais faudra travailler l'adresse","On va travailler la précision","Joli","Bien visé"]
[null,null,null,null,null,null,null,null,null,null,null,null,null,null,null,null,9]
[null,null,null,null,null,null,null,null,null,null,null,null,null,null,null,null,10,"TACTIQUE"]
[null,null,null,null,null,null,null,null,null,null,null,null,null,null,null,null,11,"Contre attaque"]
[null,null,null,null,null,null,null,null,null,null,null,null,null,null,null,null,12,"Attaque placée",null,null,null,null,null,null,"CRITERES STATISTIQUES","FAUTES/POSSESSION","PERTE DE BALLE /POSSESSION","RECUPERATION /POSSESSION","CONTRE ATTAQUE /POSSESSION","ATTEINTE ZONE AVANT /POSSESSION","TIR REUSSI / TIR TENTE","TIR /POSSESSION","PANIER /POSSESSION"]
[null,null,null,null,null,null,null,null,null,null,null,null,null,null,null,null,13,"Grappe",null,null,null,null,null,null,"OBJECTIFS",0.05,0.1,0.2,0.5,null,0.3,0.5,0.3]
[null,null,null,null,null,null,null,null,null,null,null,null,null,null,null,null,14,null,null,null,null,null,null,null,"Commentaires si inférieur","Bonne maitrise","c'est bien vous demandez le ballon","Allez on s'organise un peu","Dès récupération du ballon il faut s'organiser ensemble","Trop de ballons perdus","Manque d'adresse","Chaque action devrait aboutir à un bon tir","Il faut shooter plus"]
[null,"COULEUR EQUIPE","NOTES ECHAUFFEMENT",null,"SCORES RELEVABLES","CONTRAT MIN","MILIEU","MAX",null,"% ",null,"Pts",null,null,null,null,15,null,null,null,null,null,null,null,"Commentaires si supérieur ou égal","Faut se calmer","Trop de ballon perdu : faut lever la t^te","ça défend bien","ça va vite chez vous","Maintenant il faut réussir à tirer","Oh mais c'est Golden State","C'est bien mais faut travailler l'adresse","Efficacité"]
[null,"BLANC",null,null,"Tir à l'arrêt",2,4,6,null,0,null,null,null,null,null,null,16]
[null,"BLEU",0,null,"Tir en course",3,5,7,null,0.05,null,-5,null,null,null,null,17]
[null,"JAUNE",1,null,"Tir à 2",null,null,null,null,0.1,null,-3,null,null,null,null,18]
[null,"VERT",2,null,null,null,null,null,null,0.15,null,-2,null,null,null,null,19]
[null,"ORANGE",3,null,null,null,null,null,null,0.2,null,-1,null,null,null,null,20]
[null,"NOIR",4,null,null,null,null,null,null,0.25,null,0,null,null,null,null,21]
[null,"VIOLET",5,null,null,null,null,null,null,0.3,null,1]
[null,"ROUGE",6,null,null,null,null,null,null,0.35,null,2,null,null,null,null,"POINTS MARQUES"]
[null,null,7,null,null,null,null,null,null,0.4,null,3]
[null,null,8,null,null,null,null,null,null,0.45,null,4]
[null,null,9,null,null,null,null,null,null,0.5,null,5]
[null,null,10,null,null,null,null,null,null,0.55000000000000004,null,6]
[null,null,11,null,null,null,null,null,null,0.6,null,7]
[null,null,12,null,null,null,null,null,null,0.65,null,8]
[null,null,13,null,null,null,null,null,null,0.7,null,9]
[null,null,14,null,null,null,null,null,null,0.75,null,10]
[null,null,15,null,null,null,null,null,null,0.8,null,11]
[null,null,16,null,null,null,null,null,null,0.85,null,12]
[null,null,17,null,null,null,null,null,null,0.9,null,13]
[null,null,18,null,null,null,null,null,null,0.95,null,14]
[null,null,19,null,null,null,null,null,null,1,null,15]
[null,null,20,null,null,null,null,null,null,null,null,16]
[null,null,21,null,null,null,null,null,null,null,null,17]
[null,null,22,null,null,null,null,null,null,null,null,18]
[null,null,23,null,null,null,null,null,null,null,null,19]
[null,null,24,null,null,null,null,null,null,null,null,20]
[null,null,25]
[null,null,26]
[null,null,27]
[null,null,28]
[null,null,29]
[null,null,30]
[null,null,31]
[null,null,32]
[null,null,33]
[null,null,34]
[null,null,35]
[null,null,36]
[null,null,37]
[null,null,38]
[null,null,39]
[null,null,40]

{"sheet":"APPEL","index":10,"n_rows":38,"n_cols":28,"rows_kept":38,"cut":false,"hidden":false,"merged":[[0,22,0,23],[0,25,0,26],[0,1,0,2],[0,4,0,5],[0,7,0,8],[0,10,0,11],[0,13,0,14],[0,16,0,17],[0,19,0,20]]}
[null,"1GA",null,null,"2TU",null,null,"3PP",null,null,"1TV",null,null,"1COM",null,null,"TMELEC",null,null,"1META",null,null,"TPROE",null,null,"TEVS"]
[null,"PRENOMS","NOMS","sexe","PRENOMS","NOMS","sexe","PRENOMS","NOMS","sexe","PRENOMS","NOMS","sexe","PRENOMS","NOMS","sexe","PRENOMS","NOMS","sexe","PRENOMS","NOMS","sexe","PRENOMS","NOMS","sexe","PRENOMS","NOMS","sexe"]
[1,"Amira","Amira","F","Achraf","Achraf","g","Adam","Adam","g","Baptiste","Baptiste",null,"Alaudin","Alaudin","g","Alain","Alain","g","Abdel Nour","Abdel Nour","g","Aboubacar","Aboubacar","g","Aejaz","Aejaz","g"]
[2,"Estelle","Estelle","F","Ali-Han","Alaeddine","g","Amine","Amine","g","Rémy","Rémy",null,"Anissa","Anissa","F","Aslem","Aslem","g","Eric","Eric","g","Bafode","Bafode","g","Ahmad","Ahmad","g"]
[3,"Gentjana","Gentjana","F","Alpha Oumar","Alpha Oumar","g","Anis","Anis","g","Théo","Théo",null,"Arthur","Arthur","g","Erol","Erol","g","Hamza","Hamza","g","Cristiano","Cristiano","g","Angel","Angel","F"]
[4,"Kamylia","Kamylia","F","Amadou","Amadou","g","Anthony","Anthony","g",null,"Maxime",null,"Brinna","Brinna","F","Hamza","Hamza","g","Mamadou Oury","Mamadou Oury","g","Emil","Emil","g","Ani","Ani","F"]
[5,"Kathy","Kathy","F","Ensar","Ensar","g","Bilel","Bilel","g",null,"Smaïn",null,"Chahla","Chahla","F","Idriss","Idriss","g","Naby","Naby","g","Fahari","Fahari","g","Chaima","Chaima","F"]
[6,"Maïssa","Maïssa","F","Hamza","Hamza","g","Can","Can","g",null,"Nour",null,"Chamina","Chamina","F","Iliess","Iliess","g","Salim","Salim","g","Fazil","Fazil","g","Chainese","Chainese","g"]
[7,"Maryka","Maryka","F","Ibrahim","Ibrahim","g","Cherine","Cherine","F",null,"Raymond",null,"Claudia","Claudia","F","Ismaïl","Ismaïl","g","Sean","Sean","g","Ibrahim","Ibrahim","g","Fjorel","Fjorel","g"]
[8,"Mounir","Mounir","g","Imad","Imad","g","Eden","Eden","F",null,null,null,"Daniela","Daniela","F","Jessim","Jessim","g","Simon","Simon","g","Jawad","Jawad","g","Howeyda","Howeyda","F"]
[9,"Mounir","Mounir","g","Mamadou Gando","Mamadou Gando","g","Elyes","Elyes","g",null,null,null,"Eva","Eva","F","Khalil","Khalil","g","Souleymane Thierno","Souleymane Thierno","g","Khemandeef","Khemandeef","g","Kaïs","Yolan","g"]
[10,"Munire","Munire","F","Mohamed","Mohamed","g","Farok","Farok","g",null,null,null,"Intissar","Intissar","F","Namereq","Namereq","g","Soumaila","Soumaila","g","Mourad","Mourad","g","Lucie","Lucie","F"]
[11,"Nesrin","Nesrin","F","Walid","Walid","g","Hamza","Hamza","g",null,null,null,"Ivan","Ivan","g","Rayan","Rayan","g","Théo","Théo","g",null,"Redouane",null,"Maily","Maily","F"]
[12,"Nissrine","Nissrine","F","Wassime","Wassime","g","Hosna","Hosna","F",null,null,null,"Kannelle","Kannelle","F","Sandro","Sandro","g","Yanis","Yanis","g",null,null,null,"Mounia","Mounia","F"]
[13,"Rith Assirie","Rith Assirie","F",null,"Boubacar",null,"Jérémy","Jérémy","g",null,null,null,"Kia","Kia","F","Wassim","Wassim","g",null,"Amara",null,null,null,null,"Pticem","Pticem","F"]
[14,"Ruheda Nefisse","Ruheda Nefisse","F",null,"Lamine",null,"Jordan","Jordan","g",null,null,null,"Léonardo","Léonardo","g",null,null,null,null,"Eldin ",null,null,null,null,"Sarah","Sarah","F"]
[15,"Sendes","Sendes","F",null,"Pedro",null,"Kevin","Kevin","g",null,null,null,"Naima","Naima","F",null,null,null,null,"Enis",null,null,null,null,"Sophie","Sophie","F"]
[16,"Shaïnez","Shaïnez","F",null,"Riard",null,"Lukas","Lukas","g",null,null,null,"Naïma","Naïma","F"]
[17,"Sihem","Sihem","F",null,"yanis",null,"Meliana","Meliana","F",null,null,null,"Nasir","Nasir","g"]
[18,"Sueda","Sueda","F",null,null,"g","Muhammed-Yusuf","Muhammed-Yusuf","g",null,null,null,"Riad","Riad","g"]
[19,"Zamira","Zamira","F",null,null,null,"Noha","Noha","F",null,null,null,"Sofiane","Sofiane","g"]
[20,"Zoulfa","Zoulfa","F",null,null,null,"Ricardo","Ricardo","g",null,null,null,"Teguil","Teguil","g"]
[21,"Zumra","Zumra","F",null,null,null,"Tony","Tony","g",null,null,null,"Walid","Walid","g"]
[22,null,null,null,null,null,null,"Wassime","Wassime","g",null,null,null,"Zakaria","Zakaria","g"]
[23,null,null,null,null,null,null,"Wilberlyn","Wilberlyn","F",null,null,null,null,"Célia"]
[24]
[25]
[26]
[27]
[28]
[29]
[30]
[31]
[32]
[33]
[34]
[35]
[36]

{"sheet":"SAMICBIS","index":11,"n_rows":209,"n_cols":20,"rows_kept":209,"cut":false,"hidden":false,"merged":[]}
[null,null,null,null,null,null,null,null,null,null,"3,2x5,82 schéma pour un pc","Conseils pour ","4,7x8,64 schéma pour la tablette",null,null,null,null,null,null,"Conseil pour "]
["nom SA","n° SA","OBJ GENERAL","NIVEAU","Obj SA","But","Type SA","Consignes","Schéma","Consignes 2","Schéma 2","Réussir","Matériel ","CR","Intérêt SA","Connaissances","Capacités","Attitudes","Complexification","Simplification"]
["Max Tirs en 1'","T1'","Améliorer la qualité du tir en course. Construire une continuité dribble-tir","N1","Améliorer la qualité du tir en course","Marquer le plus de paniers possibles en 1 minute","Défi","Mini défi 1 contre 1. Les joueurs se placent à leur plot. AU signal d'un camarade ils dribblent pour aller shooter au panier. Que le tir soit réussi ou non, les 2 joueurs retournent faire le tour du plot en dribblant pour tenter un nouveau tir. Ils tournent pendant 1 minute. chacun compte son score en même temps que les observateurs et le relève sur la tablette à la fin. 2 nouveaux élèves passent quand la minute est finie.",null,null,null,"JE dribble rapidement pour pouvoir effectuer plusieurs shoots. Je m'applique sur chaque tir en m'aidant de l'angle du carré de la planche. ","2 ballons (1 chacun). 1 panier. 2 plots. 1 chrono. 1 tablette.","Je réussi au moins 3 tirs à l'arrêt et 5 tirs en course.",null,null,null,null,null,"leve la tête "]
["1000 plots",1000,"Améliorer la qualité du tiren appui.","N1","Améliorer la qualité du tir  ","Marquer le plus de paniers possibles pour ramasser le max de plots","Défi","Placer les plots comme sur le schéma ( à peu près). Diviser le groupe en 2 équipes. Les joueurs passent par 2 pendant 1 minute (1 joueur de chaque équipe). Au signal d'un camarade je choisi un plot depuis lequel je veux shooter. Si je marque je récupère ce plot et le met dans mon camp. Si je rate, je retente ma chance. Je compte mes points au bout de 1min et mon camarade prend le relais. Le jeu se fini quand il n'y a plus de plots à ramasser. On relève les points par joueur et par équipe. La 1ère équipe qui finie le jeu arrête la classe entière.",null,null,null,"Je choisis les plots adaptés à mon niveau. Je m'applique sur chaque tir. Je récupère rapidement mon ballon pour tenter un nouveau shoot.","2 plots rouges (valeur 5 pts) à placer plus proche que sur le dessin. 7 plots verts (3pts). 5 plots blancs (2pts). 3 plots bleus (1pt).    -   1 ballon chacun.. 1 panier. 1 chrono. 1 tablette.","Je réussi à marquer au moins 4 points pour mon équipe.","Intérêt","Cns","Cap","Att","COMplex","Simplf"]
["PASSE et VA","PVA",null,null,"ENCHAINER PASSE – DEPLACEMENT - RECEPTION – TIR EN COURSE – REBOND - DRIBBLE","Réaliser un passe et va + tir en course et marquer le plus de paniers possible","Défi","Le joueur ROUGE fait une passe au joueur VERT qui lui remet dans la course (une-deux). Le joueur ROUGE tente le tir, récupère le ballon et retourne faire le tour du plot rouge. Le joueur ROUGE enchaine les une-deux et les tirs pendant 1 minute.",null,"Relever le score sur la feuille suivante",null,"JE m'applique sur ma passe et mon tir. Je reviens rapidement faire le tour du plot.","2 plots. 1 ballon. 1 chrono / Panier. Si l'équipe possède 4 joueurs ou plus il faut utiliser 2 paniers et démarrer en même temps. ",null,null,null,null,null,null,"essai"]
["TIR SLALOM","PVA2",null,"N1","Améliorer la technique de tir sous pression temporelle","Marquer son panier le plus rapidement possible pour permettre à son équipe de gagner le relais.","Défi","Chaque joueur part en dribble en réalisant le slalom. Il doit marquer son panier avant de pouvoir faire la passe au joueur suivant. L'équipe qui finit son relais en 1er gagne. 1 ou 2 passages par joueur (demander à l'enseignant).",null,null,null,"S'appliquer sur son slalom en contournant les plots avec un dribble maitrisé. Prendre le temps de réaliser son tir à ma distance de tir préférentielle.","4 plots. 1 ballon par équipe.",null,"c"]
["PASSE et VA2","PVA2",null,null,"ENCHAINER PASSE – DEPLACEMENT - RECEPTION – TIR EN COURSE – REBOND - DRIBBLE","Réaliser un passe et va + tir en course et marquer le plus de paniers possible","Défi","Le joueur ROUGE fait une passe au joueur VERT qui lui remet dans la course (une-deux). Le joueur ROUGE tente le tir, c'est le joueur VERT qui récupère le ballon. Le joueur ROUGE retourne faire le tour du plot rouge et le joueur VERT lui redonne le ballon. Le joueur ROUGE enchaine les une-deux et les tirs pendant 1 minute. Notez le score dans la page suivante : si je rate mon tire mais que le ballon est rattrapé avant de toucher le sol :1 point. Si je marque et que le ballon n'est pas récupéré : 2 points. Si je marque et que le ballon est récupéré : 3 points.",null,"Relever le score sur la feuille suivante",null,"JE m'applique sur ma passe et mon tir. Je reviens rapidement faire le tour du plot.","2 plots. 1 ballon. 1 chrono. ","Le ballon touche toujours le dessus du cercle."]
["2 contre 1 ","2C1",null,null,"Mettre un partenaire en situation favorable de tir","Tirer au panier sans adversaire face à soi. Marquer le plus de pts possible",null,"Les attaquants démarrent derrière les plots situés proches du milieu de terrain. Le défenseur démarre derrière la ligne de fond. Dès que le ballon est en mouvement les attaquants doivent aller marquer un panier, et le défenseur doit les en empêcher. Attention, pour avoir le droit de tirer, il ne doit pas y avoir de défenseur devant soi ! A chaque tir tenté, les attaquants marquent un point, à chaque panier 2 pts. Si le défenseur récupère le ballon il marque un point. On réalise 10 passages à chaque rôle. ",null,"Un arbitre est sur le côté : il annonce les fautes et compte les points. L'arbitre et le défenseur change de rôle à chaque passage. (Relever le score sur la feuille suivante à la fin des 10 passages).",null,"Faire circuler le ballon jusqu'à ce que un des 2 attaquants se retrouve seul face au panier. Se déplacer rapidement. ","2 plots. 1 ballon par équipe. 1 panier.","On réussi à tirer à chaque passage."]
["Passe et va, tir et rebond","PVTR","Enchainement d'actions",null,"ENCHAINER PASSE – DEPLACEMENT - RECEPTION – TIR EN COURSE – REBOND - DRIBBLE","Réaliser un passe et va + tir en course et marquer le plus de paniers possible. Récupérer le ballon avec qu'il ne touche le sol.",null,"Le joueur au short blanc (A) part en dribble et fait une passe au joueur au short noir (B). B réalise un tir en course. A joue le rebond et doit récupérer le ballon avant qu'il ne touche le sol. Les 2 joueurs se replacent et c'est aux autres de passer. On enchaine les actions pendant le temps défini par l'enseignant (lancer le chrono).",null,"Relever le score sur la feuille suivante",null,"Je m'applique sur chaque action. Je suit les actions de mon partenaire. Je tire depuis la raquette. ","2 plots. 2 ballons. ","Marquer au moins 1 panier /2"]
["3 contre 2",null,null,null,"Se placer, se déplacer pour se mettre ou mettre un partenaire en position de tir seul (situation de surnombre)","Tirer au panier en étant en position de tir seul",null,"Les attaquants se placent derrière les plots situés près du milieu du terrain.\n Les défenseurs démarrent derrière la ligne de fond de terrain. \nDès que le ballon est en mouvement, l’action commence et les défenseurs peuvent entrer sur le terrain.\n\nLe passage est terminé lorsque :\n-le panier est marqué \n-le ballon sort en touche\n-la défense intercepte le ballon\n\n Si un attaquant se fait toucher balle en main, il ne peut plus tirer. Les défenseurs changent toutes les 30 secondes.",null,null,null,null,null,"Tirer seul 8 fois sur 10.\nMarquer 5 fois ",null,"Connaitre la définition du tir seul : personne n’est situé entre moi et le panier ou le défenseur est à plus de 2mètres.\n\nJe passe ou je passe\nSi…alors…\nSi le défenseur gêne ma progression alors je passe à un partenaire\nSi je suis seul alors j’avance (je passe)\n\nComprendre l’intérêt de la situation pour réinvestir en situation de match","Défenseur : se situer entre les attaquants et le panier. s’organiser collectivement pour qu’un joueur presse le PB, et un joueur cadre les 2 autres attaquants  en gênant davantage le NPB susceptible de recevoir le ballon. Faire l’essui-glace.\n\nPB : lever la tête pour transmettre au joueur démarqué.  S’appliquer sur la Passe.\nIdentifier rapidement une position de tir seul\nAlternative je passe ou je passe.\n\nNPB : se déplacer autour du PB de balle pour lui offrir des solutions permanentes.\n\nTireur : Coordonner rapidement réception du ballon- tir \nêtre stable au moment du pour un tir de plain-pied\nTir en course ou lay-up","Investissement énergétique\n\nAccepter de défendre pendant plusieurs répétitions.\n\nPersévérer pour essayer de récupérer un ballon ou pour réussir un shoot.\n\nRespect des règles.","On peut l’autoriser à revenir défendre une fois que les attaquants ont dépassés sa zone.\nRajouter un 3ème défenseur qui part en retard spatial depuis un plot situé en arrière des attaquants.","Zone de 5m par 5m au milieu du terrain dans laquelle se place un défenseur qui ne peut pas sortir."]
[" CA",null,null,null,"Organiser la sortie de balle en différenciant les rôles","Tirer au panier en étant en position de tir seul",null,"1er temps : 3 défenseurs et un att. Att shoote et ne participe plus au jeu. Le défenseur placé dans la raquette devient rebondeur et passe à un joueur légèrement redescendu (à droite ou à gauche). Celui qui a le ballon devient meneur et soit il dribble et passe / soit il passe. 3 défenseurs et 2 att. Même principe sauf que les deux att vont avoir une contrainte : faire le tour d'un plot placé sur le côté. ",null,null,null,null,null,"6/10 tirs en double pas INDICATEURS : temps 8 sec / 2 à 4 passes / shoot seul / Tir en course",null,null,null,null,"Augmenter nombre de défenseurs / Distance des plots / Variation des contraintes pour les attaquants"]
["CA après rebond",null,null,null,"Jeu rapide en 3 contre 3 suite à la prise du rebond","Récupérer le ballon au rebond et aller marquer le plus rapidement possible de l’autre côté",null,"Les joueurs se positionnent par 2 dans la zone réservée (couples attaquant-défenseur) en se plaçant face au cercle, fléchis, épaule contre épaule, et en se poussant latéralement tout en se préparant à jouer le rebond.\n     \nL’entraîneur tire (si possible un tir manqué !) et l’équipe qui prend le rebond joue la contre attaque contre l’autre équipe.",null,null,null,null,null,null,null,null,null,null,"Au lieu de se pousser, les joueurs peuvent se déplacer en continu dans la zone réservée, puis essayer de prendre la position préférentielle au rebond dès l’annonce du tir par l’entraîneur (\" tir \")."]
["CA 3c(1+1+1)",null,null,null,"Perfectionnement de la passe de contre attaque","Aller marquer au panier",null,"A, B et C attaquent contre 1, 2 et 3, ces derniers ne pouvant défendre que dans une zone définie du terrain (1 sur le premier tiers, 2 sur le deuxième tiers et 3 sur le dernier tiers --> voir schéma).\nw En fonction du niveau de ses joueurs, l’entraîneur pourra interdire le dribble ou n’autoriser qu’un certain nombre de dribbles.",null,null,null,null,null,null,null,null,null,null,"On autorise les attaquants à défendre sur toute la zone se situant initialement derrière eux (1 sur tout le terrain, 2 sur les deux tiers du terrain, 3 sur le dernier tiers de terrain).\nw on place A, B et C dans la raquette (placement en triangle) ; 1 tire et joue le rebond offensif, puis on enchaîne le même exercice."]
["CA 3c1",null,null,null,"Perception du jeu en situation de jeu rapide","Marquer le panier",null,"Le ballon est posé sur la ligne pointillée des lancer-francs. Un attaquant A est face au panier, en tête de raquette ; 2 autres attaquants, B et C, sont sous le panier, en ligne de fond, face au panier adverse ; un défenseur D est placé entre B et C.\n\nLorsque A va prendre le ballon, il va pivoter et courir le plus vite possible en dribblant vers le panier adverse ; ses partenaires B et C partent en sprint dans les couloirs latéraux au moment de la prise du ballon, afin de dépasser A et de recevoir le ballon pour tirer ; A choisit l’attaquant qui n’est pas marqué par le défenseur D.",null,null,null,null,null,null,null,null,null,null,"On met 2 défenseurs qui choisissent préalablement leur joueur (A, B ou C).\nOn pratique l’exercice sur demi-terrain : A prend le ballon, pivote et regarde s’il peut passer ou partir en dribble le plus vite possible pour tirer."]
["CA couloirs",null,null,null,"Apprendre à se démarquer vers le cercle","Atteindre la zone de marque collectivement pour tenter un tir\nGagner le match en 2 contre 2 en utilisant les passeurs",null,"- 3 couloirs\n- Match en 2 contre 2 avec passeur fixes dans le couloir central\n- Pas de couloir près du cercle\n\n- 10 attaques successives\n\n- 1pt si tentative de tir\n- 2 pts si panier marqué\n\n- Les passeurs ne peuvent pas se passer la balle ",null,null,null,"- Atteindre la zone de marque 7 fois sur 10\n- Réaliser 6 tires sur 10 attaques",null,null,null,"- Se démarquer vers le cercle\n- Les passeurs sont forcement des attaquants","- Changer de rythme, vers le cercle\n- Réception dans le couloir\n- Réception orienté vers le cercle "]
["CA 3C2 TT",null,null,null,"Utiliser efficacement la contre-attaque","Marquer un panier le plus rapidement possible après la récupération du ballon",null,"Les 2 attaquants rouges se placent derrière les plots situés près du milieu du terrain.\n Les 3 défenseurs démarrent derrière la ligne de fond de terrain. \nDès que le ballon est en mouvement, l’action commence et les défenseurs peuvent entrer sur le terrain. Les 2 joueurs attaquants essaient de marquer. Si les 3 défenseurs récupèrent le ballon ils deviennent attaquants et doivent aller marquer rapidement sur l’autre panier.\n\nLe passage est terminé lorsque :\n-un panier est marqué (2pts)\n-le ballon est intercepté par les défenseurs rouges (1pt)\n10 Passages par équipes",null,null,null,null,null,"Les Verts récupèrent rapidement le ballon et tirent 7 fois sur 10 avant le retour des défenseurs. LA balle progresse vers la cible adverse en moins de 5 secondes. Les verts marquent entre 12 et 20 pts. ",null,"Je sais  que le ballon va plus vite que moi ! \n\nJe connais les éléments me permettant de décider de la mise en place d’un jeu rapide vers l’avant (à la récupération du ballon) : y’a-t-il un défenseur devant moi ? \nY’a-t-il un partenaire plus proche du panier que moi ?","PB : Dès récupération du ballon lever la tête pour progresser en dribble si CJD est libre ou passer à un partenaire mieux placé que moi (plus proche de la cible et sans pression adverse). \nNPB : Se placer et se déplacer à distance de passe (environ 5-6m) et dans un espace libre (en avant et sur les cotés)\nDéf. : se placer en opposition entre le PB et le NPB\nRevenir rapidement pour empêcher l’adversaire de tirer.\nDéfendre sans contact.\nCollectivement : Dès récupération du ballon, rechercher le plus rapidement possible un jeu rapide vers l’avant (contre-attaque).","Investissement énergétique\n\nAccepter de défendre pendant plusieurs répétitions.\nRespect des règles.\nEncourager, proposer des solutions, relativiser les erreurs de chacun et le score \n\nTenir compte des conseils donnés par ses partenaires et l’enseignant  en les considérant comme une aide et non comme une critique.","on rajoute un défenseur en retard spatial derrière le fond du terrain qui peut rentrer à différents moments : Dès la perte du ballon par son équipe. Dès que les attaquants ont dépassés le milieu. Dès qu’un tir est tenté.","1 contre 3 - Un seul attaquant rouge au départ de l’action qui essaie de marquer."]
["2 contre 1 diago",null,null,null,"Améliorer la réactivité et la prise d’information","Marquer le panier",null,null,null,null,null,null,null,null,null,null,"CE après rebond\nEt jeu rapide Quand je récupère, je regarde vers l’avant et sur les cotés.\n-Je fais une course courbe pour réclamer le ballon sur les cotés.\n\nCE après interception\n-je progresse vers l’avant tant qu’il n’y a personne devant moi, puis recherche d’appuis ou de relais.\nCE prise d’information\nJe m’assure de la possibilité de la passe, sinon je conserve la balle ?",null," Inclure une notion de temps (moins de 15s pour marquer)\nDonner la possibilité de repli défensif au premier défenseur.","Défense mains dans le dos"]
["PASSE EN-BUT",null,null,null,"Apprendre à progresser à plusieurs et à faires passes courtes ","marquer un point en faisant une passe à rebond à un coéquipier situé dans l'en but",null,"aller marquer un point en se faisant des passes. Le point est marqué si le dernier passeur fait une passe à un coéquipier dans l'en but.",null,null,null,null,null,"Le point est marqué"]
["PASSE A 10",null,null,null,"SE DEMARQUER POUR RECEVOIR LE BALLON","Réaliser 10 passes consécutives au sein de la même équipe sans se faire\nintercepter le ballon.",null,"Score :\n- L’équipe marque 1 point si elle fait 5 passes consécutives \n\nRègles : \n1-Dans un 1er temps il est possible de dribbler. Les passes peuvent être faites avec rebonds. \nJ’ai 5 secondes pour faire la passe\n\nIl est interdit de toucher un adversaire qui détient le ballon : règle 1 du non-contact. \nLes seules possibilités d’action lorsqu’on est défenseur sont de gêner son adversaire ou de taper dans le ballon, mais sans toucher les mains.\n\n2-Dans un second temps le dribble est interdit\nJe peux utiliser mon pied de pivot\n",null,null,null,null,null,"On réussit à marquer au moins 2 pts\nPas de fautes ",null,"Je connais les règles du basket\n\nJe connais la définition du pied de pivot : C'est l'action de déplacer un pied dans une ou plusieurs directions, en gardant toujours l'autre pied en contact avec le sol\n\nJe connais les 3 principaux types de passes (cloche, tendu, rebond)","PB : Dès réception du ballon, lever la tête pour transmettre le ballon à un partenaire démarqué\nContenus de la passe et de la réception. Protection du ballon grâce au pied de pivot\n(voir fiche PASSE-RECEPTION PASSE)\nNPB : Se placer et se déplacer à distance de passe (environ 5-6m) et dans un espace libre \nRompre l’alignement PB-Défenseur.\nDéf. : se replacer rapidement face au PB pour gêner sa passe en se grandissant et en utilisant ses bras comme une étoile. \nMaîtriser la distance de sécurité à l’adversaire en maîtrisant la fréquence des appuis pour ne pas percuter le défenseur.","Je fais les efforts pour mon équipe. \nSi un joueur ne fait pas les efforts c’est toute l’équipe qui est déséquilibrée","Au coup de sifflet l’équipe en possession du ballon joue la contre attaque pour aller marquer sur l’autre panier\nTir possible après les 5 passes L’équipe marque 2 points si après les 5 passes elle réussit à marquer un panier.\nOn ne peut pas remettre à celui qui vient de nous faire la passe.\nOn marque 1pt après 10 passes\n1, 2, ou 3 crédits de dribble autorisés","Distance de 1m50 (un grand bras) entre le défenseur et le PB\nDivers : Varier le temps pour faire la passe (3sec, 8sec…). Varier les dimensions du terrain (énergétique – technique). Varier le nombre de joueur (pression)"]
["ALTERNATIVE CA/AP",null,null,null,"Faire des choix offensifs selon le rapport de force","Atteindre la cible et marquer le panier",null,"4 joueurs défenseurs qui vont rentrer en jeu en fonction de l’annonce faite par\nle prof\n4 attaquants qui doivent s’adapter au\nnombre défenseurs (4c1+1, 4c3 et 4c4)\n10 répétitions par équipe",null,null,null,null,null,"être en position de tir favorable (pas de défenseur entre le tireur et la cible). Tirer en position de tir seul 7/10",null,"Je connais les règles du basket\n\nJe connais la définition du pied de pivot : C'est l'action de déplacer un pied dans une ou plusieurs directions, en gardant toujours l'autre pied en contact avec le sol\n\nJe connais les 3 principaux types de passes (cloche, tendu, rebond)","En 4 c 1+1\n- Le PB se rend vite vers la cible.\n- NPB, vite vers l’avant dans un autre couloir que le PB.\nEn 4 c 3\n- PB : Vite vers la cible, orienté vers la cible et chercher à fixer le défenseur.\n- NPB : Si non marqué, aller ver l’avant.\nSi marqué : démarquage pour donner des solutions au PB.\nEn 4 c 4\n- PB : orientation vers la cible et fixation du défenseur grâce à la triple menace (passe, tir, dribble).\n- NPB : se libérer du marquage, proposer des solutions de passes (près de la cible et loin de la cible)."]
["AP 4 zones",null,null,null,"S’organiser collectivement pour atteindre la cible face à une défense regroupée.","Atteindre la cible",null,"Un défenseur maximum dans chaque zone délimité par la ligne rouge.\n1 pt pour chaque tir marqué\n1 pt pour chaque interception.\n10 essais par équipe",null,null,null,null,null,"Tirs seuls fréquents\nDu mouvement en permanence",null,null,"PB : jeu de passe rapides ou dribble de pénétration avec protection de la balle pour tirer seul.\nNPB : mouvements permanents pour  recevoir le ballon ou créer des feintes et des brèches dans la défense pour recevoir le ballon démarque.\nDéf. : notion de cylindre personnel dans lequel on ne peut pas défendre. Pas de contacts.",null,"Dribble interdit ou un seul crédit.\nNeutraliser un joueur en le touchant."]
["2c2 STREET",null,null,null,"Situer plus précisément le niveau de jeu des élèves. Constituer des équipes de niveau.","Gagner ses matchs",null,"Montante descendante au temps : 2min\nEquipe qui gagne monte\nEquipe qui perd descend.\nUne zone interdire dans laquelle aucun joueur ne peux aller : carré de 2m par 2m",null,null,null,null,"Match en 2 contre 2 type STREET BALL sur un même panier\nX  équipes de 2 ou 3J (1J remplaçant) \n2 équipes par demi-terrain qui jouent, (une qui arbitre)","Gagner 1 match sur 2\nMarquer au moins 2 paniers/match",null,"Je sais compter les points\nJe connais les règles et sais les repérer.\n\nJe peux annoncer le score à voix haute","PB : Dès récupération du ballon lever la tête pour progresser en dribble si CJD est libre ou passer à un partenaire si c’est bloqué. JE PASSE OU JE PASSE\n\nNPB :Se placer et se déplacer à distance de passe (environ 5-6m) et dans un espace libre ( e avant et sur les cotés)\n\nDéf. : se placer en opposition entre le PB et le NPB\nRevenir rapidement pour empêcher l’adversaire de tirer.\nDéfendre sans contact.\n\nCollectivement : rechercher systématiquement les espaces libres pour créer un décalage","Fair-play\nRespect des règles en auto-arbitrage.\nDiscuter avec les autres joueurs concernant les fautes commises.","ressortir de la zone des 3pts dès que mon équipe récupère le ballon."]
["MATCH\nArrêt sur image",null,null,null,"Gagner le match, comprendre les règles et situer les progrès possibles.","Marquer des paniers. Respecter les règles.",null,"1-distribuer les rôles : arbitres, observateurs, table de marque et se placer à l'endroit correspondant.\n\n2- lorsque l'enseignant siffle on ne bouge plus et on écoute\n\n3-Lorsqu'on n'est pas sur le terrain on doit jouer son rôle correctement (4 arbitres, 4 observateurs, table de marque). Les rôles sont écrits sur les fiches que le prof a déjà placées.",null,null,null,null,null,"On s'arrête au coup de sifflet\nOn fait les efforts pour faire progresser son équipe et tenter de marquer.\nOn s'applique dans son rôle.",null,"Connaître les règles essentielles : le marcher, la reprise de dribble. Le non contact et leur réparation. Utiliser les fihces ressoures pour visualiser les gestes d'arbitrage.\n►Connaître la marque réglementaire\n►Connaître les limites du terrain ( ni la balle ni le joueur à l’extérieur du terrain, la ligne est hors terrain). \n►Connaître  les  zones favorables de tirs (45° par rapport à la planche, cf annexe)\n►Se reconnaître attaquant défenseur \n►Connaître le principe du  jeu en relais\n►Se mettre en projet immédiat : Si je suis  seul j’avance en dribble, si je suis marqué je cherche un partenaire démarqué. \n►Connaître ses ressources : je connais ma distance  de passe maximale, je connais  la localisation de ma réussite maximale au tir.\n►Connaître l’importance des rôles sociaux : arbitre et observateurs","En attaque :\nSe déplacer, se démarquer pour proposer une solution à son partenaire PB.\nA proximité du panier, utiliser le double pas pour se rapprocher du panier et tirer en suspension.\nAu niveau collectif : se placer en losange pour favoriser un étagement et un écartement des joueurs.\n\nEn défense :\nFermer l’accès à la cible en se plaçant entre le PB et la cible. Ecarter les bras, gêner, dissuader.\nIntercepter pour relancer vite vers l’avant.","S’engager avec conviction dans le rôle d’arbitre : co-arbitrer (2 règles / 1 arbitre) : siffler et expliquer sa décision verbalement ou  gestuellement.\n►Tenir la feuille de marque, chronométrer.\nS’engager dans les deux statuts attaquant et défenseur et   maintenir l’engagement  tout au long du match \n► Jouer avec mes deux partenaires quelque soit la composition des équipes\n►Intervenir en défense en respectant la règle absolue du non contact.\n►Persévérer dans la tenue des rôles (joueur, arbitre, responsable du comptage des fautes personnelles et observateur)\n►Respecter les décisions des arbitres","Les arbitres et les observateurs sont autonomes. ","On arrête très fréquemment le jeu pour s'assurer de la bonne compréhnesion des règles, des observables..\n3 dribbles maximum par joueur.\nPanier = 3 points.\nDessus du cerceau = 1 point.\nDéfinir des contrats indivuels et collectif"]
[]
[]
[]
[]
[]
[]
[]
[]
[]
[]
[]
[]
[]
[]
[]
[]
[]
[]
[]
[]
[null,null,null,null,null,null,null,null,null,null,null,null,null,null,null,null,null,null,null,"leve la tête "]
[null,null,null,null,null,null,null,null,null,null,null,null,null,null,null,null,null,null,null,"Simplf"]
[null,null,null,null,null,null,null,null,null,null,null,null,null,null,null,null,null,null,null,"essai"]
[]
[]
[]
[]
[]
[]
[]
[]
[]
[]
[]
[]
[]
[]
[]
[]
[]
[]
[]
[]
[]
[]
[]
[]
[]
[]
[]
[]
[]
[]
[]
[]
[]
[]
[]
[]
[]
[]
[]
[]
[]
[]
[]
[]
[]
[]
[]
[]
[]
[]
[]
[]
[]
[]
[]
[]
[]
[]
[]
[null,"SA98"]
[null,"SA99"]
[null,"SA100"]
[]
[]
[]
[]
[]
[]
[]
[]
[]
[]
[]
[]
[]
[]
[]
[]
[]
[]
[]
[]
[]
[]
[]
[]
[]
[]
[]
[]
[]
[]
[]
[]
[]
[null,"SA134"]
[null,"SA31","Progresser au filet","N1","Différencier frappe main hte et frappe main basse : la frappe main hte",null,"Routine"]
[null,"SA32","Progresser au filet","N1","Différencier frappe main hte et frappe main basse : la frappe main hte",null,"Multi-volants","1- lancer à la main côté RV\n2- frappe main basse côté RV\n"]
[null,"SA33","Progresser au filet","N1","Différencier côté RV et côté CD au filet",null,"Multi-volants"]
[null,"SA34","Progresser au filet","N1","Envoyer loin et près depuis le filet : viser une zone depuis le filet",null,"Multi-volants","1- envoi volant à la main\n2a – renvoi court      2b – renvoi lg\n"]
[null,"SA35","Progresser au filet","N1","Envoyer loin et près depuis le filet : viser une zone depuis le filet",null,"Multi-volants","1 – lancer  2 -Renvoi court",null,"3 lancer   4 – renvoi long"]
[null,"SA36","Progresser au filet","N1"]
[null,"SA37","Progresser au filet","N2","Lift",null,"Multi-volants","1- envoi à la main \n2- lift\n"]
[null,"SA38","Progresser au filet","N2","Lift Côté droit et côté RV",null,"Multi-volants"]
[null,"SA39","Progresser au filet","N2","CA",null,"Multi-volants"]
[null,"SA40","Progresser au filet","N2","CA et Lift",null,"Multi-volants"]
[null,"SA41","Progresser au filet","N2","CA et Lift : prendre infos depuis zone avant",null,"Séquence de jeu","choix du lift ou amorti en fn du déplacement de l’adversaire complice"]
[null,"SA42","Progresser au filet","N2","Avoir des solutions techniques au filet",null,"Match à thème","zone de jeu bonifiée si adv commet une faute en posant au moins un pied dans la zone"]
[null,"SA43","Progresser au filet","N3","Lift côté CD ou RV",null,"Multi-volants","Joueur debout sur un plinth"]
[null,"SA44","Progresser au filet","N3","CA et Lift",null,"Multi-volants"]
[null,"SA45","Progresser au filet","N3","CA après déplacement",null,"Volant continu","1- S long 2- amorti",null,"3 et 4- CA   5- lift"]
[null,"SA46","Progresser au filet","N3","CA et lift",null,"Match à thème","S court imposé puis jeu libre"]
[null,"SA47","Progresser au filet","N3","CA et Lift : prise de décision du joueur",null,"Match à thème","S long – amorti puis jeu libre"]
[null,"SA48","Progresser au filet","N3","CA et Lift : prise de décision du joueur",null,"Match à thème","Mort subite : si le J parvient à réaliser un coup gagnant (adv ne peut toucher) alors qu’il se trouvait en zone avt il remporte immédiatement le match "]
[null,"SA49","Progresser au filet","N4","Automatisation des lifts : 1- croisés – 2 : croisés et droits - 3- lifts",null,"Multi-volants"]
[null,"SA50","Progresser au filet","N4","Automatisation des lifts : 1- croisés – 2 : croisés et droits - 3- lifts",null,"Multi-volants","J envoi le volant en fn de la position du partenaire vert"]
[null,"SA51","Progresser au filet","N4","Automatisation des lifts : 1- croisés – 2 : croisés et droits - 3- lifts",null,null,"1-déplacement diagonal : mime un smash 2_ relance au filet 3-lift croisé"]
[null,"SA52","Progresser au filet","N4","Découverte du CA croisé",null,"Multi-volants"]
[null,"SA53","Progresser au filet","N4","Production de traj droites et croisés en zone avt",null,"Volant continu"]
[null,"SA54","Progresser au filet","N4","Utilisation des traj croisées depuis la zone avt",null,"Match à thème","Lorsque le volant arrive en zone avt le J est obligé de renvoyer en croisé"]
[null,"SA22","Progresser au fond de court","N4","Smash droit depuis ¾ court",null,"Volant continu","1- S long ¾                 2- Smash droit",null,"3- Défense courte droite          4- CA\n5- Lift droit ¾           6- Smash droit\n"]
[null,"SA23","Progresser au fond de court","N4","Régularité",null,"Match à thème","1- S long   2- Dégagement droit",null,"3a- smash droit   3b – Amorti croisé         4 – jeu libre"]
[null,"SA57"]
[null,"SA58"]
["Tactique","SA59"]
[null,"SA60","Progresser tactiquement","N1","Chercher à atteindre une cible pr marquer des pts",null,"Multi-volants","1- envoi 2- vise la cible = lob) 3- tente interception"]
[null,"SA61","Progresser tactiquement","N1","Envoyer le V ds l’espace libre pr gagner des pts",null,"Match à thème","Les 3 J choisissent une zone et ne peuvent plus sortir"]
[null,"SA62","Progresser tactiquement","N1","Evaluer le niveau de l’adv et faire des choix appropriés",null,"Match à thème","Match je choisis petit ou gd T pr moi ou mon adv. Victoire modulée selon le T."]
[null,"SA63","Progresser tactiquement","N1","Entrer ds la logique du duel. Connaitre les règles du jeu",null,"Match à thème","Mort subite : Faire tomber directement le V au sol"]
[null,"SA64","Progresser tactiquement","N1","Entrer ds la logique du duel. Connaitre les règles du jeu",null,"Match à thème","Pronostics : Avant le match on annonce le score final !"]
[null,"SA65","Progresser tactiquement","N1"]
[null,"SA66","Progresser tactiquement","N2","Chercher à atteindre une cible libérée pr marquer des pts",null,"Jeu","1- mise en jeu mi court 2a- frappe qui vise fond de court 2b- frappe qui vise mi court opposé"]
[null,"SA67","Progresser tactiquement","N2","Envoyer un volant difficile à l’adversaire",null,"Multi-volants","1- mise en jeu 2, 3, 4- renvoi mi court 5- attaque"]
[null,"SA68","Progresser tactiquement","N2","Envoyer un volant difficile à l’adversaire",null,"Match à thème","Zone rose = bonus\nElle peut être librement placée\n"]
[null,"SA69","Progresser tactiquement","N2","Envoyer un volant difficile à l’adversaire",null,"Match à thème","Je choisis la zone de mon coup fort et la zone de son coup faible"]
[null,"SA70","Progresser tactiquement","N2","Rompre l’échange. Envoyer V difficile à l’adv",null,"Match à thème","Gagner le pts à l’issue du 4ème échange. Sinon LET et donné à l’adv."]
[null,"SA71","Progresser tactiquement","N2"]
[null,"SA72","Progresser tactiquement"]
[null,"SA73","Progresser tactiquement","N3","Créer un espace libre sur T adv",null,"Match à thème","zone bonus"]
[null,"SA74","Progresser tactiquement","N3","Adaptation des choix (S, amorti, dégagé) en fn de la position adv ",null,"Match à thème","1-S long obligatoire 2- Dégagement obligatoire 3-libre"]
[null,"SA75","Progresser tactiquement","N3","Adaptation des choix (S, amorti, dégagé) en fn de la position adv ",null,"Match à thème","1- S court  2- lift  3- libre"]
[null,"SA76","Progresser tactiquement","N3","Utilisation de son pt fort pr marquer le pt",null,"Match à thème","Zone en or, je gagne directement la rencontre si le V tombe au sol sinon match en 11pts\nVariante : placer la zone en or ailleurs\n"]
[null,"SA77","Progresser tactiquement","N3","Mise en jeu en fn de l’adv : avoir un projet de service",null,"Match à thème","3pts  si je marque avt le 4ème coup"]
[null,"SA78","Progresser tactiquement","N3"]
[null,"SA79","Progresser tactiquement"]
[null,"SA80","Progresser tactiquement","N4","Jouer aux 4 angles du T pr ne pas laisser l’opportunité à l’adv, pr le faire courir",null,"Match à thème","Faire une croix au sol lorsque le V n’est pas touché"]
[null,"SA81","Progresser tactiquement","N4","Jouer aux 4 angles du T pr ne pas laisser l’opportunité à l’adv, pr le faire courir",null,"Match à thème","Ne pas jouer 2 fois de suite ds la même zone, V faute si il tombe ailleurs"]
[null,"SA82","Progresser tactiquement","N4","Jouer aux 4 angles du T pr ne pas laisser l’opportunité à l’adv, pr le faire courir",null,"Match à thème","Remporte la victoire immédiatement si V tombe ds la zone en or"]
[null,"SA83","Progresser tactiquement","N4","Adapter le retour de S à la qualité du S",null,"Match à thème","3pts s’il marque en retour de S\n1- S lg obligatoire\n2a- D droit si S lg ou 2b-D droit, smash croisé, amorti croisé si S pas assez lg\n"]
[null,"SA84","Progresser tactiquement","N4","Gérer les fins de set : marquer au + vite les derniers pts. Etre combatif jusqu’au bout",null,"Match à thème","Handicap de 5pts. Gagnant est celui qui a marqué le + de pts qd son adv débutait à 5"]
[null,"SA85","Progresser tactiquement","N4",null,null,null,"Tiré au sort une intention tactique : kill, débordement, contre pied, feinte, provoqué la faute, agression, CA"]
[null,"SA86","Progresser tactiquement"]
[null,"SA87"]
[null,"SA88","Progresser au service","N1 et 2","Viser une zone pour son premier rebond au service",null,"Routine","fermer sa raquette afin de renvoyer la balle dans un secteur proche de soi (zone tracée à la craie)",null,"V : modifier la zone"]
[null,"SA89","Progresser au service","N2","Viser des zones sur le terraion adverse au service (jouer placé)",null,"Routine","Réaliser 10 services sans toucher la feuille du bingo puis ouvrir un côté, jusqu'à ce que le Bingo soit ouvert totalement et représente une croix sur la table",null,"V : jouer le point"]
[null,"SA90","Progresser au service","N3","Matchs avec 1 service chacun et un surfilet ou une plaque",null,"Match à thème","obligation de passer sous le surfilt au service sinon point à l'adversaire",null,"V : modifier la hauteur ou ajouter une plaque cartonnée perpendiculaire à la table au fond et au centre à éviter"]
[null,"SA91"]
[null,"SA15","Progresser au fond de court","N3","LE dégagement de fond de court",null,"Volant continu","1a- S long\n1b – renvoi court\n"]
[]
[null,"SA17","Progresser au fond de court","N3","Le smash de FC. MCR",null,"Séquence de jeu","1 – envoi court    2- CA",null,"3- lift ¾ court   4 - smash"]
[null,"SA18","Progresser au fond de court","N4","Amorti droit – amorti croisé",null,"Volant continu","1a – lift droit\n1b – lift croisé\n"]
[null,"SA19","Progresser au fond de court","N4","Amorti droit – amorti croisé",null,"Volant continu","1- lift droit   2- amorti droit",null,"3- lift droit   4 – amorti croisé"]
[null,"SA97"]