{"text_format":"1","workbook":"xlsx","n_sheets":9,"sheets":["MICKAPPS","EQUIPES","OBS1","OBS2","OBS3","OBS4","STATS CLASSE","APPEL","DEBUT"],"not_rendered":{"charts":0,"images":2,"macros":0,"external_links":0,"defined_names":15,"comments":4,"pivot_tables":0},"unopened":[],"bounds":{"document_bytes":16777216,"sheet_cells":100000,"rows_first":2000,"rows_last":500,"rows_between":2000,"halvings":0,"cell_chars":16384,"cell_head_chars":4096},"cells_cut":0,"cells_raw":0,"read":"whole","date_system":"1900"}

{"sheet":"MICKAPPS","index":0,"n_rows":24,"n_cols":8,"rows_kept":24,"cut":false,"hidden":false,"merged":[[15,3,15,6],[22,7,22,10],[23,7,23,10]]}
[]
[]
[]
[]
[]
[]
[]
[]
[]
[]
[]
[]
[]
[]
[]
[null,null,null,"BB COACH"]
[]
[]
[]
[]
[]
[]
[null,null,null,null,null,null,null,"mickael.da-costa@ac-lyon.fr"]
[null,null,null,null,null,null,null,"http://ac.mick.eps.free.fr"]

{"sheet":"EQUIPES","index":1,"n_rows":11,"n_cols":8,"rows_kept":11,"cut":false,"hidden":false,"merged":[]}
[]
["Classe ","1TU",null,{"$f":"B2","v":"1TU"},null,{"$f":"B2","v":"1TU"},null,{"$f":"B2","v":"1TU"}]
["COULEUR","BLEU",null,"JAUNE",null,"ORANGE",null,"VERT"]
["Arbitre","Alexis F.",null,"Alexandre",null,"Emmanuel",null,"Gwen"]
["Arbitre",null,null,"Anthony",null,"Eric",null,"Marco"]
["Observateur"]
["Observateur"]
["Score"]
["Score"]
["Autre"]
["Autre","Emmanuel"]

{"sheet":"OBS1","index":2,"n_rows":72,"n_cols":34,"rows_kept":72,"cut":false,"hidden":false,"merged":[[67,4,67,5],[68,4,68,5],[69,4,69,5],[68,10,68,11],[64,6,64,7],[65,6,65,7],[66,6,66,7],[67,6,67,7],[68,6,68,7],[69,6,69,7],[62,12,62,14],[63,12,63,14],[64,12,64,14],[65,12,65,14],[66,12,66,14],[67,12,67,14],[68,12,68,14],[69,12,69,14],[61,24,62,24],[61,25,62,25],[61,26,62,26],[61,27,62,27],[61,28,62,28],[61,29,62,29],[61,30,62,30],[61,31,62,31],[63,24,64,24],[63,25,64,25],[63,26,64,26],[63,27,64,27],[63,28,64,28],[63,29,64,29],[63,30,64,30],[63,31,64,31],[57,24,58,24],[57,25,58,25],[57,26,58,26],[57,27,58,27],[57,28,58,28],[57,29,58,29],[57,30,58,30],[57,31,58,31],[59,31,60,31],[59,30,60,30],[59,29,60,29],[59,28,60,28],[59,27,60,27],[59,26,60,26],[59,25,60,25],[59,24,60,24],[26,20,26,21],[27,20,27,21],[28,20,28,21],[29,20,29,21],[30,20,30,21],[31,20,31,21],[32,20,32,21],[33,20,33,21],[1,14,1,15],[25,20,25,21],[21,18,21,19],[22,18,22,19],[23,18,23,19],[24,18,24,19],[25,18,25,19],[26,18,26,19],[27,18,27,19],[28,18,28,19],[29,18,29,19],[26,14,26,15],[27,14,27,15],[28,14,28,15],[29,14,29,15],[30,14,30,15],[1,3,1,4],[30,18,30,19],[32,18,32,19],[33,18,33,19],[5,20,5,21],[6,20,6,21],[7,20,7,21],[8,20,8,21],[9,20,9,21],[10,20,10,21],[11,20,11,21],[12,20,12,21],[13,20,13,21],[14,20,14,21],[15,20,15,21],[16,20,16,21],[17,20,17,21],[18,20,18,21],[19,20,19,21],[20,20,20,21],[21,20,21,21],[22,20,22,21],[23,20,23,21],[24,20,24,21],[31,14,31,15],[32,14,32,15],[33,14,33,15],[5,18,5,19],[6,18,6,19],[7,18,7,19],[8,18,8,19],[9,18,9,19],[10,18,10,19],[11,18,11,19],[12,18,12,19],[13,18,13,19],[14,18,14,19],[15,18,15,19],[16,18,16,19],[17,18,17,19],[18,18,18,19],[19,18,19,19],[20,18,20,19],[31,12,31,13],[32,12,32,13],[33,12,33,13],[5,14,5,15],[6,14,6,15],[7,14,7,15],[8,14,8,15],[9,14,9,15],[10,14,10,15],[11,14,11,15],[12,14,12,15],[13,14,13,15],[14,14,14,15],[15,14,15,15],[16,14,16,15],[17,14,17,15],[18,14,18,15],[19,14,19,15],[20,14,20,15],[21,14,21,15],[22,14,22,15],[23,14,23,15],[24,14,24,15],[25,14,25,15],[21,12,21,13],[22,12,22,13],[23,12,23,13],[24,12,24,13],[25,12,25,13],[26,12,26,13],[27,12,27,13],[28,12,28,13],[29,12,29,13],[26,6,26,7],[27,6,27,7],[28,6,28,7],[29,6,29,7],[30,6,30,7],[31,6,31,7],[32,6,32,7],[33,6,33,7],[5,12,5,13],[6,12,6,13],[7,12,7,13],[8,12,8,13],[9,12,9,13],[10,12,10,13],[11,12,11,13],[12,12,12,13],[13,12,13,13],[14,12,14,13],[15,12,15,13],[16,12,16,13],[17,12,17,13],[18,12,18,13],[19,12,19,13],[20,12,20,13],[31,4,31,5],[32,4,32,5],[33,4,33,5],[5,6,5,7],[6,6,6,7],[7,6,7,7],[8,6,8,7],[9,6,9,7],[10,6,10,7],[11,6,11,7],[12,6,12,7],[13,6,13,7],[14,6,14,7],[15,6,15,7],[16,6,16,7],[17,6,17,7],[18,6,18,7],[19,6,19,7],[20,6,20,7],[21,6,21,7],[22,6,22,7],[23,6,23,7],[24,6,24,7],[25,6,25,7],[22,4,22,5],[23,4,23,5],[24,4,24,5],[25,4,25,5],[26,4,26,5],[27,4,27,5],[28,4,28,5],[29,4,29,5],[30,4,30,5],[30,12,30,13],[31,18,31,19],[45,24,46,24],[45,25,46,25],[45,26,46,26],[45,27,46,27],[45,28,46,28],[45,29,46,29],[45,30,46,30],[39,24,40,24],[39,25,40,25],[39,26,40,26],[39,27,40,27],[39,28,40,28],[39,29,40,29],[39,30,40,30],[35,24,36,24],[35,25,36,25],[35,26,36,26],[35,27,36,27],[35,28,36,28],[35,29,36,29],[35,30,36,30],[45,13,46,13],[45,31,46,31],[47,24,48,24],[47,25,48,25],[47,26,48,26],[47,27,48,27],[47,28,48,28],[47,29,48,29],[47,30,48,30],[47,31,48,31],[39,31,40,31],[41,24,42,24],[41,25,42,25],[41,26,42,26],[41,27,42,27],[41,28,42,28],[41,29,42,29],[41,30,42,30],[41,31,42,31],[35,31,36,31],[37,24,38,24],[37,25,38,25],[37,26,38,26],[37,27,38,27],[37,28,38,28],[37,29,38,29],[37,30,38,30],[37,31,38,31],[69,2,69,3],[69,10,69,11],[62,2,62,3],[62,10,62,11],[62,18,69,19],[62,20,69,21],[63,2,63,3],[63,10,63,11],[64,2,64,3],[64,10,64,11],[65,2,65,3],[65,10,65,11],[66,2,66,3],[66,10,66,11],[67,2,67,3],[67,10,67,11],[68,2,68,3],[62,4,62,5],[63,4,63,5],[64,4,64,5],[65,4,65,5],[66,4,66,5],[62,6,62,7],[63,6,63,7],[60,1,60,21],[61,2,61,3],[61,10,61,11],[61,18,61,19],[58,13,59,13],[58,15,59,15],[58,17,59,17],[58,19,59,19],[58,21,59,21],[58,3,59,3],[58,5,59,5],[58,7,59,7],[58,9,59,9],[58,11,59,11],[61,4,61,5],[61,20,61,21],[61,12,61,14],[61,6,61,7],[57,12,57,13],[57,14,57,15],[57,16,57,17],[57,18,57,19],[57,20,57,21],[57,2,57,3],[57,4,57,5],[57,6,57,7],[57,8,57,9],[57,10,57,11],[54,13,55,13],[54,15,55,15],[54,17,55,17],[54,19,55,19],[54,21,55,21],[54,3,55,3],[54,5,55,5],[54,7,55,7],[54,9,55,9],[54,11,55,11],[51,13,52,13],[51,15,52,15],[51,17,52,17],[51,19,52,19],[51,21,52,21],[51,3,52,3],[51,5,52,5],[51,7,52,7],[51,9,52,9],[51,11,52,11],[49,13,50,13],[49,15,50,15],[49,17,50,17],[49,19,50,19],[49,21,50,21],[49,3,50,3],[49,5,50,5],[49,7,50,7],[49,9,50,9],[49,11,50,11],[47,13,48,13],[47,15,48,15],[47,17,48,17],[47,19,48,19],[47,21,48,21],[47,3,48,3],[47,5,48,5],[47,7,48,7],[47,9,48,9],[47,11,48,11],[45,15,46,15],[45,17,46,17],[45,19,46,19],[45,21,46,21],[45,3,46,3],[45,5,46,5],[45,7,46,7],[45,9,46,9],[45,11,46,11],[43,13,44,13],[43,15,44,15],[43,17,44,17],[43,19,44,19],[43,21,44,21],[43,3,44,3],[43,5,44,5],[43,7,44,7],[43,9,44,9],[43,11,44,11],[41,13,42,13],[41,15,42,15],[41,17,42,17],[41,19,42,19],[41,21,42,21],[41,3,42,3],[41,5,42,5],[41,7,42,7],[41,9,42,9],[41,11,42,11],[39,13,40,13],[39,15,40,15],[39,17,40,17],[39,19,40,19],[39,21,40,21],[39,3,40,3],[39,5,40,5],[39,7,40,7],[39,9,40,9],[39,11,40,11],[37,13,38,13],[37,15,38,15],[37,17,38,17],[37,19,38,19],[37,21,38,21],[37,3,38,3],[37,5,38,5],[37,7,38,7],[37,9,38,9],[37,11,38,11],[35,13,36,13],[35,15,36,15],[35,17,36,17],[35,19,36,19],[35,21,36,21],[35,3,36,3],[35,5,36,5],[35,7,36,7],[35,9,36,9],[35,11,36,11],[34,2,34,3],[34,4,34,5],[34,6,34,7],[34,8,34,9],[34,10,34,11],[9,2,9,3],[28,2,28,3],[29,2,29,3],[30,2,30,3],[31,2,31,3],[32,2,32,3],[9,4,9,5],[10,4,10,5],[11,4,11,5],[12,4,12,5],[13,4,13,5],[14,4,14,5],[15,4,15,5],[16,4,16,5],[17,4,17,5],[18,4,18,5],[19,4,19,5],[20,4,20,5],[21,4,21,5],[3,12,4,13],[3,14,4,15],[3,16,4,17],[3,18,4,19],[3,20,4,21],[5,2,5,3],[6,2,6,3],[7,2,7,3],[8,2,8,3],[3,2,4,3],[3,4,4,5],[3,6,3,11],[4,6,4,7],[4,8,4,9],[4,10,4,11],[5,4,5,5],[6,4,6,5],[7,4,7,5],[8,4,8,5],[34,12,34,13],[34,16,34,17],[34,18,34,19],[34,20,34,21],[34,14,34,15],[21,2,21,3],[10,2,10,3],[11,2,11,3],[12,2,12,3],[13,2,13,3],[14,2,14,3],[15,2,15,3],[16,2,16,3],[17,2,17,3],[18,2,18,3],[19,2,19,3],[20,2,20,3],[33,2,33,3],[22,2,22,3],[23,2,23,3],[24,2,24,3],[25,2,25,3],[26,2,26,3],[27,2,27,3]]}
[null,"Classe"]
[null,{"$f":"EQUIPES!B2","v":"1TU"},null,{"$f":"EQUIPES!B3","v":"BLEU"},null,"score",0,"-",null,null,null,null,0,"score","ORANGE"]
[null,null,{"$f":"HLOOKUP(C4,$Y$36:$AF$44,9,FALSE)","v":1},{"$f":"HLOOKUP(D4,$Y$36:$AF$44,9,FALSE)","v":{"$error":"#N/A"}},{"$f":"HLOOKUP(E4,$Y$36:$AF$44,9,FALSE)","v":2},{"$f":"(HLOOKUP(F4,DEBUT!#REF!,9,FALSE))","v":{"$error":"#REF!"}},{"$f":"(HLOOKUP(G4,$Y$36:$AF$44,9,FALSE))","v":3},{"$f":"HLOOKUP(H4,$Y$36:$AF$44,9,FALSE)","v":{"$error":"#N/A"}},{"$f":"(HLOOKUP(I4,DEBUT!#REF!,9,FALSE))","v":{"$error":"#REF!"}},{"$f":"(HLOOKUP(J4,DEBUT!#REF!,9,FALSE))","v":{"$error":"#REF!"}},{"$f":"(HLOOKUP(K4,DEBUT!#REF!,9,FALSE))","v":{"$error":"#REF!"}},{"$f":"(HLOOKUP(L4,DEBUT!#REF!,9,FALSE))","v":{"$error":"#REF!"}},{"$f":"(HLOOKUP(M4,$Y$36:$AF$44,9,FALSE))","v":5},{"$f":"HLOOKUP(N4,$Y$36:$AF$44,9,FALSE)","v":{"$error":"#N/A"}},{"$f":"(HLOOKUP(O4,$Y$36:$AF$44,9,FALSE))","v":6},{"$f":"HLOOKUP(P4,$Y$36:$AF$44,9,FALSE)","v":{"$error":"#N/A"}},{"$f":"(HLOOKUP(Q4,DEBUT!#REF!,9,FALSE))","v":{"$error":"#REF!"}},{"$f":"(HLOOKUP(R4,DEBUT!#REF!,9,FALSE))","v":{"$error":"#REF!"}},{"$f":"(HLOOKUP(S4,$Y$36:$AF$44,9,FALSE))","v":7},{"$f":"HLOOKUP(T4,$Y$36:$AF$44,9,FALSE)","v":{"$error":"#N/A"}},{"$f":"(HLOOKUP(U4,$Y$36:$AF$44,9,FALSE))","v":8},{"$f":"HLOOKUP(V4,$Y$36:$AF$44,9,FALSE)","v":{"$error":"#N/A"}}]
[null,null,"FAUTE",null,"BALLON PERDU",null,"POSSESSION",null,null,null,null,null,"TIRS",null,"BONS TIRS",null,"PANIERS",null,"PANIERS",null,"% REUSSITE"]
[null,null,null,null,null,null,0]
[null,1]
[null,2]
[null,3]
[null,4]
[null,5]
[null,6]
[null,7]
[null,8]
[null,9]
[null,10]
[null,11]
[null,12]
[null,13]
[null,14]
[null,15]
[null,16]
[null,17]
[null,18]
[null,19]
[null,20]
[null,21]
[null,22]
[null,23]
[null,24]
[null,25]
[null,26]
[null,27]
[null,28]
[null,29]
[null,30]
[null,{"$f":"D2","v":"BLEU"},{"$f":"(SUMPRODUCT(N(ISTEXT(C6:C35))))","v":0},{"$f":"IF(AND($C$3=1,C36<$Y$46),$Y$48,IF(AND($C$3=1,C36>=$Y$46),$Y$50,IF(AND($C$3=2,C36<$Z$46),$Z$48,IF(AND($C$3=2,C36>=$Z$46),$Z$50,IF(AND($C$3=3,C36<$AA$46),$AA$48,IF(AND($C$3=3,C36>=$AA$46),$AA$50,IF(AND($C$3=4,C36<$AB$46),$AB$48,IF(AND($C$3=4,C36>=$AB$46),$AB$50,IF(AND($C$3=5,C36<$AC$46),$AC$48,IF(AND($C$3=5,C36>=$AC$46),$AC$50,IF(AND($C$3=6,C36<$AD$46),$AD$48,IF(AND($C$3=6,C36>=$AD$46),$AD$50,IF(AND($C$3=7,C36<$AE$46),$AE$48,IF(AND($C$3=7,C36>=$AE$46),$AE$50,IF(AND($C$3=8,C36<$AF$46),$AF$48,IF(AND($C$3=8,C36>=$AF$46),$AF$50))))))))))))))))","v":"Vous êtes bien organisé"},{"$f":"(SUMPRODUCT(N(ISTEXT(E6:E35))))","v":0},{"$f":"IF(AND($E$3=1,C36<$Y$46),$Y$48,IF(AND($E$3=1,C36>=$Y$46),$Y$50,IF(AND($E$3=2,C36<$Z$46),$Z$48,IF(AND($E$3=2,C36>=$Z$46),$Z$50,IF(AND($E$3=3,C36<$AA$46),$AA$48,IF(AND($E$3=3,C36>=$AA$46),$AA$50,IF(AND($E$3=4,C36<$AB$46),$AB$48,IF(AND($E$3=4,C36>=$AB$46),$AB$50,IF(AND($E$3=5,C36<$AC$46),$AC$48,IF(AND($E$3=5,C36>=$AC$46),$AC$50,IF(AND($E$3=6,C36<$AD$46),$AD$48,IF(AND($E$3=6,C36>=$AD$46),$AD$50,IF(AND($E$3=7,C36<$AE$46),$AE$48,IF(AND($E$3=7,C36>=$AE$46),$AE$50,IF(AND($E$3=8,C36<$AF$46),$AF$48,IF(AND($E$3=8,C36>=$AF$46),$AF$50))))))))))))))))","v":"C'est bien vous faites des passes"},{"$f":"(SUMPRODUCT(N(ISTEXT(G6:G35))))","v":0},{"$f":"IF(AND($G$3=1,C36<$Y$46),$Y$48,IF(AND($G$3=1,C36>=$Y$46),$Y$50,IF(AND($G$3=2,C36<$Z$46),$Z$48,IF(AND($G$3=2,C36>=$Z$46),$Z$50,IF(AND($G$3=3,C36<$AA$46),$AA$48,IF(AND($G$3=3,C36>=$AA$46),$AA$50,IF(AND($G$3=4,C36<$AB$46),$AB$48,IF(AND($G$3=4,C36>=$AB$46),$AB$50,IF(AND($G$3=5,C36<$AC$46),$AC$48,IF(AND($G$3=5,C36>=$AC$46),$AC$50,IF(AND($G$3=6,C36<$AD$46),$AD$48,IF(AND($G$3=6,C36>=$AD$46),$AD$50,IF(AND($G$3=7,C36<$AE$46),$AE$48,IF(AND($G$3=7,C36>=$AE$46),$AE$50,IF(AND($G$3=8,C36<$AF$46),$AF$48,IF(AND($G$3=8,C36>=$AF$46),$AF$50))))))))))))))))","v":"Vous êtes où?"},{"$f":"(SUMPRODUCT(N(ISTEXT(I6:I35))))","v":0},{"$f":"IF(AND($I$3=1,C36<$Y$46),$Y$48,IF(AND($I$3=1,C36>=$Y$46),$Y$50,IF(AND($I$3=2,C36<$Z$46),$Z$48,IF(AND($I$3=2,C36>=$Z$46),$Z$50,IF(AND($I$3=3,C36<$AA$46),$AA$48,IF(AND($I$3=3,C36>=$AA$46),$AA$50,IF(AND($I$3=4,C36<$AB$46),$AB$48,IF(AND($I$3=4,C36>=$AB$46),$AB$50,IF(AND($I$3=5,C36<$AC$46),$AC$48,IF(AND($I$3=5,C36>=$AC$46),$AC$50,IF(AND($I$3=6,C36<$AD$46),$AD$48,IF(AND($I$3=6,C36>=$AD$46),$AD$50,IF(AND($I$3=7,C36<$AE$46),$AE$48,IF(AND($I$3=7,C36>=$AE$46),$AE$50,IF(AND($I$3=8,C36<$AF$46),$AF$48,IF(AND($I$3=8,C36>=$AF$46),$AF$50))))))))))))))))","v":{"$error":"#REF!"}},{"$f":"(SUMPRODUCT(N(ISTEXT(K6:K35))))","v":0},{"$f":"IF(AND($K$3=1,C36<$Y$46),$Y$48,IF(AND($K$3=1,C36>=$Y$46),$Y$50,IF(AND($K$3=2,C36<$Z$46),$Z$48,IF(AND($K$3=2,C36>=$Z$46),$Z$50,IF(AND($K$3=3,C36<$AA$46),$AA$48,IF(AND($K$3=3,C36>=$AA$46),$AA$50,IF(AND($K$3=4,C36<$AB$46),$AB$48,IF(AND($K$3=4,C36>=$AB$46),$AB$50,IF(AND($K$3=5,C36<$AC$46),$AC$48,IF(AND($K$3=5,C36>=$AC$46),$AC$50,IF(AND($K$3=6,C36<$AD$46),$AD$48,IF(AND($K$3=6,C36>=$AD$46),$AD$50,IF(AND($K$3=7,C36<$AE$46),$AE$48,IF(AND($K$3=7,C36>=$AE$46),$AE$50,IF(AND($K$3=8,C36<$AF$46),$AF$48,IF(AND($K$3=8,C36>=$AF$46),$AF$50))))))))))))))))","v":{"$error":"#REF!"}},{"$f":"(SUMPRODUCT(N(ISTEXT(M6:M35))))","v":0},{"$f":"IF(AND($M$3=1,C36<$Y$46),$Y$48,IF(AND($M$3=1,C36>=$Y$46),$Y$50,IF(AND($M$3=2,C36<$Z$46),$Z$48,IF(AND($M$3=2,C36>=$Z$46),$Z$50,IF(AND($M$3=3,C36<$AA$46),$AA$48,IF(AND($M$3=3,C36>=$AA$46),$AA$50,IF(AND($M$3=4,C36<$AB$46),$AB$48,IF(AND($M$3=4,C36>=$AB$46),$AB$50,IF(AND($M$3=5,C36<$AC$46),$AC$48,IF(AND($M$3=5,C36>=$AC$46),$AC$50,IF(AND($M$3=6,C36<$AD$46),$AD$48,IF(AND($M$3=6,C36>=$AD$46),$AD$50,IF(AND($M$3=7,C36<$AE$46),$AE$48,IF(AND($M$3=7,C36>=$AE$46),$AE$50,IF(AND($M$3=8,C36<$AF$46),$AF$48,IF(AND($M$3=8,C36>=$AF$46),$AF$50))))))))))))))))","v":"Faut oser tirer"},{"$f":"(SUMPRODUCT(N(ISTEXT(O6:O35))))","v":0},{"$f":"IF(AND($O$3=1,C36<$Y$46),$Y$48,IF(AND($O$3=1,C36>=$Y$46),$Y$50,IF(AND($O$3=2,C36<$Z$46),$Z$48,IF(AND($O$3=2,C36>=$Z$46),$Z$50,IF(AND($O$3=3,C36<$AA$46),$AA$48,IF(AND($O$3=3,C36>=$AA$46),$AA$50,IF(AND($O$3=4,C36<$AB$46),$AB$48,IF(AND($O$3=4,C36>=$AB$46),$AB$50,IF(AND($O$3=5,C36<$AC$46),$AC$48,IF(AND($O$3=5,C36>=$AC$46),$AC$50,IF(AND($O$3=6,C36<$AD$46),$AD$48,IF(AND($O$3=6,C36>=$AD$46),$AD$50,IF(AND($O$3=7,C36<$AE$46),$AE$48,IF(AND($O$3=7,C36>=$AE$46),$AE$50,IF(AND($O$3=8,C36<$AF$46),$AF$48,IF(AND($O$3=8,C36>=$AF$46),$AF$50))))))))))))))))","v":"Pourquoi vos tirs ne rentrent pas ? "},{"$f":"(SUMPRODUCT(N(ISTEXT(Q6:Q35))))","v":0},{"$f":"IF(AND($Q$3=1,C36<$Y$46),$Y$48,IF(AND($Q$3=1,C36>=$Y$46),$Y$50,IF(AND($Q$3=2,C36<$Z$46),$Z$48,IF(AND($Q$3=2,C36>=$Z$46),$Z$50,IF(AND($Q$3=3,C36<$AA$46),$AA$48,IF(AND($Q$3=3,C36>=$AA$46),$AA$50,IF(AND($Q$3=4,C36<$AB$46),$AB$48,IF(AND($Q$3=4,C36>=$AB$46),$AB$50,IF(AND($Q$3=5,C36<$AC$46),$AC$48,IF(AND($Q$3=5,C36>=$AC$46),$AC$50,IF(AND($Q$3=6,C36<$AD$46),$AD$48,IF(AND($Q$3=6,C36>=$AD$46),$AD$50,IF(AND($Q$3=7,C36<$AE$46),$AE$48,IF(AND($Q$3=7,C36>=$AE$46),$AE$50,IF(AND($Q$3=8,C36<$AF$46),$AF$48,IF(AND($Q$3=8,C36>=$AF$46),$AF$50))))))))))))))))","v":{"$error":"#REF!"}},{"$f":"(SUMPRODUCT(N(ISTEXT(S6:S35))))","v":0},{"$f":"IF(AND($S$3=1,C36<$Y$46),$Y$48,IF(AND($S$3=1,C36>=$Y$46),$Y$50,IF(AND($S$3=2,C36<$Z$46),$Z$48,IF(AND($S$3=2,C36>=$Z$46),$Z$50,IF(AND($S$3=3,C36<$AA$46),$AA$48,IF(AND($S$3=3,C36>=$AA$46),$AA$50,IF(AND($S$3=4,C36<$AB$46),$AB$48,IF(AND($S$3=4,C36>=$AB$46),$AB$50,IF(AND($S$3=5,C36<$AC$46),$AC$48,IF(AND($S$3=5,C36>=$AC$46),$AC$50,IF(AND($S$3=6,C36<$AD$46),$AD$48,IF(AND($S$3=6,C36>=$AD$46),$AD$50,IF(AND($S$3=7,C36<$AE$46),$AE$48,IF(AND($S$3=7,C36>=$AE$46),$AE$50,IF(AND($S$3=8,C36<$AF$46),$AF$48,IF(AND($S$3=8,C36>=$AF$46),$AF$50))))))))))))))))","v":"SI vous tirez il faudra être plus précis"},{"$f":"S36/SUM(M36+O36+S36)*100","v":{"$error":"#DIV/0!"}},{"$f":"IF(AND($U$3=1,C36<$Y$46),$Y$48,IF(AND($U$3=1,C36>=$Y$46),$Y$50,IF(AND($U$3=2,C36<$Z$46),$Z$48,IF(AND($U$3=2,C36>=$Z$46),$Z$50,IF(AND($U$3=3,C36<$AA$46),$AA$48,IF(AND($U$3=3,C36>=$AA$46),$AA$50,IF(AND($U$3=4,C36<$AB$46),$AB$48,IF(AND($U$3=4,C36>=$AB$46),$AB$50,IF(AND($U$3=5,C36<$AC$46),$AC$48,IF(AND($U$3=5,C36>=$AC$46),$AC$50,IF(AND($U$3=6,C36<$AD$46),$AD$48,IF(AND($U$3=6,C36>=$AD$46),$AD$50,IF(AND($U$3=7,C36<$AE$46),$AE$48,IF(AND($U$3=7,C36>=$AE$46),$AE$50,IF(AND($U$3=8,C36<$AF$46),$AF$48,IF(AND($U$3=8,C36>=$AF$46),$AF$50))))))))))))))))","v":"Pas de chance"},{"$f":"B36","v":"BLEU"},{"$f":"DEBUT!X36","v":0},{"$f":"DEBUT!Y36","v":"FAUTE"},{"$f":"DEBUT!Z36","v":"BALLON PERDU"},{"$f":"DEBUT!AA36","v":"POSSESSION"},{"$f":"DEBUT!AB36","v":"RECUPERATION B"},{"$f":"DEBUT!AC36","v":"TIRS"},{"$f":"DEBUT!AD36","v":"BONS TIRS"},{"$f":"DEBUT!AE36","v":"PANIERS"},{"$f":"DEBUT!AF36","v":"% REUSSITE"}]
[null,"Contrats ->",null,null,null,null,null,null,null,null,null,null,null,null,null,null,null,null,null,null,null,null,"<-Contrats "]
[null,{"$f":"EQUIPES!B4","v":"Alexis F."},{"$f":"COUNTIF($C$6:$C$35,B38)","v":0},{"$f":"IF(AND($C$3=1,C38<$Y$38),$Y$40,IF(AND($C$3=1,C38>=$Y$38),$Y$42,IF(AND($C$3=2,C38<$Z$38),$Z$40,IF(AND($C$3=2,C38>=$Z$38),$Z$42,IF(AND($C$3=3,C38<$AA$38),$AA$40,IF(AND($C$3=3,C38>=$AA$38),$AA$42,IF(AND($C$3=4,C38<$AB$38),$AB$40,IF(AND($C$3=4,C38>=$AB$38),$AB$42,IF(AND($C$3=5,C38<$AC$38),$AC$40,IF(AND($C$3=5,C38>=$AC$38),$AC$42,IF(AND($C$3=6,C38<$AD$38),$AD$40,IF(AND($C$3=6,C38>=$AD$38),$AD$42,IF(AND($C$3=7,C38<$AE$38),$AE$40,IF(AND($C$3=7,C38>=$AE$38),$AE$42,IF(AND($C$3=8,C38<$AF$38),$AF$40,IF(AND($C$3=8,C38>=$AF$38),$AF$42))))))))))))))))","v":"C'est bien tu gères la distance"},{"$f":"COUNTIF($E$6:$E$35,B38)","v":0},{"$f":"IF(AND($E$3=1,E38<$Y$38),$Y$40,IF(AND($E$3=1,E38>=$Y$38),$Y$42,IF(AND($E$3=2,E38<$Z$38),$Z$40,IF(AND($E$3=2,E38>=$Z$38),$Z$42,IF(AND($E$3=3,E38<$AA$38),$AA$40,IF(AND($E$3=3,E38>=$AA$38),$AA$42,IF(AND($E$3=4,E38<$AB$38),$AB$40,IF(AND($E$3=4,E38>=$AB$38),$AB$42,IF(AND($E$3=5,E38<$AC$38),$AC$40,IF(AND($E$3=5,E38>=$AC$38),$AC$42,IF(AND($E$3=6,E38<$AD$38),$AD$40,IF(AND($E$3=6,E38>=$AD$38),$AD$42,IF(AND($E$3=7,E38<$AE$38),$AE$40,IF(AND($E$3=7,E38>=$AE$38),$AE$42,IF(AND($E$3=8,E38<$AF$38),$AF$40,IF(AND($E$3=8,E38>=$AF$38),$AF$42))))))))))))))))","v":"Bien tu lèves la tête"},{"$f":"COUNTIF($G$6:$G$35,B38)","v":0},{"$f":"IF(AND($G$3=1,G38<$Y$38),$Y$40,IF(AND($G$3=1,G38>=$Y$38),$Y$42,IF(AND($G$3=2,G38<$Z$38),$Z$40,IF(AND($G$3=2,G38>=$Z$38),$Z$42,IF(AND($G$3=3,G38<$AA$38),$AA$40,IF(AND($G$3=3,G38>=$AA$38),$AA$42,IF(AND($G$3=4,G38<$AB$38),$AB$40,IF(AND($G$3=4,G38>=$AB$38),$AB$42,IF(AND($G$3=5,G38<$AC$38),$AC$40,IF(AND($G$3=5,G38>=$AC$38),$AC$42,IF(AND($G$3=6,G38<$AD$38),$AD$40,IF(AND($G$3=6,G38>=$AD$38),$AD$42,IF(AND($G$3=7,G38<$AE$38),$AE$40,IF(AND($G$3=7,G38>=$AE$38),$AE$42,IF(AND($G$3=8,G38<$AF$38),$AF$40,IF(AND($G$3=8,G38>=$AF$38),$AF$42))))))))))))))))","v":"Tu touches le ballon"},{"$f":"COUNTIF($I$6:$I$35,B38)","v":0},{"$f":"IF(AND($I$3=1,I38<$Y$38),$Y$40,IF(AND($I$3=1,I38>=$Y$38),$Y$42,IF(AND($I$3=2,I38<$Z$38),$Z$40,IF(AND($I$3=2,I38>=$Z$38),$Z$42,IF(AND($I$3=3,I38<$AA$38),$AA$40,IF(AND($I$3=3,I38>=$AA$38),$AA$42,IF(AND($I$3=4,I38<$AB$38),$AB$40,IF(AND($I$3=4,I38>=$AB$38),$AB$42,IF(AND($I$3=5,I38<$AC$38),$AC$40,IF(AND($I$3=5,I38>=$AC$38),$AC$42,IF(AND($I$3=6,I38<$AD$38),$AD$40,IF(AND($I$3=6,I38>=$AD$38),$AD$42,IF(AND($I$3=7,I38<$AE$38),$AE$40,IF(AND($I$3=7,I38>=$AE$38),$AE$42,IF(AND($I$3=8,I38<$AF$38),$AF$40,IF(AND($I$3=8,I38>=$AF$38),$AF$42))))))))))))))))","v":{"$error":"#REF!"}},{"$f":"COUNTIF($K$6:$K$35,B38)","v":0},{"$f":"IF(AND($K$3=1,K38<$Y$38),$Y$40,IF(AND($K$3=1,K38>=$Y$38),$Y$42,IF(AND($K$3=2,K38<$Z$38),$Z$40,IF(AND($K$3=2,K38>=$Z$38),$Z$42,IF(AND($K$3=3,K38<$AA$38),$AA$40,IF(AND($K$3=3,K38>=$AA$38),$AA$42,IF(AND($K$3=4,K38<$AB$38),$AB$40,IF(AND($K$3=4,K38>=$AB$38),$AB$42,IF(AND($K$3=5,K38<$AC$38),$AC$40,IF(AND($K$3=5,K38>=$AC$38),$AC$42,IF(AND($K$3=6,K38<$AD$38),$AD$40,IF(AND($K$3=6,K38>=$AD$38),$AD$42,IF(AND($K$3=7,K38<$AE$38),$AE$40,IF(AND($K$3=7,K38>=$AE$38),$AE$42,IF(AND($K$3=8,K38<$AF$38),$AF$40,IF(AND($K$3=8,K38>=$AF$38),$AF$42))))))))))))))))","v":{"$error":"#REF!"}},{"$f":"COUNTIF($M$6:$M$35,B38)","v":0},{"$f":"IF(AND($M$3=1,M38<$Y$38),$Y$40,IF(AND($M$3=1,M38>=$Y$38),$Y$42,IF(AND($M$3=2,M38<$Z$38),$Z$40,IF(AND($M$3=2,M38>=$Z$38),$Z$42,IF(AND($M$3=3,M38<$AA$38),$AA$40,IF(AND($M$3=3,M38>=$AA$38),$AA$42,IF(AND($M$3=4,M38<$AB$38),$AB$40,IF(AND($M$3=4,M38>=$AB$38),$AB$42,IF(AND($M$3=5,M38<$AC$38),$AC$40,IF(AND($M$3=5,M38>=$AC$38),$AC$42,IF(AND($M$3=6,M38<$AD$38),$AD$40,IF(AND($M$3=6,M38>=$AD$38),$AD$42,IF(AND($M$3=7,M38<$AE$38),$AE$40,IF(AND($M$3=7,M38>=$AE$38),$AE$42,IF(AND($M$3=8,M38<$AF$38),$AF$40,IF(AND($M$3=8,M38>=$AF$38),$AF$42))))))))))))))))","v":"Faut oser tirer"},{"$f":"COUNTIF($O$6:$O$35,B38)","v":0},{"$f":"IF(AND($O$3=1,O38<$Y$38),$Y$40,IF(AND($O$3=1,O38>=$Y$38),$Y$42,IF(AND($O$3=2,O38<$Z$38),$Z$40,IF(AND($O$3=2,O38>=$Z$38),$Z$42,IF(AND($O$3=3,O38<$AA$38),$AA$40,IF(AND($O$3=3,O38>=$AA$38),$AA$42,IF(AND($O$3=4,O38<$AB$38),$AB$40,IF(AND($O$3=4,O38>=$AB$38),$AB$42,IF(AND($O$3=5,O38<$AC$38),$AC$40,IF(AND($O$3=5,O38>=$AC$38),$AC$42,IF(AND($O$3=6,O38<$AD$38),$AD$40,IF(AND($O$3=6,O38>=$AD$38),$AD$42,IF(AND($O$3=7,O38<$AE$38),$AE$40,IF(AND($O$3=7,O38>=$AE$38),$AE$42,IF(AND($O$3=8,O38<$AF$38),$AF$40,IF(AND($O$3=8,O38>=$AF$38),$AF$42))))))))))))))))","v":"Pourquoi tes tirs ne rentrent pas ?"},{"$f":"COUNTIF($Q$6:$Q$35,B38)","v":0},{"$f":"IF(AND($Q$3=1,Q38<$Y$38),$Y$40,IF(AND($Q$3=1,Q38>=$Y$38),$Y$42,IF(AND($Q$3=2,Q38<$Z$38),$Z$40,IF(AND($Q$3=2,Q38>=$Z$38),$Z$42,IF(AND($Q$3=3,Q38<$AA$38),$AA$40,IF(AND($Q$3=3,Q38>=$AA$38),$AA$42,IF(AND($Q$3=4,Q38<$AB$38),$AB$40,IF(AND($Q$3=4,Q38>=$AB$38),$AB$42,IF(AND($Q$3=5,Q38<$AC$38),$AC$40,IF(AND($Q$3=5,Q38>=$AC$38),$AC$42,IF(AND($Q$3=6,Q38<$AD$38),$AD$40,IF(AND($Q$3=6,Q38>=$AD$38),$AD$42,IF(AND($Q$3=7,Q38<$AE$38),$AE$40,IF(AND($Q$3=7,Q38>=$AE$38),$AE$42,IF(AND($Q$3=8,Q38<$AF$38),$AF$40,IF(AND($Q$3=8,Q38>=$AF$38),$AF$42))))))))))))))))","v":{"$error":"#REF!"}},{"$f":"COUNTIF($S$6:$S$35,B38)","v":0},{"$f":"IF(AND($S$3=1,S38<$Y$38),$Y$40,IF(AND($S$3=1,S38>=$Y$38),$Y$42,IF(AND($S$3=2,S38<$Z$38),$Z$40,IF(AND($S$3=2,S38>=$Z$38),$Z$42,IF(AND($S$3=3,S38<$AA$38),$AA$40,IF(AND($S$3=3,S38>=$AA$38),$AA$42,IF(AND($S$3=4,S38<$AB$38),$AB$40,IF(AND($S$3=4,S38>=$AB$38),$AB$42,IF(AND($S$3=5,S38<$AC$38),$AC$40,IF(AND($S$3=5,S38>=$AC$38),$AC$42,IF(AND($S$3=6,S38<$AD$38),$AD$40,IF(AND($S$3=6,S38>=$AD$38),$AD$42,IF(AND($S$3=7,S38<$AE$38),$AE$40,IF(AND($S$3=7,S38>=$AE$38),$AE$42,IF(AND($S$3=8,S38<$AF$38),$AF$40,IF(AND($S$3=8,S38>=$AF$38),$AF$42))))))))))))))))","v":"SI tu tires il faudra être plus précis"},{"$f":"S38/SUM(M38+O38+S38)*100","v":{"$error":"#DIV/0!"}},{"$f":"IF(AND($U$3=1,U38<$Y$38),$Y$40,IF(AND($U$3=1,U38>=$Y$38),$Y$42,IF(AND($U$3=2,U38<$Z$38),$Z$40,IF(AND($U$3=2,U38>=$Z$38),$Z$42,IF(AND($U$3=3,U38<$AA$38),$AA$40,IF(AND($U$3=3,U38>=$AA$38),$AA$42,IF(AND($U$3=4,U38<$AB$38),$AB$40,IF(AND($U$3=4,U38>=$AB$38),$AB$42,IF(AND($U$3=5,U38<$AC$38),$AC$40,IF(AND($U$3=5,U38>=$AC$38),$AC$42,IF(AND($U$3=6,U38<$AD$38),$AD$40,IF(AND($U$3=6,U38>=$AD$38),$AD$42,IF(AND($U$3=7,U38<$AE$38),$AE$40,IF(AND($U$3=7,U38>=$AE$38),$AE$42,IF(AND($U$3=8,U38<$AF$38),$AF$40,IF(AND($U$3=8,U38>=$AF$38),$AF$42))))))))))))))))","v":{"$error":"#DIV/0!"}},{"$f":"B38","v":"Alexis F."},null,{"$f":"DEBUT!Y38","v":2},{"$f":"DEBUT!Z38","v":2},{"$f":"DEBUT!AA38","v":2},{"$f":"DEBUT!AB38","v":2},{"$f":"DEBUT!AC38","v":2},{"$f":"DEBUT!AD38","v":2},{"$f":"DEBUT!AE38","v":2},{"$f":"DEBUT!AF38","v":0.2}]
[null,"Contrats ->",null,null,null,null,null,null,null,null,null,null,null,null,null,null,null,null,null,null,null,null,"<-Contrats ","Contrats ind"]
[null,{"$f":"EQUIPES!B5","v":0},{"$f":"COUNTIF($C$6:$C$35,B40)","v":0},{"$f":"IF(AND($C$3=1,C40<$Y$38),$Y$40,IF(AND($C$3=1,C40>=$Y$38),$Y$42,IF(AND($C$3=2,C40<$Z$38),$Z$40,IF(AND($C$3=2,C40>=$Z$38),$Z$42,IF(AND($C$3=3,C40<$AA$38),$AA$40,IF(AND($C$3=3,C40>=$AA$38),$AA$42,IF(AND($C$3=4,C40<$AB$38),$AB$40,IF(AND($C$3=4,C40>=$AB$38),$AB$42,IF(AND($C$3=5,C40<$AC$38),$AC$40,IF(AND($C$3=5,C40>=$AC$38),$AC$42,IF(AND($C$3=6,C40<$AD$38),$AD$40,IF(AND($C$3=6,C40>=$AD$38),$AD$42,IF(AND($C$3=7,C40<$AE$38),$AE$40,IF(AND($C$3=7,C40>=$AE$38),$AE$42,IF(AND($C$3=8,C40<$AF$38),$AF$40,IF(AND($C$3=8,C40>=$AF$38),$AF$42))))))))))))))))","v":"C'est bien tu gères la distance"},{"$f":"COUNTIF($E$6:$E$35,B40)","v":0},{"$f":"IF(AND($E$3=1,E40<$Y$38),$Y$40,IF(AND($E$3=1,E40>=$Y$38),$Y$42,IF(AND($E$3=2,E40<$Z$38),$Z$40,IF(AND($E$3=2,E40>=$Z$38),$Z$42,IF(AND($E$3=3,E40<$AA$38),$AA$40,IF(AND($E$3=3,E40>=$AA$38),$AA$42,IF(AND($E$3=4,E40<$AB$38),$AB$40,IF(AND($E$3=4,E40>=$AB$38),$AB$42,IF(AND($E$3=5,E40<$AC$38),$AC$40,IF(AND($E$3=5,E40>=$AC$38),$AC$42,IF(AND($E$3=6,E40<$AD$38),$AD$40,IF(AND($E$3=6,E40>=$AD$38),$AD$42,IF(AND($E$3=7,E40<$AE$38),$AE$40,IF(AND($E$3=7,E40>=$AE$38),$AE$42,IF(AND($E$3=8,E40<$AF$38),$AF$40,IF(AND($E$3=8,E40>=$AF$38),$AF$42))))))))))))))))","v":"Bien tu lèves la tête"},{"$f":"COUNTIF($G$6:$G$35,B40)","v":0},{"$f":"IF(AND($G$3=1,G40<$Y$38),$Y$40,IF(AND($G$3=1,G40>=$Y$38),$Y$42,IF(AND($G$3=2,G40<$Z$38),$Z$40,IF(AND($G$3=2,G40>=$Z$38),$Z$42,IF(AND($G$3=3,G40<$AA$38),$AA$40,IF(AND($G$3=3,G40>=$AA$38),$AA$42,IF(AND($G$3=4,G40<$AB$38),$AB$40,IF(AND($G$3=4,G40>=$AB$38),$AB$42,IF(AND($G$3=5,G40<$AC$38),$AC$40,IF(AND($G$3=5,G40>=$AC$38),$AC$42,IF(AND($G$3=6,G40<$AD$38),$AD$40,IF(AND($G$3=6,G40>=$AD$38),$AD$42,IF(AND($G$3=7,G40<$AE$38),$AE$40,IF(AND($G$3=7,G40>=$AE$38),$AE$42,IF(AND($G$3=8,G40<$AF$38),$AF$40,IF(AND($G$3=8,G40>=$AF$38),$AF$42))))))))))))))))","v":"Tu touches le ballon"},null,{"$f":"IF(AND($I$3=1,I40<$Y$38),$Y$40,IF(AND($I$3=1,I40>=$Y$38),$Y$42,IF(AND($I$3=2,I40<$Z$38),$Z$40,IF(AND($I$3=2,I40>=$Z$38),$Z$42,IF(AND($I$3=3,I40<$AA$38),$AA$40,IF(AND($I$3=3,I40>=$AA$38),$AA$42,IF(AND($I$3=4,I40<$AB$38),$AB$40,IF(AND($I$3=4,I40>=$AB$38),$AB$42,IF(AND($I$3=5,I40<$AC$38),$AC$40,IF(AND($I$3=5,I40>=$AC$38),$AC$42,IF(AND($I$3=6,I40<$AD$38),$AD$40,IF(AND($I$3=6,I40>=$AD$38),$AD$42,IF(AND($I$3=7,I40<$AE$38),$AE$40,IF(AND($I$3=7,I40>=$AE$38),$AE$42,IF(AND($I$3=8,I40<$AF$38),$AF$40,IF(AND($I$3=8,I40>=$AF$38),$AF$42))))))))))))))))","v":{"$error":"#REF!"}},{"$f":"COUNTIF($K$6:$K$35,B40)","v":0},{"$f":"IF(AND($K$3=1,K40<$Y$38),$Y$40,IF(AND($K$3=1,K40>=$Y$38),$Y$42,IF(AND($K$3=2,K40<$Z$38),$Z$40,IF(AND($K$3=2,K40>=$Z$38),$Z$42,IF(AND($K$3=3,K40<$AA$38),$AA$40,IF(AND($K$3=3,K40>=$AA$38),$AA$42,IF(AND($K$3=4,K40<$AB$38),$AB$40,IF(AND($K$3=4,K40>=$AB$38),$AB$42,IF(AND($K$3=5,K40<$AC$38),$AC$40,IF(AND($K$3=5,K40>=$AC$38),$AC$42,IF(AND($K$3=6,K40<$AD$38),$AD$40,IF(AND($K$3=6,K40>=$AD$38),$AD$42,IF(AND($K$3=7,K40<$AE$38),$AE$40,IF(AND($K$3=7,K40>=$AE$38),$AE$42,IF(AND($K$3=8,K40<$AF$38),$AF$40,IF(AND($K$3=8,K40>=$AF$38),$AF$42))))))))))))))))","v":{"$error":"#REF!"}},{"$f":"COUNTIF($M$6:$M$35,B40)","v":0},{"$f":"IF(AND($M$3=1,M40<$Y$38),$Y$40,IF(AND($M$3=1,M40>=$Y$38),$Y$42,IF(AND($M$3=2,M40<$Z$38),$Z$40,IF(AND($M$3=2,M40>=$Z$38),$Z$42,IF(AND($M$3=3,M40<$AA$38),$AA$40,IF(AND($M$3=3,M40>=$AA$38),$AA$42,IF(AND($M$3=4,M40<$AB$38),$AB$40,IF(AND($M$3=4,M40>=$AB$38),$AB$42,IF(AND($M$3=5,M40<$AC$38),$AC$40,IF(AND($M$3=5,M40>=$AC$38),$AC$42,IF(AND($M$3=6,M40<$AD$38),$AD$40,IF(AND($M$3=6,M40>=$AD$38),$AD$42,IF(AND($M$3=7,M40<$AE$38),$AE$40,IF(AND($M$3=7,M40>=$AE$38),$AE$42,IF(AND($M$3=8,M40<$AF$38),$AF$40,IF(AND($M$3=8,M40>=$AF$38),$AF$42))))))))))))))))","v":"Faut oser tirer"},{"$f":"COUNTIF($O$6:$O$35,B40)","v":0},{"$f":"IF(AND($O$3=1,O40<$Y$38),$Y$40,IF(AND($O$3=1,O40>=$Y$38),$Y$42,IF(AND($O$3=2,O40<$Z$38),$Z$40,IF(AND($O$3=2,O40>=$Z$38),$Z$42,IF(AND($O$3=3,O40<$AA$38),$AA$40,IF(AND($O$3=3,O40>=$AA$38),$AA$42,IF(AND($O$3=4,O40<$AB$38),$AB$40,IF(AND($O$3=4,O40>=$AB$38),$AB$42,IF(AND($O$3=5,O40<$AC$38),$AC$40,IF(AND($O$3=5,O40>=$AC$38),$AC$42,IF(AND($O$3=6,O40<$AD$38),$AD$40,IF(AND($O$3=6,O40>=$AD$38),$AD$42,IF(AND($O$3=7,O40<$AE$38),$AE$40,IF(AND($O$3=7,O40>=$AE$38),$AE$42,IF(AND($O$3=8,O40<$AF$38),$AF$40,IF(AND($O$3=8,O40>=$AF$38),$AF$42))))))))))))))))","v":"Pourquoi tes tirs ne rentrent pas ?"},{"$f":"COUNTIF($Q$6:$Q$35,B40)","v":0},{"$f":"IF(AND($Q$3=1,Q40<$Y$38),$Y$40,IF(AND($Q$3=1,Q40>=$Y$38),$Y$42,IF(AND($Q$3=2,Q40<$Z$38),$Z$40,IF(AND($Q$3=2,Q40>=$Z$38),$Z$42,IF(AND($Q$3=3,Q40<$AA$38),$AA$40,IF(AND($Q$3=3,Q40>=$AA$38),$AA$42,IF(AND($Q$3=4,Q40<$AB$38),$AB$40,IF(AND($Q$3=4,Q40>=$AB$38),$AB$42,IF(AND($Q$3=5,Q40<$AC$38),$AC$40,IF(AND($Q$3=5,Q40>=$AC$38),$AC$42,IF(AND($Q$3=6,Q40<$AD$38),$AD$40,IF(AND($Q$3=6,Q40>=$AD$38),$AD$42,IF(AND($Q$3=7,Q40<$AE$38),$AE$40,IF(AND($Q$3=7,Q40>=$AE$38),$AE$42,IF(AND($Q$3=8,Q40<$AF$38),$AF$40,IF(AND($Q$3=8,Q40>=$AF$38),$AF$42))))))))))))))))","v":{"$error":"#REF!"}},{"$f":"COUNTIF($S$6:$S$35,B40)","v":0},{"$f":"IF(AND($S$3=1,S40<$Y$38),$Y$40,IF(AND($S$3=1,S40>=$Y$38),$Y$42,IF(AND($S$3=2,S40<$Z$38),$Z$40,IF(AND($S$3=2,S40>=$Z$38),$Z$42,IF(AND($S$3=3,S40<$AA$38),$AA$40,IF(AND($S$3=3,S40>=$AA$38),$AA$42,IF(AND($S$3=4,S40<$AB$38),$AB$40,IF(AND($S$3=4,S40>=$AB$38),$AB$42,IF(AND($S$3=5,S40<$AC$38),$AC$40,IF(AND($S$3=5,S40>=$AC$38),$AC$42,IF(AND($S$3=6,S40<$AD$38),$AD$40,IF(AND($S$3=6,S40>=$AD$38),$AD$42,IF(AND($S$3=7,S40<$AE$38),$AE$40,IF(AND($S$3=7,S40>=$AE$38),$AE$42,IF(AND($S$3=8,S40<$AF$38),$AF$40,IF(AND($S$3=8,S40>=$AF$38),$AF$42))))))))))))))))","v":"SI tu tires il faudra être plus précis"},{"$f":"S40/SUM(M40+O40+S40)*100","v":{"$error":"#DIV/0!"}},{"$f":"IF(AND($U$3=1,U40<$Y$38),$Y$40,IF(AND($U$3=1,U40>=$Y$38),$Y$42,IF(AND($U$3=2,U40<$Z$38),$Z$40,IF(AND($U$3=2,U40>=$Z$38),$Z$42,IF(AND($U$3=3,U40<$AA$38),$AA$40,IF(AND($U$3=3,U40>=$AA$38),$AA$42,IF(AND($U$3=4,U40<$AB$38),$AB$40,IF(AND($U$3=4,U40>=$AB$38),$AB$42,IF(AND($U$3=5,U40<$AC$38),$AC$40,IF(AND($U$3=5,U40>=$AC$38),$AC$42,IF(AND($U$3=6,U40<$AD$38),$AD$40,IF(AND($U$3=6,U40>=$AD$38),$AD$42,IF(AND($U$3=7,U40<$AE$38),$AE$40,IF(AND($U$3=7,U40>=$AE$38),$AE$42,IF(AND($U$3=8,U40<$AF$38),$AF$40,IF(AND($U$3=8,U40>=$AF$38),$AF$42))))))))))))))))","v":{"$error":"#DIV/0!"}},{"$f":"B40","v":0},0,{"$f":"DEBUT!Y40","v":"C'est bien tu gères la distance"},{"$f":"DEBUT!Z40","v":"Bien tu lèves la tête"},{"$f":"DEBUT!AA40","v":"Tu touches le ballon"},{"$f":"DEBUT!AB40","v":"Faut se bouger davantage"},{"$f":"DEBUT!AC40","v":"Faut oser tirer"},{"$f":"DEBUT!AD40","v":"Pourquoi tes tirs ne rentrent pas ?"},{"$f":"DEBUT!AE40","v":"SI tu tires il faudra être plus précis"},{"$f":"DEBUT!AF40","v":"Pas de chance"}]
[null,"Contrats ->",null,null,null,null,null,null,null,null,null,null,null,null,null,null,null,null,null,null,null,null,"<-Contrats "]
[null,{"$f":"EQUIPES!B6","v":0},{"$f":"COUNTIF($C$6:$C$35,B42)","v":0},{"$f":"IF(AND($C$3=1,C42<$Y$38),$Y$40,IF(AND($C$3=1,C42>=$Y$38),$Y$42,IF(AND($C$3=2,C42<$Z$38),$Z$40,IF(AND($C$3=2,C42>=$Z$38),$Z$42,IF(AND($C$3=3,C42<$AA$38),$AA$40,IF(AND($C$3=3,C42>=$AA$38),$AA$42,IF(AND($C$3=4,C42<$AB$38),$AB$40,IF(AND($C$3=4,C42>=$AB$38),$AB$42,IF(AND($C$3=5,C42<$AC$38),$AC$40,IF(AND($C$3=5,C42>=$AC$38),$AC$42,IF(AND($C$3=6,C42<$AD$38),$AD$40,IF(AND($C$3=6,C42>=$AD$38),$AD$42,IF(AND($C$3=7,C42<$AE$38),$AE$40,IF(AND($C$3=7,C42>=$AE$38),$AE$42,IF(AND($C$3=8,C42<$AF$38),$AF$40,IF(AND($C$3=8,C42>=$AF$38),$AF$42))))))))))))))))","v":"C'est bien tu gères la distance"},{"$f":"COUNTIF($E$6:$E$35,B42)","v":0},{"$f":"IF(AND($E$3=1,E42<$Y$38),$Y$40,IF(AND($E$3=1,E42>=$Y$38),$Y$42,IF(AND($E$3=2,E42<$Z$38),$Z$40,IF(AND($E$3=2,E42>=$Z$38),$Z$42,IF(AND($E$3=3,E42<$AA$38),$AA$40,IF(AND($E$3=3,E42>=$AA$38),$AA$42,IF(AND($E$3=4,E42<$AB$38),$AB$40,IF(AND($E$3=4,E42>=$AB$38),$AB$42,IF(AND($E$3=5,E42<$AC$38),$AC$40,IF(AND($E$3=5,E42>=$AC$38),$AC$42,IF(AND($E$3=6,E42<$AD$38),$AD$40,IF(AND($E$3=6,E42>=$AD$38),$AD$42,IF(AND($E$3=7,E42<$AE$38),$AE$40,IF(AND($E$3=7,E42>=$AE$38),$AE$42,IF(AND($E$3=8,E42<$AF$38),$AF$40,IF(AND($E$3=8,E42>=$AF$38),$AF$42))))))))))))))))","v":"Bien tu lèves la tête"},{"$f":"COUNTIF($G$6:$G$35,B42)","v":0},{"$f":"IF(AND($G$3=1,G42<$Y$38),$Y$40,IF(AND($G$3=1,G42>=$Y$38),$Y$42,IF(AND($G$3=2,G42<$Z$38),$Z$40,IF(AND($G$3=2,G42>=$Z$38),$Z$42,IF(AND($G$3=3,G42<$AA$38),$AA$40,IF(AND($G$3=3,G42>=$AA$38),$AA$42,IF(AND($G$3=4,G42<$AB$38),$AB$40,IF(AND($G$3=4,G42>=$AB$38),$AB$42,IF(AND($G$3=5,G42<$AC$38),$AC$40,IF(AND($G$3=5,G42>=$AC$38),$AC$42,IF(AND($G$3=6,G42<$AD$38),$AD$40,IF(AND($G$3=6,G42>=$AD$38),$AD$42,IF(AND($G$3=7,G42<$AE$38),$AE$40,IF(AND($G$3=7,G42>=$AE$38),$AE$42,IF(AND($G$3=8,G42<$AF$38),$AF$40,IF(AND($G$3=8,G42>=$AF$38),$AF$42))))))))))))))))","v":"Tu touches le ballon"},null,{"$f":"IF(AND($I$3=1,I42<$Y$38),$Y$40,IF(AND($I$3=1,I42>=$Y$38),$Y$42,IF(AND($I$3=2,I42<$Z$38),$Z$40,IF(AND($I$3=2,I42>=$Z$38),$Z$42,IF(AND($I$3=3,I42<$AA$38),$AA$40,IF(AND($I$3=3,I42>=$AA$38),$AA$42,IF(AND($I$3=4,I42<$AB$38),$AB$40,IF(AND($I$3=4,I42>=$AB$38),$AB$42,IF(AND($I$3=5,I42<$AC$38),$AC$40,IF(AND($I$3=5,I42>=$AC$38),$AC$42,IF(AND($I$3=6,I42<$AD$38),$AD$40,IF(AND($I$3=6,I42>=$AD$38),$AD$42,IF(AND($I$3=7,I42<$AE$38),$AE$40,IF(AND($I$3=7,I42>=$AE$38),$AE$42,IF(AND($I$3=8,I42<$AF$38),$AF$40,IF(AND($I$3=8,I42>=$AF$38),$AF$42))))))))))))))))","v":{"$error":"#REF!"}},{"$f":"COUNTIF($K$6:$K$35,B42)","v":0},{"$f":"IF(AND($K$3=1,K42<$Y$38),$Y$40,IF(AND($K$3=1,K42>=$Y$38),$Y$42,IF(AND($K$3=2,K42<$Z$38),$Z$40,IF(AND($K$3=2,K42>=$Z$38),$Z$42,IF(AND($K$3=3,K42<$AA$38),$AA$40,IF(AND($K$3=3,K42>=$AA$38),$AA$42,IF(AND($K$3=4,K42<$AB$38),$AB$40,IF(AND($K$3=4,K42>=$AB$38),$AB$42,IF(AND($K$3=5,K42<$AC$38),$AC$40,IF(AND($K$3=5,K42>=$AC$38),$AC$42,IF(AND($K$3=6,K42<$AD$38),$AD$40,IF(AND($K$3=6,K42>=$AD$38),$AD$42,IF(AND($K$3=7,K42<$AE$38),$AE$40,IF(AND($K$3=7,K42>=$AE$38),$AE$42,IF(AND($K$3=8,K42<$AF$38),$AF$40,IF(AND($K$3=8,K42>=$AF$38),$AF$42))))))))))))))))","v":{"$error":"#REF!"}},{"$f":"COUNTIF($M$6:$M$35,B42)","v":0},{"$f":"IF(AND($M$3=1,M42<$Y$38),$Y$40,IF(AND($M$3=1,M42>=$Y$38),$Y$42,IF(AND($M$3=2,M42<$Z$38),$Z$40,IF(AND($M$3=2,M42>=$Z$38),$Z$42,IF(AND($M$3=3,M42<$AA$38),$AA$40,IF(AND($M$3=3,M42>=$AA$38),$AA$42,IF(AND($M$3=4,M42<$AB$38),$AB$40,IF(AND($M$3=4,M42>=$AB$38),$AB$42,IF(AND($M$3=5,M42<$AC$38),$AC$40,IF(AND($M$3=5,M42>=$AC$38),$AC$42,IF(AND($M$3=6,M42<$AD$38),$AD$40,IF(AND($M$3=6,M42>=$AD$38),$AD$42,IF(AND($M$3=7,M42<$AE$38),$AE$40,IF(AND($M$3=7,M42>=$AE$38),$AE$42,IF(AND($M$3=8,M42<$AF$38),$AF$40,IF(AND($M$3=8,M42>=$AF$38),$AF$42))))))))))))))))","v":"Faut oser tirer"},{"$f":"COUNTIF($O$6:$O$35,B42)","v":0},{"$f":"IF(AND($O$3=1,O42<$Y$38),$Y$40,IF(AND($O$3=1,O42>=$Y$38),$Y$42,IF(AND($O$3=2,O42<$Z$38),$Z$40,IF(AND($O$3=2,O42>=$Z$38),$Z$42,IF(AND($O$3=3,O42<$AA$38),$AA$40,IF(AND($O$3=3,O42>=$AA$38),$AA$42,IF(AND($O$3=4,O42<$AB$38),$AB$40,IF(AND($O$3=4,O42>=$AB$38),$AB$42,IF(AND($O$3=5,O42<$AC$38),$AC$40,IF(AND($O$3=5,O42>=$AC$38),$AC$42,IF(AND($O$3=6,O42<$AD$38),$AD$40,IF(AND($O$3=6,O42>=$AD$38),$AD$42,IF(AND($O$3=7,O42<$AE$38),$AE$40,IF(AND($O$3=7,O42>=$AE$38),$AE$42,IF(AND($O$3=8,O42<$AF$38),$AF$40,IF(AND($O$3=8,O42>=$AF$38),$AF$42))))))))))))))))","v":"Pourquoi tes tirs ne rentrent pas ?"},{"$f":"COUNTIF($Q$6:$Q$35,B42)","v":0},{"$f":"IF(AND($Q$3=1,Q42<$Y$38),$Y$40,IF(AND($Q$3=1,Q42>=$Y$38),$Y$42,IF(AND($Q$3=2,Q42<$Z$38),$Z$40,IF(AND($Q$3=2,Q42>=$Z$38),$Z$42,IF(AND($Q$3=3,Q42<$AA$38),$AA$40,IF(AND($Q$3=3,Q42>=$AA$38),$AA$42,IF(AND($Q$3=4,Q42<$AB$38),$AB$40,IF(AND($Q$3=4,Q42>=$AB$38),$AB$42,IF(AND($Q$3=5,Q42<$AC$38),$AC$40,IF(AND($Q$3=5,Q42>=$AC$38),$AC$42,IF(AND($Q$3=6,Q42<$AD$38),$AD$40,IF(AND($Q$3=6,Q42>=$AD$38),$AD$42,IF(AND($Q$3=7,Q42<$AE$38),$AE$40,IF(AND($Q$3=7,Q42>=$AE$38),$AE$42,IF(AND($Q$3=8,Q42<$AF$38),$AF$40,IF(AND($Q$3=8,Q42>=$AF$38),$AF$42))))))))))))))))","v":{"$error":"#REF!"}},{"$f":"COUNTIF($S$6:$S$35,B42)","v":0},{"$f":"IF(AND($S$3=1,S42<$Y$38),$Y$40,IF(AND($S$3=1,S42>=$Y$38),$Y$42,IF(AND($S$3=2,S42<$Z$38),$Z$40,IF(AND($S$3=2,S42>=$Z$38),$Z$42,IF(AND($S$3=3,S42<$AA$38),$AA$40,IF(AND($S$3=3,S42>=$AA$38),$AA$42,IF(AND($S$3=4,S42<$AB$38),$AB$40,IF(AND($S$3=4,S42>=$AB$38),$AB$42,IF(AND($S$3=5,S42<$AC$38),$AC$40,IF(AND($S$3=5,S42>=$AC$38),$AC$42,IF(AND($S$3=6,S42<$AD$38),$AD$40,IF(AND($S$3=6,S42>=$AD$38),$AD$42,IF(AND($S$3=7,S42<$AE$38),$AE$40,IF(AND($S$3=7,S42>=$AE$38),$AE$42,IF(AND($S$3=8,S42<$AF$38),$AF$40,IF(AND($S$3=8,S42>=$AF$38),$AF$42))))))))))))))))","v":"SI tu tires il faudra être plus précis"},{"$f":"S42/SUM(M42+O42+S42)*100","v":{"$error":"#DIV/0!"}},{"$f":"IF(AND($U$3=1,U42<$Y$38),$Y$40,IF(AND($U$3=1,U42>=$Y$38),$Y$42,IF(AND($U$3=2,U42<$Z$38),$Z$40,IF(AND($U$3=2,U42>=$Z$38),$Z$42,IF(AND($U$3=3,U42<$AA$38),$AA$40,IF(AND($U$3=3,U42>=$AA$38),$AA$42,IF(AND($U$3=4,U42<$AB$38),$AB$40,IF(AND($U$3=4,U42>=$AB$38),$AB$42,IF(AND($U$3=5,U42<$AC$38),$AC$40,IF(AND($U$3=5,U42>=$AC$38),$AC$42,IF(AND($U$3=6,U42<$AD$38),$AD$40,IF(AND($U$3=6,U42>=$AD$38),$AD$42,IF(AND($U$3=7,U42<$AE$38),$AE$40,IF(AND($U$3=7,U42>=$AE$38),$AE$42,IF(AND($U$3=8,U42<$AF$38),$AF$40,IF(AND($U$3=8,U42>=$AF$38),$AF$42))))))))))))))))","v":{"$error":"#DIV/0!"}},{"$f":"B42","v":0},null,{"$f":"DEBUT!Y42","v":"Doucement "},{"$f":"DEBUT!Z42","v":"A qui tu fais la passe?"},{"$f":"DEBUT!AA42","v":"T'es plutot actif"},{"$f":"DEBUT!AB42","v":"Bien harcelé"},{"$f":"DEBUT!AC42","v":"Bien essayé mais faudra travailler l'adresse"},{"$f":"DEBUT!AD42","v":"On va travailler la précision"},{"$f":"DEBUT!AE42","v":"Joli"},{"$f":"DEBUT!AF42","v":"Bien visé"}]
[null,"Contrats ->",null,null,null,null,null,null,null,null,null,null,null,null,null,null,null,null,null,null,null,null,"<-Contrats "]
[null,{"$f":"EQUIPES!B7","v":0},{"$f":"COUNTIF($C$6:$C$35,B44)","v":0},{"$f":"IF(AND($C$3=1,C44<$Y$38),$Y$40,IF(AND($C$3=1,C44>=$Y$38),$Y$42,IF(AND($C$3=2,C44<$Z$38),$Z$40,IF(AND($C$3=2,C44>=$Z$38),$Z$42,IF(AND($C$3=3,C44<$AA$38),$AA$40,IF(AND($C$3=3,C44>=$AA$38),$AA$42,IF(AND($C$3=4,C44<$AB$38),$AB$40,IF(AND($C$3=4,C44>=$AB$38),$AB$42,IF(AND($C$3=5,C44<$AC$38),$AC$40,IF(AND($C$3=5,C44>=$AC$38),$AC$42,IF(AND($C$3=6,C44<$AD$38),$AD$40,IF(AND($C$3=6,C44>=$AD$38),$AD$42,IF(AND($C$3=7,C44<$AE$38),$AE$40,IF(AND($C$3=7,C44>=$AE$38),$AE$42,IF(AND($C$3=8,C44<$AF$38),$AF$40,IF(AND($C$3=8,C44>=$AF$38),$AF$42))))))))))))))))","v":"C'est bien tu gères la distance"},{"$f":"COUNTIF($E$6:$E$35,B44)","v":0},{"$f":"IF(AND($E$3=1,E44<$Y$38),$Y$40,IF(AND($E$3=1,E44>=$Y$38),$Y$42,IF(AND($E$3=2,E44<$Z$38),$Z$40,IF(AND($E$3=2,E44>=$Z$38),$Z$42,IF(AND($E$3=3,E44<$AA$38),$AA$40,IF(AND($E$3=3,E44>=$AA$38),$AA$42,IF(AND($E$3=4,E44<$AB$38),$AB$40,IF(AND($E$3=4,E44>=$AB$38),$AB$42,IF(AND($E$3=5,E44<$AC$38),$AC$40,IF(AND($E$3=5,E44>=$AC$38),$AC$42,IF(AND($E$3=6,E44<$AD$38),$AD$40,IF(AND($E$3=6,E44>=$AD$38),$AD$42,IF(AND($E$3=7,E44<$AE$38),$AE$40,IF(AND($E$3=7,E44>=$AE$38),$AE$42,IF(AND($E$3=8,E44<$AF$38),$AF$40,IF(AND($E$3=8,E44>=$AF$38),$AF$42))))))))))))))))","v":"Bien tu lèves la tête"},{"$f":"COUNTIF($G$6:$G$35,B44)","v":0},{"$f":"IF(AND($G$3=1,G44<$Y$38),$Y$40,IF(AND($G$3=1,G44>=$Y$38),$Y$42,IF(AND($G$3=2,G44<$Z$38),$Z$40,IF(AND($G$3=2,G44>=$Z$38),$Z$42,IF(AND($G$3=3,G44<$AA$38),$AA$40,IF(AND($G$3=3,G44>=$AA$38),$AA$42,IF(AND($G$3=4,G44<$AB$38),$AB$40,IF(AND($G$3=4,G44>=$AB$38),$AB$42,IF(AND($G$3=5,G44<$AC$38),$AC$40,IF(AND($G$3=5,G44>=$AC$38),$AC$42,IF(AND($G$3=6,G44<$AD$38),$AD$40,IF(AND($G$3=6,G44>=$AD$38),$AD$42,IF(AND($G$3=7,G44<$AE$38),$AE$40,IF(AND($G$3=7,G44>=$AE$38),$AE$42,IF(AND($G$3=8,G44<$AF$38),$AF$40,IF(AND($G$3=8,G44>=$AF$38),$AF$42))))))))))))))))","v":"Tu touches le ballon"},null,{"$f":"IF(AND($I$3=1,I44<$Y$38),$Y$40,IF(AND($I$3=1,I44>=$Y$38),$Y$42,IF(AND($I$3=2,I44<$Z$38),$Z$40,IF(AND($I$3=2,I44>=$Z$38),$Z$42,IF(AND($I$3=3,I44<$AA$38),$AA$40,IF(AND($I$3=3,I44>=$AA$38),$AA$42,IF(AND($I$3=4,I44<$AB$38),$AB$40,IF(AND($I$3=4,I44>=$AB$38),$AB$42,IF(AND($I$3=5,I44<$AC$38),$AC$40,IF(AND($I$3=5,I44>=$AC$38),$AC$42,IF(AND($I$3=6,I44<$AD$38),$AD$40,IF(AND($I$3=6,I44>=$AD$38),$AD$42,IF(AND($I$3=7,I44<$AE$38),$AE$40,IF(AND($I$3=7,I44>=$AE$38),$AE$42,IF(AND($I$3=8,I44<$AF$38),$AF$40,IF(AND($I$3=8,I44>=$AF$38),$AF$42))))))))))))))))","v":{"$error":"#REF!"}},{"$f":"COUNTIF($K$6:$K$35,B44)","v":0},{"$f":"IF(AND($K$3=1,K44<$Y$38),$Y$40,IF(AND($K$3=1,K44>=$Y$38),$Y$42,IF(AND($K$3=2,K44<$Z$38),$Z$40,IF(AND($K$3=2,K44>=$Z$38),$Z$42,IF(AND($K$3=3,K44<$AA$38),$AA$40,IF(AND($K$3=3,K44>=$AA$38),$AA$42,IF(AND($K$3=4,K44<$AB$38),$AB$40,IF(AND($K$3=4,K44>=$AB$38),$AB$42,IF(AND($K$3=5,K44<$AC$38),$AC$40,IF(AND($K$3=5,K44>=$AC$38),$AC$42,IF(AND($K$3=6,K44<$AD$38),$AD$40,IF(AND($K$3=6,K44>=$AD$38),$AD$42,IF(AND($K$3=7,K44<$AE$38),$AE$40,IF(AND($K$3=7,K44>=$AE$38),$AE$42,IF(AND($K$3=8,K44<$AF$38),$AF$40,IF(AND($K$3=8,K44>=$AF$38),$AF$42))))))))))))))))","v":{"$error":"#REF!"}},{"$f":"COUNTIF($M$6:$M$35,B44)","v":0},{"$f":"IF(AND($M$3=1,M44<$Y$38),$Y$40,IF(AND($M$3=1,M44>=$Y$38),$Y$42,IF(AND($M$3=2,M44<$Z$38),$Z$40,IF(AND($M$3=2,M44>=$Z$38),$Z$42,IF(AND($M$3=3,M44<$AA$38),$AA$40,IF(AND($M$3=3,M44>=$AA$38),$AA$42,IF(AND($M$3=4,M44<$AB$38),$AB$40,IF(AND($M$3=4,M44>=$AB$38),$AB$42,IF(AND($M$3=5,M44<$AC$38),$AC$40,IF(AND($M$3=5,M44>=$AC$38),$AC$42,IF(AND($M$3=6,M44<$AD$38),$AD$40,IF(AND($M$3=6,M44>=$AD$38),$AD$42,IF(AND($M$3=7,M44<$AE$38),$AE$40,IF(AND($M$3=7,M44>=$AE$38),$AE$42,IF(AND($M$3=8,M44<$AF$38),$AF$40,IF(AND($M$3=8,M44>=$AF$38),$AF$42))))))))))))))))","v":"Faut oser tirer"},{"$f":"COUNTIF($O$6:$O$35,B44)","v":0},{"$f":"IF(AND($O$3=1,O44<$Y$38),$Y$40,IF(AND($O$3=1,O44>=$Y$38),$Y$42,IF(AND($O$3=2,O44<$Z$38),$Z$40,IF(AND($O$3=2,O44>=$Z$38),$Z$42,IF(AND($O$3=3,O44<$AA$38),$AA$40,IF(AND($O$3=3,O44>=$AA$38),$AA$42,IF(AND($O$3=4,O44<$AB$38),$AB$40,IF(AND($O$3=4,O44>=$AB$38),$AB$42,IF(AND($O$3=5,O44<$AC$38),$AC$40,IF(AND($O$3=5,O44>=$AC$38),$AC$42,IF(AND($O$3=6,O44<$AD$38),$AD$40,IF(AND($O$3=6,O44>=$AD$38),$AD$42,IF(AND($O$3=7,O44<$AE$38),$AE$40,IF(AND($O$3=7,O44>=$AE$38),$AE$42,IF(AND($O$3=8,O44<$AF$38),$AF$40,IF(AND($O$3=8,O44>=$AF$38),$AF$42))))))))))))))))","v":"Pourquoi tes tirs ne rentrent pas ?"},{"$f":"COUNTIF($Q$6:$Q$35,B44)","v":0},{"$f":"IF(AND($Q$3=1,Q44<$Y$38),$Y$40,IF(AND($Q$3=1,Q44>=$Y$38),$Y$42,IF(AND($Q$3=2,Q44<$Z$38),$Z$40,IF(AND($Q$3=2,Q44>=$Z$38),$Z$42,IF(AND($Q$3=3,Q44<$AA$38),$AA$40,IF(AND($Q$3=3,Q44>=$AA$38),$AA$42,IF(AND($Q$3=4,Q44<$AB$38),$AB$40,IF(AND($Q$3=4,Q44>=$AB$38),$AB$42,IF(AND($Q$3=5,Q44<$AC$38),$AC$40,IF(AND($Q$3=5,Q44>=$AC$38),$AC$42,IF(AND($Q$3=6,Q44<$AD$38),$AD$40,IF(AND($Q$3=6,Q44>=$AD$38),$AD$42,IF(AND($Q$3=7,Q44<$AE$38),$AE$40,IF(AND($Q$3=7,Q44>=$AE$38),$AE$42,IF(AND($Q$3=8,Q44<$AF$38),$AF$40,IF(AND($Q$3=8,Q44>=$AF$38),$AF$42))))))))))))))))","v":{"$error":"#REF!"}},{"$f":"COUNTIF($S$6:$S$35,B44)","v":0},{"$f":"IF(AND($S$3=1,S44<$Y$38),$Y$40,IF(AND($S$3=1,S44>=$Y$38),$Y$42,IF(AND($S$3=2,S44<$Z$38),$Z$40,IF(AND($S$3=2,S44>=$Z$38),$Z$42,IF(AND($S$3=3,S44<$AA$38),$AA$40,IF(AND($S$3=3,S44>=$AA$38),$AA$42,IF(AND($S$3=4,S44<$AB$38),$AB$40,IF(AND($S$3=4,S44>=$AB$38),$AB$42,IF(AND($S$3=5,S44<$AC$38),$AC$40,IF(AND($S$3=5,S44>=$AC$38),$AC$42,IF(AND($S$3=6,S44<$AD$38),$AD$40,IF(AND($S$3=6,S44>=$AD$38),$AD$42,IF(AND($S$3=7,S44<$AE$38),$AE$40,IF(AND($S$3=7,S44>=$AE$38),$AE$42,IF(AND($S$3=8,S44<$AF$38),$AF$40,IF(AND($S$3=8,S44>=$AF$38),$AF$42))))))))))))))))","v":"SI tu tires il faudra être plus précis"},{"$f":"S44/SUM(M44+O44+S44)*100","v":{"$error":"#DIV/0!"}},{"$f":"IF(AND($U$3=1,U44<$Y$38),$Y$40,IF(AND($U$3=1,U44>=$Y$38),$Y$42,IF(AND($U$3=2,U44<$Z$38),$Z$40,IF(AND($U$3=2,U44>=$Z$38),$Z$42,IF(AND($U$3=3,U44<$AA$38),$AA$40,IF(AND($U$3=3,U44>=$AA$38),$AA$42,IF(AND($U$3=4,U44<$AB$38),$AB$40,IF(AND($U$3=4,U44>=$AB$38),$AB$42,IF(AND($U$3=5,U44<$AC$38),$AC$40,IF(AND($U$3=5,U44>=$AC$38),$AC$42,IF(AND($U$3=6,U44<$AD$38),$AD$40,IF(AND($U$3=6,U44>=$AD$38),$AD$42,IF(AND($U$3=7,U44<$AE$38),$AE$40,IF(AND($U$3=7,U44>=$AE$38),$AE$42,IF(AND($U$3=8,U44<$AF$38),$AF$40,IF(AND($U$3=8,U44>=$AF$38),$AF$42))))))))))))))))","v":{"$error":"#DIV/0!"}},{"$f":"B44","v":0},"Aide aux formules",{"$f":"DEBUT!Y44","v":1},{"$f":"DEBUT!Z44","v":2},{"$f":"DEBUT!AA44","v":3},{"$f":"DEBUT!AB44","v":4},{"$f":"DEBUT!AC44","v":5},{"$f":"DEBUT!AD44","v":6},{"$f":"DEBUT!AE44","v":7},{"$f":"DEBUT!AF44","v":8},9,10]
[null,"Contrats ->",null,null,null,null,null,null,null,null,null,null,null,null,null,null,null,null,null,null,null,null,"<-Contrats ",null,{"$f":"DEBUT!Y45","v":0},{"$f":"DEBUT!Z45","v":0},{"$f":"DEBUT!AA45","v":0},{"$f":"DEBUT!AB45","v":0},{"$f":"DEBUT!AC45","v":0},{"$f":"DEBUT!AD45","v":0},{"$f":"DEBUT!AE45","v":0},{"$f":"DEBUT!AF45","v":0}]
[null,{"$f":"EQUIPES!B8","v":0},{"$f":"COUNTIF($C$6:$C$35,B46)","v":0},{"$f":"IF(AND($C$3=1,C46<$Y$38),$Y$40,IF(AND($C$3=1,C46>=$Y$38),$Y$42,IF(AND($C$3=2,C46<$Z$38),$Z$40,IF(AND($C$3=2,C46>=$Z$38),$Z$42,IF(AND($C$3=3,C46<$AA$38),$AA$40,IF(AND($C$3=3,C46>=$AA$38),$AA$42,IF(AND($C$3=4,C46<$AB$38),$AB$40,IF(AND($C$3=4,C46>=$AB$38),$AB$42,IF(AND($C$3=5,C46<$AC$38),$AC$40,IF(AND($C$3=5,C46>=$AC$38),$AC$42,IF(AND($C$3=6,C46<$AD$38),$AD$40,IF(AND($C$3=6,C46>=$AD$38),$AD$42,IF(AND($C$3=7,C46<$AE$38),$AE$40,IF(AND($C$3=7,C46>=$AE$38),$AE$42,IF(AND($C$3=8,C46<$AF$38),$AF$40,IF(AND($C$3=8,C46>=$AF$38),$AF$42))))))))))))))))","v":"C'est bien tu gères la distance"},{"$f":"COUNTIF($E$6:$E$35,B46)","v":0},{"$f":"IF(AND($E$3=1,E46<$Y$38),$Y$40,IF(AND($E$3=1,E46>=$Y$38),$Y$42,IF(AND($E$3=2,E46<$Z$38),$Z$40,IF(AND($E$3=2,E46>=$Z$38),$Z$42,IF(AND($E$3=3,E46<$AA$38),$AA$40,IF(AND($E$3=3,E46>=$AA$38),$AA$42,IF(AND($E$3=4,E46<$AB$38),$AB$40,IF(AND($E$3=4,E46>=$AB$38),$AB$42,IF(AND($E$3=5,E46<$AC$38),$AC$40,IF(AND($E$3=5,E46>=$AC$38),$AC$42,IF(AND($E$3=6,E46<$AD$38),$AD$40,IF(AND($E$3=6,E46>=$AD$38),$AD$42,IF(AND($E$3=7,E46<$AE$38),$AE$40,IF(AND($E$3=7,E46>=$AE$38),$AE$42,IF(AND($E$3=8,E46<$AF$38),$AF$40,IF(AND($E$3=8,E46>=$AF$38),$AF$42))))))))))))))))","v":"Bien tu lèves la tête"},{"$f":"COUNTIF($G$6:$G$35,B46)","v":0},{"$f":"IF(AND($G$3=1,G46<$Y$38),$Y$40,IF(AND($G$3=1,G46>=$Y$38),$Y$42,IF(AND($G$3=2,G46<$Z$38),$Z$40,IF(AND($G$3=2,G46>=$Z$38),$Z$42,IF(AND($G$3=3,G46<$AA$38),$AA$40,IF(AND($G$3=3,G46>=$AA$38),$AA$42,IF(AND($G$3=4,G46<$AB$38),$AB$40,IF(AND($G$3=4,G46>=$AB$38),$AB$42,IF(AND($G$3=5,G46<$AC$38),$AC$40,IF(AND($G$3=5,G46>=$AC$38),$AC$42,IF(AND($G$3=6,G46<$AD$38),$AD$40,IF(AND($G$3=6,G46>=$AD$38),$AD$42,IF(AND($G$3=7,G46<$AE$38),$AE$40,IF(AND($G$3=7,G46>=$AE$38),$AE$42,IF(AND($G$3=8,G46<$AF$38),$AF$40,IF(AND($G$3=8,G46>=$AF$38),$AF$42))))))))))))))))","v":"Tu touches le ballon"},null,{"$f":"IF(AND($I$3=1,I46<$Y$38),$Y$40,IF(AND($I$3=1,I46>=$Y$38),$Y$42,IF(AND($I$3=2,I46<$Z$38),$Z$40,IF(AND($I$3=2,I46>=$Z$38),$Z$42,IF(AND($I$3=3,I46<$AA$38),$AA$40,IF(AND($I$3=3,I46>=$AA$38),$AA$42,IF(AND($I$3=4,I46<$AB$38),$AB$40,IF(AND($I$3=4,I46>=$AB$38),$AB$42,IF(AND($I$3=5,I46<$AC$38),$AC$40,IF(AND($I$3=5,I46>=$AC$38),$AC$42,IF(AND($I$3=6,I46<$AD$38),$AD$40,IF(AND($I$3=6,I46>=$AD$38),$AD$42,IF(AND($I$3=7,I46<$AE$38),$AE$40,IF(AND($I$3=7,I46>=$AE$38),$AE$42,IF(AND($I$3=8,I46<$AF$38),$AF$40,IF(AND($I$3=8,I46>=$AF$38),$AF$42))))))))))))))))","v":{"$error":"#REF!"}},{"$f":"COUNTIF($K$6:$K$35,B46)","v":0},{"$f":"IF(AND($K$3=1,K46<$Y$38),$Y$40,IF(AND($K$3=1,K46>=$Y$38),$Y$42,IF(AND($K$3=2,K46<$Z$38),$Z$40,IF(AND($K$3=2,K46>=$Z$38),$Z$42,IF(AND($K$3=3,K46<$AA$38),$AA$40,IF(AND($K$3=3,K46>=$AA$38),$AA$42,IF(AND($K$3=4,K46<$AB$38),$AB$40,IF(AND($K$3=4,K46>=$AB$38),$AB$42,IF(AND($K$3=5,K46<$AC$38),$AC$40,IF(AND($K$3=5,K46>=$AC$38),$AC$42,IF(AND($K$3=6,K46<$AD$38),$AD$40,IF(AND($K$3=6,K46>=$AD$38),$AD$42,IF(AND($K$3=7,K46<$AE$38),$AE$40,IF(AND($K$3=7,K46>=$AE$38),$AE$42,IF(AND($K$3=8,K46<$AF$38),$AF$40,IF(AND($K$3=8,K46>=$AF$38),$AF$42))))))))))))))))","v":{"$error":"#REF!"}},{"$f":"COUNTIF($M$6:$M$35,B46)","v":0},{"$f":"IF(AND($M$3=1,M46<$Y$38),$Y$40,IF(AND($M$3=1,M46>=$Y$38),$Y$42,IF(AND($M$3=2,M46<$Z$38),$Z$40,IF(AND($M$3=2,M46>=$Z$38),$Z$42,IF(AND($M$3=3,M46<$AA$38),$AA$40,IF(AND($M$3=3,M46>=$AA$38),$AA$42,IF(AND($M$3=4,M46<$AB$38),$AB$40,IF(AND($M$3=4,M46>=$AB$38),$AB$42,IF(AND($M$3=5,M46<$AC$38),$AC$40,IF(AND($M$3=5,M46>=$AC$38),$AC$42,IF(AND($M$3=6,M46<$AD$38),$AD$40,IF(AND($M$3=6,M46>=$AD$38),$AD$42,IF(AND($M$3=7,M46<$AE$38),$AE$40,IF(AND($M$3=7,M46>=$AE$38),$AE$42,IF(AND($M$3=8,M46<$AF$38),$AF$40,IF(AND($M$3=8,M46>=$AF$38),$AF$42))))))))))))))))","v":"Faut oser tirer"},{"$f":"COUNTIF($O$6:$O$35,B46)","v":0},{"$f":"IF(AND($O$3=1,O46<$Y$38),$Y$40,IF(AND($O$3=1,O46>=$Y$38),$Y$42,IF(AND($O$3=2,O46<$Z$38),$Z$40,IF(AND($O$3=2,O46>=$Z$38),$Z$42,IF(AND($O$3=3,O46<$AA$38),$AA$40,IF(AND($O$3=3,O46>=$AA$38),$AA$42,IF(AND($O$3=4,O46<$AB$38),$AB$40,IF(AND($O$3=4,O46>=$AB$38),$AB$42,IF(AND($O$3=5,O46<$AC$38),$AC$40,IF(AND($O$3=5,O46>=$AC$38),$AC$42,IF(AND($O$3=6,O46<$AD$38),$AD$40,IF(AND($O$3=6,O46>=$AD$38),$AD$42,IF(AND($O$3=7,O46<$AE$38),$AE$40,IF(AND($O$3=7,O46>=$AE$38),$AE$42,IF(AND($O$3=8,O46<$AF$38),$AF$40,IF(AND($O$3=8,O46>=$AF$38),$AF$42))))))))))))))))","v":"Pourquoi tes tirs ne rentrent pas ?"},{"$f":"COUNTIF($Q$6:$Q$35,B46)","v":0},{"$f":"IF(AND($Q$3=1,Q46<$Y$38),$Y$40,IF(AND($Q$3=1,Q46>=$Y$38),$Y$42,IF(AND($Q$3=2,Q46<$Z$38),$Z$40,IF(AND($Q$3=2,Q46>=$Z$38),$Z$42,IF(AND($Q$3=3,Q46<$AA$38),$AA$40,IF(AND($Q$3=3,Q46>=$AA$38),$AA$42,IF(AND($Q$3=4,Q46<$AB$38),$AB$40,IF(AND($Q$3=4,Q46>=$AB$38),$AB$42,IF(AND($Q$3=5,Q46<$AC$38),$AC$40,IF(AND($Q$3=5,Q46>=$AC$38),$AC$42,IF(AND($Q$3=6,Q46<$AD$38),$AD$40,IF(AND($Q$3=6,Q46>=$AD$38),$AD$42,IF(AND($Q$3=7,Q46<$AE$38),$AE$40,IF(AND($Q$3=7,Q46>=$AE$38),$AE$42,IF(AND($Q$3=8,Q46<$AF$38),$AF$40,IF(AND($Q$3=8,Q46>=$AF$38),$AF$42))))))))))))))))","v":{"$error":"#REF!"}},{"$f":"COUNTIF($S$6:$S$35,B46)","v":0},{"$f":"IF(AND($S$3=1,S46<$Y$38),$Y$40,IF(AND($S$3=1,S46>=$Y$38),$Y$42,IF(AND($S$3=2,S46<$Z$38),$Z$40,IF(AND($S$3=2,S46>=$Z$38),$Z$42,IF(AND($S$3=3,S46<$AA$38),$AA$40,IF(AND($S$3=3,S46>=$AA$38),$AA$42,IF(AND($S$3=4,S46<$AB$38),$AB$40,IF(AND($S$3=4,S46>=$AB$38),$AB$42,IF(AND($S$3=5,S46<$AC$38),$AC$40,IF(AND($S$3=5,S46>=$AC$38),$AC$42,IF(AND($S$3=6,S46<$AD$38),$AD$40,IF(AND($S$3=6,S46>=$AD$38),$AD$42,IF(AND($S$3=7,S46<$AE$38),$AE$40,IF(AND($S$3=7,S46>=$AE$38),$AE$42,IF(AND($S$3=8,S46<$AF$38),$AF$40,IF(AND($S$3=8,S46>=$AF$38),$AF$42))))))))))))))))","v":"SI tu tires il faudra être plus précis"},{"$f":"S46/SUM(M46+O46+S46)*100","v":{"$error":"#DIV/0!"}},{"$f":"IF(AND($U$3=1,U46<$Y$38),$Y$40,IF(AND($U$3=1,U46>=$Y$38),$Y$42,IF(AND($U$3=2,U46<$Z$38),$Z$40,IF(AND($U$3=2,U46>=$Z$38),$Z$42,IF(AND($U$3=3,U46<$AA$38),$AA$40,IF(AND($U$3=3,U46>=$AA$38),$AA$42,IF(AND($U$3=4,U46<$AB$38),$AB$40,IF(AND($U$3=4,U46>=$AB$38),$AB$42,IF(AND($U$3=5,U46<$AC$38),$AC$40,IF(AND($U$3=5,U46>=$AC$38),$AC$42,IF(AND($U$3=6,U46<$AD$38),$AD$40,IF(AND($U$3=6,U46>=$AD$38),$AD$42,IF(AND($U$3=7,U46<$AE$38),$AE$40,IF(AND($U$3=7,U46>=$AE$38),$AE$42,IF(AND($U$3=8,U46<$AF$38),$AF$40,IF(AND($U$3=8,U46>=$AF$38),$AF$42))))))))))))))))","v":{"$error":"#DIV/0!"}},{"$f":"B46","v":0},null,{"$f":"DEBUT!Y46","v":3},{"$f":"DEBUT!Z46","v":5},{"$f":"DEBUT!AA46","v":15},{"$f":"DEBUT!AB46","v":5},{"$f":"DEBUT!AC46","v":5},{"$f":"DEBUT!AD46","v":6},{"$f":"DEBUT!AE46","v":5},{"$f":"DEBUT!AF46","v":0.25}]
[null,"Contrats ->",null,null,null,null,null,null,null,null,null,null,null,null,null,null,null,null,null,null,null,null,"<-Contrats ","Contrats collectifs"]
[null,{"$f":"EQUIPES!B9","v":0},{"$f":"COUNTIF($C$6:$C$35,B48)","v":0},{"$f":"IF(AND($C$3=1,C48<$Y$38),$Y$40,IF(AND($C$3=1,C48>=$Y$38),$Y$42,IF(AND($C$3=2,C48<$Z$38),$Z$40,IF(AND($C$3=2,C48>=$Z$38),$Z$42,IF(AND($C$3=3,C48<$AA$38),$AA$40,IF(AND($C$3=3,C48>=$AA$38),$AA$42,IF(AND($C$3=4,C48<$AB$38),$AB$40,IF(AND($C$3=4,C48>=$AB$38),$AB$42,IF(AND($C$3=5,C48<$AC$38),$AC$40,IF(AND($C$3=5,C48>=$AC$38),$AC$42,IF(AND($C$3=6,C48<$AD$38),$AD$40,IF(AND($C$3=6,C48>=$AD$38),$AD$42,IF(AND($C$3=7,C48<$AE$38),$AE$40,IF(AND($C$3=7,C48>=$AE$38),$AE$42,IF(AND($C$3=8,C48<$AF$38),$AF$40,IF(AND($C$3=8,C48>=$AF$38),$AF$42))))))))))))))))","v":"C'est bien tu gères la distance"},{"$f":"COUNTIF($E$6:$E$35,B48)","v":0},{"$f":"IF(AND($E$3=1,E48<$Y$38),$Y$40,IF(AND($E$3=1,E48>=$Y$38),$Y$42,IF(AND($E$3=2,E48<$Z$38),$Z$40,IF(AND($E$3=2,E48>=$Z$38),$Z$42,IF(AND($E$3=3,E48<$AA$38),$AA$40,IF(AND($E$3=3,E48>=$AA$38),$AA$42,IF(AND($E$3=4,E48<$AB$38),$AB$40,IF(AND($E$3=4,E48>=$AB$38),$AB$42,IF(AND($E$3=5,E48<$AC$38),$AC$40,IF(AND($E$3=5,E48>=$AC$38),$AC$42,IF(AND($E$3=6,E48<$AD$38),$AD$40,IF(AND($E$3=6,E48>=$AD$38),$AD$42,IF(AND($E$3=7,E48<$AE$38),$AE$40,IF(AND($E$3=7,E48>=$AE$38),$AE$42,IF(AND($E$3=8,E48<$AF$38),$AF$40,IF(AND($E$3=8,E48>=$AF$38),$AF$42))))))))))))))))","v":"Bien tu lèves la tête"},{"$f":"COUNTIF($G$6:$G$35,B48)","v":0},{"$f":"IF(AND($G$3=1,G48<$Y$38),$Y$40,IF(AND($G$3=1,G48>=$Y$38),$Y$42,IF(AND($G$3=2,G48<$Z$38),$Z$40,IF(AND($G$3=2,G48>=$Z$38),$Z$42,IF(AND($G$3=3,G48<$AA$38),$AA$40,IF(AND($G$3=3,G48>=$AA$38),$AA$42,IF(AND($G$3=4,G48<$AB$38),$AB$40,IF(AND($G$3=4,G48>=$AB$38),$AB$42,IF(AND($G$3=5,G48<$AC$38),$AC$40,IF(AND($G$3=5,G48>=$AC$38),$AC$42,IF(AND($G$3=6,G48<$AD$38),$AD$40,IF(AND($G$3=6,G48>=$AD$38),$AD$42,IF(AND($G$3=7,G48<$AE$38),$AE$40,IF(AND($G$3=7,G48>=$AE$38),$AE$42,IF(AND($G$3=8,G48<$AF$38),$AF$40,IF(AND($G$3=8,G48>=$AF$38),$AF$42))))))))))))))))","v":"Tu touches le ballon"},null,{"$f":"IF(AND($I$3=1,I48<$Y$38),$Y$40,IF(AND($I$3=1,I48>=$Y$38),$Y$42,IF(AND($I$3=2,I48<$Z$38),$Z$40,IF(AND($I$3=2,I48>=$Z$38),$Z$42,IF(AND($I$3=3,I48<$AA$38),$AA$40,IF(AND($I$3=3,I48>=$AA$38),$AA$42,IF(AND($I$3=4,I48<$AB$38),$AB$40,IF(AND($I$3=4,I48>=$AB$38),$AB$42,IF(AND($I$3=5,I48<$AC$38),$AC$40,IF(AND($I$3=5,I48>=$AC$38),$AC$42,IF(AND($I$3=6,I48<$AD$38),$AD$40,IF(AND($I$3=6,I48>=$AD$38),$AD$42,IF(AND($I$3=7,I48<$AE$38),$AE$40,IF(AND($I$3=7,I48>=$AE$38),$AE$42,IF(AND($I$3=8,I48<$AF$38),$AF$40,IF(AND($I$3=8,I48>=$AF$38),$AF$42))))))))))))))))","v":{"$error":"#REF!"}},{"$f":"COUNTIF($K$6:$K$35,B48)","v":0},{"$f":"IF(AND($K$3=1,K48<$Y$38),$Y$40,IF(AND($K$3=1,K48>=$Y$38),$Y$42,IF(AND($K$3=2,K48<$Z$38),$Z$40,IF(AND($K$3=2,K48>=$Z$38),$Z$42,IF(AND($K$3=3,K48<$AA$38),$AA$40,IF(AND($K$3=3,K48>=$AA$38),$AA$42,IF(AND($K$3=4,K48<$AB$38),$AB$40,IF(AND($K$3=4,K48>=$AB$38),$AB$42,IF(AND($K$3=5,K48<$AC$38),$AC$40,IF(AND($K$3=5,K48>=$AC$38),$AC$42,IF(AND($K$3=6,K48<$AD$38),$AD$40,IF(AND($K$3=6,K48>=$AD$38),$AD$42,IF(AND($K$3=7,K48<$AE$38),$AE$40,IF(AND($K$3=7,K48>=$AE$38),$AE$42,IF(AND($K$3=8,K48<$AF$38),$AF$40,IF(AND($K$3=8,K48>=$AF$38),$AF$42))))))))))))))))","v":{"$error":"#REF!"}},{"$f":"COUNTIF($M$6:$M$35,B48)","v":0},{"$f":"IF(AND($M$3=1,M48<$Y$38),$Y$40,IF(AND($M$3=1,M48>=$Y$38),$Y$42,IF(AND($M$3=2,M48<$Z$38),$Z$40,IF(AND($M$3=2,M48>=$Z$38),$Z$42,IF(AND($M$3=3,M48<$AA$38),$AA$40,IF(AND($M$3=3,M48>=$AA$38),$AA$42,IF(AND($M$3=4,M48<$AB$38),$AB$40,IF(AND($M$3=4,M48>=$AB$38),$AB$42,IF(AND($M$3=5,M48<$AC$38),$AC$40,IF(AND($M$3=5,M48>=$AC$38),$AC$42,IF(AND($M$3=6,M48<$AD$38),$AD$40,IF(AND($M$3=6,M48>=$AD$38),$AD$42,IF(AND($M$3=7,M48<$AE$38),$AE$40,IF(AND($M$3=7,M48>=$AE$38),$AE$42,IF(AND($M$3=8,M48<$AF$38),$AF$40,IF(AND($M$3=8,M48>=$AF$38),$AF$42))))))))))))))))","v":"Faut oser tirer"},{"$f":"COUNTIF($O$6:$O$35,B48)","v":0},{"$f":"IF(AND($O$3=1,O48<$Y$38),$Y$40,IF(AND($O$3=1,O48>=$Y$38),$Y$42,IF(AND($O$3=2,O48<$Z$38),$Z$40,IF(AND($O$3=2,O48>=$Z$38),$Z$42,IF(AND($O$3=3,O48<$AA$38),$AA$40,IF(AND($O$3=3,O48>=$AA$38),$AA$42,IF(AND($O$3=4,O48<$AB$38),$AB$40,IF(AND($O$3=4,O48>=$AB$38),$AB$42,IF(AND($O$3=5,O48<$AC$38),$AC$40,IF(AND($O$3=5,O48>=$AC$38),$AC$42,IF(AND($O$3=6,O48<$AD$38),$AD$40,IF(AND($O$3=6,O48>=$AD$38),$AD$42,IF(AND($O$3=7,O48<$AE$38),$AE$40,IF(AND($O$3=7,O48>=$AE$38),$AE$42,IF(AND($O$3=8,O48<$AF$38),$AF$40,IF(AND($O$3=8,O48>=$AF$38),$AF$42))))))))))))))))","v":"Pourquoi tes tirs ne rentrent pas ?"},{"$f":"COUNTIF($Q$6:$Q$35,B48)","v":0},{"$f":"IF(AND($Q$3=1,Q48<$Y$38),$Y$40,IF(AND($Q$3=1,Q48>=$Y$38),$Y$42,IF(AND($Q$3=2,Q48<$Z$38),$Z$40,IF(AND($Q$3=2,Q48>=$Z$38),$Z$42,IF(AND($Q$3=3,Q48<$AA$38),$AA$40,IF(AND($Q$3=3,Q48>=$AA$38),$AA$42,IF(AND($Q$3=4,Q48<$AB$38),$AB$40,IF(AND($Q$3=4,Q48>=$AB$38),$AB$42,IF(AND($Q$3=5,Q48<$AC$38),$AC$40,IF(AND($Q$3=5,Q48>=$AC$38),$AC$42,IF(AND($Q$3=6,Q48<$AD$38),$AD$40,IF(AND($Q$3=6,Q48>=$AD$38),$AD$42,IF(AND($Q$3=7,Q48<$AE$38),$AE$40,IF(AND($Q$3=7,Q48>=$AE$38),$AE$42,IF(AND($Q$3=8,Q48<$AF$38),$AF$40,IF(AND($Q$3=8,Q48>=$AF$38),$AF$42))))))))))))))))","v":{"$error":"#REF!"}},{"$f":"COUNTIF($S$6:$S$35,B48)","v":0},{"$f":"IF(AND($S$3=1,S48<$Y$38),$Y$40,IF(AND($S$3=1,S48>=$Y$38),$Y$42,IF(AND($S$3=2,S48<$Z$38),$Z$40,IF(AND($S$3=2,S48>=$Z$38),$Z$42,IF(AND($S$3=3,S48<$AA$38),$AA$40,IF(AND($S$3=3,S48>=$AA$38),$AA$42,IF(AND($S$3=4,S48<$AB$38),$AB$40,IF(AND($S$3=4,S48>=$AB$38),$AB$42,IF(AND($S$3=5,S48<$AC$38),$AC$40,IF(AND($S$3=5,S48>=$AC$38),$AC$42,IF(AND($S$3=6,S48<$AD$38),$AD$40,IF(AND($S$3=6,S48>=$AD$38),$AD$42,IF(AND($S$3=7,S48<$AE$38),$AE$40,IF(AND($S$3=7,S48>=$AE$38),$AE$42,IF(AND($S$3=8,S48<$AF$38),$AF$40,IF(AND($S$3=8,S48>=$AF$38),$AF$42))))))))))))))))","v":"SI tu tires il faudra être plus précis"},{"$f":"S48/SUM(M48+O48+S48)*100","v":{"$error":"#DIV/0!"}},{"$f":"IF(AND($U$3=1,U48<$Y$38),$Y$40,IF(AND($U$3=1,U48>=$Y$38),$Y$42,IF(AND($U$3=2,U48<$Z$38),$Z$40,IF(AND($U$3=2,U48>=$Z$38),$Z$42,IF(AND($U$3=3,U48<$AA$38),$AA$40,IF(AND($U$3=3,U48>=$AA$38),$AA$42,IF(AND($U$3=4,U48<$AB$38),$AB$40,IF(AND($U$3=4,U48>=$AB$38),$AB$42,IF(AND($U$3=5,U48<$AC$38),$AC$40,IF(AND($U$3=5,U48>=$AC$38),$AC$42,IF(AND($U$3=6,U48<$AD$38),$AD$40,IF(AND($U$3=6,U48>=$AD$38),$AD$42,IF(AND($U$3=7,U48<$AE$38),$AE$40,IF(AND($U$3=7,U48>=$AE$38),$AE$42,IF(AND($U$3=8,U48<$AF$38),$AF$40,IF(AND($U$3=8,U48>=$AF$38),$AF$42))))))))))))))))","v":{"$error":"#DIV/0!"}},{"$f":"B48","v":0},null,{"$f":"DEBUT!Y48","v":"Vous êtes bien organisé"},{"$f":"DEBUT!Z48","v":"C'est bien vous faites des passes"},{"$f":"DEBUT!AA48","v":"Vous êtes où?"},{"$f":"DEBUT!AB48","v":"Faut se bouger davantage"},{"$f":"DEBUT!AC48","v":"Faut oser tirer"},{"$f":"DEBUT!AD48","v":"Pourquoi vos tirs ne rentrent pas ? "},{"$f":"DEBUT!AE48","v":"SI vous tirez il faudra être plus précis"},{"$f":"DEBUT!AF48","v":"Pas de chance"}]
[null,"Contrats ->",null,null,null,null,null,null,null,null,null,null,null,null,null,null,null,null,null,null,null,null,"<-Contrats "]
[null,{"$f":"EQUIPES!B10","v":0},{"$f":"COUNTIF($C$6:$C$35,B50)","v":0},{"$f":"IF(AND($C$3=1,C50<$Y$38),$Y$40,IF(AND($C$3=1,C50>=$Y$38),$Y$42,IF(AND($C$3=2,C50<$Z$38),$Z$40,IF(AND($C$3=2,C50>=$Z$38),$Z$42,IF(AND($C$3=3,C50<$AA$38),$AA$40,IF(AND($C$3=3,C50>=$AA$38),$AA$42,IF(AND($C$3=4,C50<$AB$38),$AB$40,IF(AND($C$3=4,C50>=$AB$38),$AB$42,IF(AND($C$3=5,C50<$AC$38),$AC$40,IF(AND($C$3=5,C50>=$AC$38),$AC$42,IF(AND($C$3=6,C50<$AD$38),$AD$40,IF(AND($C$3=6,C50>=$AD$38),$AD$42,IF(AND($C$3=7,C50<$AE$38),$AE$40,IF(AND($C$3=7,C50>=$AE$38),$AE$42,IF(AND($C$3=8,C50<$AF$38),$AF$40,IF(AND($C$3=8,C50>=$AF$38),$AF$42))))))))))))))))","v":"C'est bien tu gères la distance"},{"$f":"COUNTIF($E$6:$E$35,B50)","v":0},{"$f":"IF(AND($E$3=1,E50<$Y$38),$Y$40,IF(AND($E$3=1,E50>=$Y$38),$Y$42,IF(AND($E$3=2,E50<$Z$38),$Z$40,IF(AND($E$3=2,E50>=$Z$38),$Z$42,IF(AND($E$3=3,E50<$AA$38),$AA$40,IF(AND($E$3=3,E50>=$AA$38),$AA$42,IF(AND($E$3=4,E50<$AB$38),$AB$40,IF(AND($E$3=4,E50>=$AB$38),$AB$42,IF(AND($E$3=5,E50<$AC$38),$AC$40,IF(AND($E$3=5,E50>=$AC$38),$AC$42,IF(AND($E$3=6,E50<$AD$38),$AD$40,IF(AND($E$3=6,E50>=$AD$38),$AD$42,IF(AND($E$3=7,E50<$AE$38),$AE$40,IF(AND($E$3=7,E50>=$AE$38),$AE$42,IF(AND($E$3=8,E50<$AF$38),$AF$40,IF(AND($E$3=8,E50>=$AF$38),$AF$42))))))))))))))))","v":"Bien tu lèves la tête"},{"$f":"COUNTIF($G$6:$G$35,B50)","v":0},{"$f":"IF(AND($G$3=1,G50<$Y$38),$Y$40,IF(AND($G$3=1,G50>=$Y$38),$Y$42,IF(AND($G$3=2,G50<$Z$38),$Z$40,IF(AND($G$3=2,G50>=$Z$38),$Z$42,IF(AND($G$3=3,G50<$AA$38),$AA$40,IF(AND($G$3=3,G50>=$AA$38),$AA$42,IF(AND($G$3=4,G50<$AB$38),$AB$40,IF(AND($G$3=4,G50>=$AB$38),$AB$42,IF(AND($G$3=5,G50<$AC$38),$AC$40,IF(AND($G$3=5,G50>=$AC$38),$AC$42,IF(AND($G$3=6,G50<$AD$38),$AD$40,IF(AND($G$3=6,G50>=$AD$38),$AD$42,IF(AND($G$3=7,G50<$AE$38),$AE$40,IF(AND($G$3=7,G50>=$AE$38),$AE$42,IF(AND($G$3=8,G50<$AF$38),$AF$40,IF(AND($G$3=8,G50>=$AF$38),$AF$42))))))))))))))))","v":"Tu touches le ballon"},null,{"$f":"IF(AND($I$3=1,I50<$Y$38),$Y$40,IF(AND($I$3=1,I50>=$Y$38),$Y$42,IF(AND($I$3=2,I50<$Z$38),$Z$40,IF(AND($I$3=2,I50>=$Z$38),$Z$42,IF(AND($I$3=3,I50<$AA$38),$AA$40,IF(AND($I$3=3,I50>=$AA$38),$AA$42,IF(AND($I$3=4,I50<$AB$38),$AB$40,IF(AND($I$3=4,I50>=$AB$38),$AB$42,IF(AND($I$3=5,I50<$AC$38),$AC$40,IF(AND($I$3=5,I50>=$AC$38),$AC$42,IF(AND($I$3=6,I50<$AD$38),$AD$40,IF(AND($I$3=6,I50>=$AD$38),$AD$42,IF(AND($I$3=7,I50<$AE$38),$AE$40,IF(AND($I$3=7,I50>=$AE$38),$AE$42,IF(AND($I$3=8,I50<$AF$38),$AF$40,IF(AND($I$3=8,I50>=$AF$38),$AF$42))))))))))))))))","v":{"$error":"#REF!"}},{"$f":"COUNTIF($K$6:$K$35,B50)","v":0},{"$f":"IF(AND($K$3=1,K50<$Y$38),$Y$40,IF(AND($K$3=1,K50>=$Y$38),$Y$42,IF(AND($K$3=2,K50<$Z$38),$Z$40,IF(AND($K$3=2,K50>=$Z$38),$Z$42,IF(AND($K$3=3,K50<$AA$38),$AA$40,IF(AND($K$3=3,K50>=$AA$38),$AA$42,IF(AND($K$3=4,K50<$AB$38),$AB$40,IF(AND($K$3=4,K50>=$AB$38),$AB$42,IF(AND($K$3=5,K50<$AC$38),$AC$40,IF(AND($K$3=5,K50>=$AC$38),$AC$42,IF(AND($K$3=6,K50<$AD$38),$AD$40,IF(AND($K$3=6,K50>=$AD$38),$AD$42,IF(AND($K$3=7,K50<$AE$38),$AE$40,IF(AND($K$3=7,K50>=$AE$38),$AE$42,IF(AND($K$3=8,K50<$AF$38),$AF$40,IF(AND($K$3=8,K50>=$AF$38),$AF$42))))))))))))))))","v":{"$error":"#REF!"}},{"$f":"COUNTIF($M$6:$M$35,B50)","v":0},{"$f":"IF(AND($M$3=1,M50<$Y$38),$Y$40,IF(AND($M$3=1,M50>=$Y$38),$Y$42,IF(AND($M$3=2,M50<$Z$38),$Z$40,IF(AND($M$3=2,M50>=$Z$38),$Z$42,IF(AND($M$3=3,M50<$AA$38),$AA$40,IF(AND($M$3=3,M50>=$AA$38),$AA$42,IF(AND($M$3=4,M50<$AB$38),$AB$40,IF(AND($M$3=4,M50>=$AB$38),$AB$42,IF(AND($M$3=5,M50<$AC$38),$AC$40,IF(AND($M$3=5,M50>=$AC$38),$AC$42,IF(AND($M$3=6,M50<$AD$38),$AD$40,IF(AND($M$3=6,M50>=$AD$38),$AD$42,IF(AND($M$3=7,M50<$AE$38),$AE$40,IF(AND($M$3=7,M50>=$AE$38),$AE$42,IF(AND($M$3=8,M50<$AF$38),$AF$40,IF(AND($M$3=8,M50>=$AF$38),$AF$42))))))))))))))))","v":"Faut oser tirer"},{"$f":"COUNTIF($O$6:$O$35,B50)","v":0},{"$f":"IF(AND($O$3=1,O50<$Y$38),$Y$40,IF(AND($O$3=1,O50>=$Y$38),$Y$42,IF(AND($O$3=2,O50<$Z$38),$Z$40,IF(AND($O$3=2,O50>=$Z$38),$Z$42,IF(AND($O$3=3,O50<$AA$38),$AA$40,IF(AND($O$3=3,O50>=$AA$38),$AA$42,IF(AND($O$3=4,O50<$AB$38),$AB$40,IF(AND($O$3=4,O50>=$AB$38),$AB$42,IF(AND($O$3=5,O50<$AC$38),$AC$40,IF(AND($O$3=5,O50>=$AC$38),$AC$42,IF(AND($O$3=6,O50<$AD$38),$AD$40,IF(AND($O$3=6,O50>=$AD$38),$AD$42,IF(AND($O$3=7,O50<$AE$38),$AE$40,IF(AND($O$3=7,O50>=$AE$38),$AE$42,IF(AND($O$3=8,O50<$AF$38),$AF$40,IF(AND($O$3=8,O50>=$AF$38),$AF$42))))))))))))))))","v":"Pourquoi tes tirs ne rentrent pas ?"},{"$f":"COUNTIF($Q$6:$Q$35,B50)","v":0},{"$f":"IF(AND($Q$3=1,Q50<$Y$38),$Y$40,IF(AND($Q$3=1,Q50>=$Y$38),$Y$42,IF(AND($Q$3=2,Q50<$Z$38),$Z$40,IF(AND($Q$3=2,Q50>=$Z$38),$Z$42,IF(AND($Q$3=3,Q50<$AA$38),$AA$40,IF(AND($Q$3=3,Q50>=$AA$38),$AA$42,IF(AND($Q$3=4,Q50<$AB$38),$AB$40,IF(AND($Q$3=4,Q50>=$AB$38),$AB$42,IF(AND($Q$3=5,Q50<$AC$38),$AC$40,IF(AND($Q$3=5,Q50>=$AC$38),$AC$42,IF(AND($Q$3=6,Q50<$AD$38),$AD$40,IF(AND($Q$3=6,Q50>=$AD$38),$AD$42,IF(AND($Q$3=7,Q50<$AE$38),$AE$40,IF(AND($Q$3=7,Q50>=$AE$38),$AE$42,IF(AND($Q$3=8,Q50<$AF$38),$AF$40,IF(AND($Q$3=8,Q50>=$AF$38),$AF$42))))))))))))))))","v":{"$error":"#REF!"}},{"$f":"COUNTIF($S$6:$S$35,B50)","v":0},{"$f":"IF(AND($S$3=1,S50<$Y$38),$Y$40,IF(AND($S$3=1,S50>=$Y$38),$Y$42,IF(AND($S$3=2,S50<$Z$38),$Z$40,IF(AND($S$3=2,S50>=$Z$38),$Z$42,IF(AND($S$3=3,S50<$AA$38),$AA$40,IF(AND($S$3=3,S50>=$AA$38),$AA$42,IF(AND($S$3=4,S50<$AB$38),$AB$40,IF(AND($S$3=4,S50>=$AB$38),$AB$42,IF(AND($S$3=5,S50<$AC$38),$AC$40,IF(AND($S$3=5,S50>=$AC$38),$AC$42,IF(AND($S$3=6,S50<$AD$38),$AD$40,IF(AND($S$3=6,S50>=$AD$38),$AD$42,IF(AND($S$3=7,S50<$AE$38),$AE$40,IF(AND($S$3=7,S50>=$AE$38),$AE$42,IF(AND($S$3=8,S50<$AF$38),$AF$40,IF(AND($S$3=8,S50>=$AF$38),$AF$42))))))))))))))))","v":"SI tu tires il faudra être plus précis"},{"$f":"S50/SUM(M50+O50+S50)*100","v":{"$error":"#DIV/0!"}},{"$f":"IF(AND($U$3=1,U50<$Y$38),$Y$40,IF(AND($U$3=1,U50>=$Y$38),$Y$42,IF(AND($U$3=2,U50<$Z$38),$Z$40,IF(AND($U$3=2,U50>=$Z$38),$Z$42,IF(AND($U$3=3,U50<$AA$38),$AA$40,IF(AND($U$3=3,U50>=$AA$38),$AA$42,IF(AND($U$3=4,U50<$AB$38),$AB$40,IF(AND($U$3=4,U50>=$AB$38),$AB$42,IF(AND($U$3=5,U50<$AC$38),$AC$40,IF(AND($U$3=5,U50>=$AC$38),$AC$42,IF(AND($U$3=6,U50<$AD$38),$AD$40,IF(AND($U$3=6,U50>=$AD$38),$AD$42,IF(AND($U$3=7,U50<$AE$38),$AE$40,IF(AND($U$3=7,U50>=$AE$38),$AE$42,IF(AND($U$3=8,U50<$AF$38),$AF$40,IF(AND($U$3=8,U50>=$AF$38),$AF$42))))))))))))))))","v":{"$error":"#DIV/0!"}},{"$f":"B50","v":0},null,{"$f":"DEBUT!Y50","v":"Trop de fautes collectives"},{"$f":"DEBUT!Z50","v":"Trop de ballons perdus"},{"$f":"DEBUT!AA50","v":"Bonne activité collective"},{"$f":"DEBUT!AB50","v":"Bien harcelé"},{"$f":"DEBUT!AC50","v":"Bien essayé mais faudra travailler l'adresse"},{"$f":"DEBUT!AD50","v":"On va travailler la précision"},{"$f":"DEBUT!AE50","v":"Joli"},{"$f":"DEBUT!AF50","v":"Bien visé"}]
[null,"Contrats ->",null,null,null,null,null,null,null,null,null,null,null,null,null,null,null,null,null,null,null,null,"<-Contrats "]
[null,{"$f":"EQUIPES!B11","v":"Emmanuel"},{"$f":"COUNTIF($C$6:$C$35,B52)","v":0},{"$f":"IF(AND($C$3=1,C52<$Y$38),$Y$40,IF(AND($C$3=1,C52>=$Y$38),$Y$42,IF(AND($C$3=2,C52<$Z$38),$Z$40,IF(AND($C$3=2,C52>=$Z$38),$Z$42,IF(AND($C$3=3,C52<$AA$38),$AA$40,IF(AND($C$3=3,C52>=$AA$38),$AA$42,IF(AND($C$3=4,C52<$AB$38),$AB$40,IF(AND($C$3=4,C52>=$AB$38),$AB$42,IF(AND($C$3=5,C52<$AC$38),$AC$40,IF(AND($C$3=5,C52>=$AC$38),$AC$42,IF(AND($C$3=6,C52<$AD$38),$AD$40,IF(AND($C$3=6,C52>=$AD$38),$AD$42,IF(AND($C$3=7,C52<$AE$38),$AE$40,IF(AND($C$3=7,C52>=$AE$38),$AE$42,IF(AND($C$3=8,C52<$AF$38),$AF$40,IF(AND($C$3=8,C52>=$AF$38),$AF$42))))))))))))))))","v":"C'est bien tu gères la distance"},{"$f":"COUNTIF($E$6:$E$35,B52)","v":0},{"$f":"IF(AND($E$3=1,E52<$Y$38),$Y$40,IF(AND($E$3=1,E52>=$Y$38),$Y$42,IF(AND($E$3=2,E52<$Z$38),$Z$40,IF(AND($E$3=2,E52>=$Z$38),$Z$42,IF(AND($E$3=3,E52<$AA$38),$AA$40,IF(AND($E$3=3,E52>=$AA$38),$AA$42,IF(AND($E$3=4,E52<$AB$38),$AB$40,IF(AND($E$3=4,E52>=$AB$38),$AB$42,IF(AND($E$3=5,E52<$AC$38),$AC$40,IF(AND($E$3=5,E52>=$AC$38),$AC$42,IF(AND($E$3=6,E52<$AD$38),$AD$40,IF(AND($E$3=6,E52>=$AD$38),$AD$42,IF(AND($E$3=7,E52<$AE$38),$AE$40,IF(AND($E$3=7,E52>=$AE$38),$AE$42,IF(AND($E$3=8,E52<$AF$38),$AF$40,IF(AND($E$3=8,E52>=$AF$38),$AF$42))))))))))))))))","v":"Bien tu lèves la tête"},{"$f":"COUNTIF($G$6:$G$35,B52)","v":0},{"$f":"IF(AND($G$3=1,G52<$Y$38),$Y$40,IF(AND($G$3=1,G52>=$Y$38),$Y$42,IF(AND($G$3=2,G52<$Z$38),$Z$40,IF(AND($G$3=2,G52>=$Z$38),$Z$42,IF(AND($G$3=3,G52<$AA$38),$AA$40,IF(AND($G$3=3,G52>=$AA$38),$AA$42,IF(AND($G$3=4,G52<$AB$38),$AB$40,IF(AND($G$3=4,G52>=$AB$38),$AB$42,IF(AND($G$3=5,G52<$AC$38),$AC$40,IF(AND($G$3=5,G52>=$AC$38),$AC$42,IF(AND($G$3=6,G52<$AD$38),$AD$40,IF(AND($G$3=6,G52>=$AD$38),$AD$42,IF(AND($G$3=7,G52<$AE$38),$AE$40,IF(AND($G$3=7,G52>=$AE$38),$AE$42,IF(AND($G$3=8,G52<$AF$38),$AF$40,IF(AND($G$3=8,G52>=$AF$38),$AF$42))))))))))))))))","v":"Tu touches le ballon"},null,{"$f":"IF(AND($I$3=1,I52<$Y$38),$Y$40,IF(AND($I$3=1,I52>=$Y$38),$Y$42,IF(AND($I$3=2,I52<$Z$38),$Z$40,IF(AND($I$3=2,I52>=$Z$38),$Z$42,IF(AND($I$3=3,I52<$AA$38),$AA$40,IF(AND($I$3=3,I52>=$AA$38),$AA$42,IF(AND($I$3=4,I52<$AB$38),$AB$40,IF(AND($I$3=4,I52>=$AB$38),$AB$42,IF(AND($I$3=5,I52<$AC$38),$AC$40,IF(AND($I$3=5,I52>=$AC$38),$AC$42,IF(AND($I$3=6,I52<$AD$38),$AD$40,IF(AND($I$3=6,I52>=$AD$38),$AD$42,IF(AND($I$3=7,I52<$AE$38),$AE$40,IF(AND($I$3=7,I52>=$AE$38),$AE$42,IF(AND($I$3=8,I52<$AF$38),$AF$40,IF(AND($I$3=8,I52>=$AF$38),$AF$42))))))))))))))))","v":{"$error":"#REF!"}},{"$f":"COUNTIF($K$6:$K$35,B52)","v":0},{"$f":"IF(AND($K$3=1,K52<$Y$38),$Y$40,IF(AND($K$3=1,K52>=$Y$38),$Y$42,IF(AND($K$3=2,K52<$Z$38),$Z$40,IF(AND($K$3=2,K52>=$Z$38),$Z$42,IF(AND($K$3=3,K52<$AA$38),$AA$40,IF(AND($K$3=3,K52>=$AA$38),$AA$42,IF(AND($K$3=4,K52<$AB$38),$AB$40,IF(AND($K$3=4,K52>=$AB$38),$AB$42,IF(AND($K$3=5,K52<$AC$38),$AC$40,IF(AND($K$3=5,K52>=$AC$38),$AC$42,IF(AND($K$3=6,K52<$AD$38),$AD$40,IF(AND($K$3=6,K52>=$AD$38),$AD$42,IF(AND($K$3=7,K52<$AE$38),$AE$40,IF(AND($K$3=7,K52>=$AE$38),$AE$42,IF(AND($K$3=8,K52<$AF$38),$AF$40,IF(AND($K$3=8,K52>=$AF$38),$AF$42))))))))))))))))","v":{"$error":"#REF!"}},{"$f":"COUNTIF($M$6:$M$35,B52)","v":0},{"$f":"IF(AND($M$3=1,M52<$Y$38),$Y$40,IF(AND($M$3=1,M52>=$Y$38),$Y$42,IF(AND($M$3=2,M52<$Z$38),$Z$40,IF(AND($M$3=2,M52>=$Z$38),$Z$42,IF(AND($M$3=3,M52<$AA$38),$AA$40,IF(AND($M$3=3,M52>=$AA$38),$AA$42,IF(AND($M$3=4,M52<$AB$38),$AB$40,IF(AND($M$3=4,M52>=$AB$38),$AB$42,IF(AND($M$3=5,M52<$AC$38),$AC$40,IF(AND($M$3=5,M52>=$AC$38),$AC$42,IF(AND($M$3=6,M52<$AD$38),$AD$40,IF(AND($M$3=6,M52>=$AD$38),$AD$42,IF(AND($M$3=7,M52<$AE$38),$AE$40,IF(AND($M$3=7,M52>=$AE$38),$AE$42,IF(AND($M$3=8,M52<$AF$38),$AF$40,IF(AND($M$3=8,M52>=$AF$38),$AF$42))))))))))))))))","v":"Faut oser tirer"},{"$f":"COUNTIF($O$6:$O$35,B52)","v":0},{"$f":"IF(AND($O$3=1,O52<$Y$38),$Y$40,IF(AND($O$3=1,O52>=$Y$38),$Y$42,IF(AND($O$3=2,O52<$Z$38),$Z$40,IF(AND($O$3=2,O52>=$Z$38),$Z$42,IF(AND($O$3=3,O52<$AA$38),$AA$40,IF(AND($O$3=3,O52>=$AA$38),$AA$42,IF(AND($O$3=4,O52<$AB$38),$AB$40,IF(AND($O$3=4,O52>=$AB$38),$AB$42,IF(AND($O$3=5,O52<$AC$38),$AC$40,IF(AND($O$3=5,O52>=$AC$38),$AC$42,IF(AND($O$3=6,O52<$AD$38),$AD$40,IF(AND($O$3=6,O52>=$AD$38),$AD$42,IF(AND($O$3=7,O52<$AE$38),$AE$40,IF(AND($O$3=7,O52>=$AE$38),$AE$42,IF(AND($O$3=8,O52<$AF$38),$AF$40,IF(AND($O$3=8,O52>=$AF$38),$AF$42))))))))))))))))","v":"Pourquoi tes tirs ne rentrent pas ?"},{"$f":"COUNTIF($Q$6:$Q$35,B52)","v":0},{"$f":"IF(AND($Q$3=1,Q52<$Y$38),$Y$40,IF(AND($Q$3=1,Q52>=$Y$38),$Y$42,IF(AND($Q$3=2,Q52<$Z$38),$Z$40,IF(AND($Q$3=2,Q52>=$Z$38),$Z$42,IF(AND($Q$3=3,Q52<$AA$38),$AA$40,IF(AND($Q$3=3,Q52>=$AA$38),$AA$42,IF(AND($Q$3=4,Q52<$AB$38),$AB$40,IF(AND($Q$3=4,Q52>=$AB$38),$AB$42,IF(AND($Q$3=5,Q52<$AC$38),$AC$40,IF(AND($Q$3=5,Q52>=$AC$38),$AC$42,IF(AND($Q$3=6,Q52<$AD$38),$AD$40,IF(AND($Q$3=6,Q52>=$AD$38),$AD$42,IF(AND($Q$3=7,Q52<$AE$38),$AE$40,IF(AND($Q$3=7,Q52>=$AE$38),$AE$42,IF(AND($Q$3=8,Q52<$AF$38),$AF$40,IF(AND($Q$3=8,Q52>=$AF$38),$AF$42))))))))))))))))","v":{"$error":"#REF!"}},{"$f":"COUNTIF($S$6:$S$35,B52)","v":0},{"$f":"IF(AND($S$3=1,S52<$Y$38),$Y$40,IF(AND($S$3=1,S52>=$Y$38),$Y$42,IF(AND($S$3=2,S52<$Z$38),$Z$40,IF(AND($S$3=2,S52>=$Z$38),$Z$42,IF(AND($S$3=3,S52<$AA$38),$AA$40,IF(AND($S$3=3,S52>=$AA$38),$AA$42,IF(AND($S$3=4,S52<$AB$38),$AB$40,IF(AND($S$3=4,S52>=$AB$38),$AB$42,IF(AND($S$3=5,S52<$AC$38),$AC$40,IF(AND($S$3=5,S52>=$AC$38),$AC$42,IF(AND($S$3=6,S52<$AD$38),$AD$40,IF(AND($S$3=6,S52>=$AD$38),$AD$42,IF(AND($S$3=7,S52<$AE$38),$AE$40,IF(AND($S$3=7,S52>=$AE$38),$AE$42,IF(AND($S$3=8,S52<$AF$38),$AF$40,IF(AND($S$3=8,S52>=$AF$38),$AF$42))))))))))))))))","v":"SI tu tires il faudra être plus précis"},{"$f":"S52/SUM(M52+O52+S52)*100","v":{"$error":"#DIV/0!"}},{"$f":"IF(AND($U$3=1,U52<$Y$38),$Y$40,IF(AND($U$3=1,U52>=$Y$38),$Y$42,IF(AND($U$3=2,U52<$Z$38),$Z$40,IF(AND($U$3=2,U52>=$Z$38),$Z$42,IF(AND($U$3=3,U52<$AA$38),$AA$40,IF(AND($U$3=3,U52>=$AA$38),$AA$42,IF(AND($U$3=4,U52<$AB$38),$AB$40,IF(AND($U$3=4,U52>=$AB$38),$AB$42,IF(AND($U$3=5,U52<$AC$38),$AC$40,IF(AND($U$3=5,U52>=$AC$38),$AC$42,IF(AND($U$3=6,U52<$AD$38),$AD$40,IF(AND($U$3=6,U52>=$AD$38),$AD$42,IF(AND($U$3=7,U52<$AE$38),$AE$40,IF(AND($U$3=7,U52>=$AE$38),$AE$42,IF(AND($U$3=8,U52<$AF$38),$AF$40,IF(AND($U$3=8,U52>=$AF$38),$AF$42))))))))))))))))","v":{"$error":"#DIV/0!"}},{"$f":"B52","v":"Emmanuel"}]
[null,"Contrats ->",null,null,null,null,null,null,null,null,0,null,null,null,null,null,null,null,null,null,null,null,"<-Contrats "]
[]
[null,{"$f":"B36","v":"BLEU"},{"$f":"C36","v":0},"Vous êtes bien organisé",0,"C'est bien vous faites des passes",0,"Vous êtes où?",0,{"$error":"#REF!"},0,{"$error":"#REF!"},0,"Faut oser tirer",0,"Pourquoi vos tirs ne rentrent pas ? ",0,{"$error":"#REF!"},0,"SI vous tirez il faudra être plus précis",{"$error":"#DIV/0!"},"Pas de chance"]
[null,"Contrats ->"]
[]
[null,"EQUIPE","FAUTES\n/POSSESSION",null,"PERTE DE BALLE\n/POSSESSION",null,null,null,null,null,"RECUPERATION\n/POSSESSION",null,null,null,"TIR\n/POSSESSION",null,"CONTRE ATTAQUE\n/POSSESSION",null,"PANIER\n/POSSESSION",null,"TIR REUSSI\n/TIR TENTE",null,null,null,"FAUTES/POSSESSION","PERTE DE BALLE /POSSESSION","RECUPERATION /POSSESSION","CONTRE ATTAQUE /POSSESSION","ATTEINTE ZONE AVANT /POSSESSION","TIR REUSSI / TIR TENTE","TIR /POSSESSION","PANIER /POSSESSION"]
[null,{"$f":"B55","v":"BLEU"},{"$f":"C55/G5","v":{"$error":"#DIV/0!"}},{"$f":"IF(C59>Y60,Y64,Y62)","v":{"$error":"#DIV/0!"}},{"$f":"#REF!/G5","v":{"$error":"#REF!"}},{"$f":"IF(E59>Z60,Z64,Z62)","v":{"$error":"#REF!"}},null,null,null,null,{"$f":"K55/K35","v":{"$error":"#DIV/0!"}},{"$f":"IF(K59>AA60,AA64,AA62)","v":{"$error":"#DIV/0!"}},null,null,{"$f":"O55/G5","v":{"$error":"#DIV/0!"}},{"$f":"IF(O59>AE60,AE64,AE62)","v":{"$error":"#DIV/0!"}},null,null,{"$f":"S55/G5","v":{"$error":"#DIV/0!"}},{"$f":"IF(S59>AF60,AF64,AF62)","v":{"$error":"#DIV/0!"}},{"$f":"S55/(M55+O55+S55)","v":{"$error":"#DIV/0!"}},{"$f":"IF(U59>AD60,AD64,AD62)","v":{"$error":"#DIV/0!"}}]
[null,"Contrats ->",null,null,null,null,null,null,null,null,null,null,null,null,null,null,null,null,null,null,null,null,null,null,0.05,0.1,0.2,0.5,null,0.3,0.5,0.3]
[null,"PROFILS DE JEU ET SITUATIONS A TRAVAILLER"]
[null,null,"MON POINT FORT",null,"MON POINT FAIBLE",null,"JE VEUX TRAVAILLER …",null,null,null,"SITUATIONS A TRAVAILLER n°",null,"Nom de la situation A TRAVAILLER",null,null,null,null,null,"PROFIL DE JEU DE NOTRE EQUIPE",null,"Nom de la SITUATION A TRAVAILLER",null,null,null,"Bonne maitrise","c'est bien vous demandez le ballon","Allez on s'organise un peu","Dès récupération du ballon il faut s'organiser ensemble","Trop de ballons perdus","Manque d'adresse","Chaque action devrait aboutir à un bon tir","Il faut shooter plus"]
[null,{"$f":"B38","v":"Alexis F."},"TIR",null,"DEFENSE INDIVIDUELLE",null,"PASSE",null,null,null,{"$f":"VLOOKUP(C63,#REF!,4,TRUE)","v":{"$error":"#REF!"}},null,{"$f":"VLOOKUP(G63,DEBUT!$R$3:$V$12,2,FALSE)","v":{"$error":"#N/A"}},null,null,null,null,null,"Contre attaque",null,{"$f":"VLOOKUP(S63,DEBUT!R13:V26,2,FALSE)","v":{"$error":"#N/A"}}]
[null,{"$f":"B40","v":0},"PASSE",null,"DEFENSE INDIVIDUELLE",null,"TIR",null,null,null,{"$f":"VLOOKUP(C64,#REF!,4,TRUE)","v":{"$error":"#REF!"}},null,{"$f":"VLOOKUP(G64,DEBUT!$R$3:$V$12,2,FALSE)","v":{"$error":"#N/A"}},null,null,null,null,null,null,null,null,null,null,null,"Faut se calmer","Trop de ballon perdu : faut lever la t^te","ça défend bien","ça va vite chez vous","Maintenant il faut réussir à tirer","Oh mais c'est Golden State","C'est bien mais faut travailler l'adresse","Efficacité"]
[null,{"$f":"B42","v":0},null,null,"DEFENSE INDIVIDUELLE",null,"TIR",null,null,null,{"$f":"VLOOKUP(C65,#REF!,4,TRUE)","v":{"$error":"#REF!"}},null,{"$f":"VLOOKUP(G65,DEBUT!$R$3:$V$12,2,FALSE)","v":{"$error":"#N/A"}}]
[null,{"$f":"B44","v":0},null,null,"DEFENSE INDIVIDUELLE",null,"TIR",null,null,null,{"$f":"VLOOKUP(C66,#REF!,4,TRUE)","v":{"$error":"#REF!"}},null,{"$f":"VLOOKUP(G66,DEBUT!$R$3:$V$12,2,FALSE)","v":{"$error":"#N/A"}}]
[null,{"$f":"B46","v":0},null,null,"DEFENSE INDIVIDUELLE",null,"TIR",null,null,null,{"$f":"VLOOKUP(C67,#REF!,4,TRUE)","v":{"$error":"#REF!"}},null,{"$f":"VLOOKUP(G67,DEBUT!$R$3:$V$12,2,FALSE)","v":{"$error":"#N/A"}}]
[null,{"$f":"B48","v":0},null,null,"DEFENSE INDIVIDUELLE",null,"TIR",null,null,null,{"$f":"VLOOKUP(C68,#REF!,4,TRUE)","v":{"$error":"#REF!"}},null,{"$f":"VLOOKUP(G68,DEBUT!$R$3:$V$12,2,FALSE)","v":{"$error":"#N/A"}}]
[null,{"$f":"B50","v":0},null,null,"DEFENSE INDIVIDUELLE",null,"TIR",null,null,null,{"$f":"VLOOKUP(C69,#REF!,4,TRUE)","v":{"$error":"#REF!"}},null,{"$f":"VLOOKUP(G69,DEBUT!$R$3:$V$12,2,FALSE)","v":{"$error":"#N/A"}}]
[null,{"$f":"B52","v":"Emmanuel"},null,null,"DEFENSE INDIVIDUELLE",null,"TIR",null,null,null,{"$f":"VLOOKUP(C70,#REF!,4,TRUE)","v":{"$error":"#REF!"}},null,{"$f":"VLOOKUP(G70,DEBUT!$R$3:$V$12,2,FALSE)","v":{"$error":"#N/A"}}]
[]
[null,null,null,"Le profil de jeu peut être choisi par l'élève à partir de l'analyse de ses stats ou alors à partir d'une formule du type : si TIR = 0 alors travailler SA1"]

{"sheet":"OBS2","index":3,"n_rows":72,"n_cols":34,"rows_kept":72,"cut":false,"hidden":false,"merged":[[66,2,66,3],[66,4,66,5],[66,6,66,7],[66,10,66,11],[66,12,66,14],[69,2,69,3],[69,4,69,5],[69,6,69,7],[69,10,69,11],[69,12,69,14],[67,2,67,3],[67,4,67,5],[67,6,67,7],[67,10,67,11],[67,12,67,14],[68,2,68,3],[68,4,68,5],[68,6,68,7],[68,10,68,11],[68,12,68,14],[63,30,64,30],[63,2,63,3],[63,4,63,5],[63,6,63,7],[63,10,63,11],[63,12,63,14],[63,24,64,24],[65,2,65,3],[65,4,65,5],[65,6,65,7],[65,10,65,11],[65,12,65,14],[64,4,64,5],[64,6,64,7],[64,10,64,11],[64,12,64,14],[63,25,64,25],[63,26,64,26],[63,27,64,27],[63,28,64,28],[63,29,64,29],[61,29,62,29],[61,30,62,30],[61,31,62,31],[62,2,62,3],[62,4,62,5],[62,6,62,7],[62,10,62,11],[62,12,62,14],[62,18,69,19],[62,20,69,21],[61,20,61,21],[61,24,62,24],[61,25,62,25],[61,26,62,26],[61,27,62,27],[61,28,62,28],[61,2,61,3],[61,4,61,5],[61,6,61,7],[61,10,61,11],[61,12,61,14],[61,18,61,19],[63,31,64,31],[64,2,64,3],[59,27,60,27],[59,28,60,28],[59,29,60,29],[59,30,60,30],[59,31,60,31],[60,1,60,21],[58,17,59,17],[58,19,59,19],[58,21,59,21],[59,24,60,24],[59,25,60,25],[59,26,60,26],[57,29,58,29],[57,30,58,30],[57,31,58,31],[58,3,59,3],[58,5,59,5],[58,7,59,7],[58,9,59,9],[58,11,59,11],[58,13,59,13],[58,15,59,15],[57,20,57,21],[57,24,58,24],[57,25,58,25],[57,26,58,26],[57,27,58,27],[57,28,58,28],[54,21,55,21],[57,2,57,3],[57,4,57,5],[57,6,57,7],[57,8,57,9],[57,10,57,11],[57,12,57,13],[57,14,57,15],[57,16,57,17],[57,18,57,19],[54,3,55,3],[54,5,55,5],[54,7,55,7],[54,9,55,9],[54,11,55,11],[54,13,55,13],[54,15,55,15],[54,17,55,17],[54,19,55,19],[47,19,48,19],[47,21,48,21],[47,24,48,24],[49,21,50,21],[51,3,52,3],[51,5,52,5],[51,7,52,7],[51,9,52,9],[51,11,52,11],[51,13,52,13],[51,15,52,15],[51,17,52,17],[51,19,52,19],[51,21,52,21],[49,3,50,3],[49,5,50,5],[49,7,50,7],[49,9,50,9],[49,11,50,11],[49,13,50,13],[49,15,50,15],[49,17,50,17],[49,19,50,19],[45,29,46,29],[45,30,46,30],[45,31,46,31],[47,3,48,3],[47,5,48,5],[47,7,48,7],[47,9,48,9],[47,11,48,11],[45,17,46,17],[45,19,46,19],[45,21,46,21],[45,24,46,24],[45,25,46,25],[45,26,46,26],[47,31,48,31],[47,25,48,25],[47,26,48,26],[47,27,48,27],[47,28,48,28],[47,29,48,29],[47,30,48,30],[47,13,48,13],[47,15,48,15],[47,17,48,17],[45,3,46,3],[45,5,46,5],[45,7,46,7],[45,9,46,9],[45,11,46,11],[45,13,46,13],[45,15,46,15],[45,27,46,27],[45,28,46,28],[41,30,42,30],[41,31,42,31],[43,3,44,3],[43,5,44,5],[43,7,44,7],[43,9,44,9],[43,11,44,11],[43,13,44,13],[43,15,44,15],[41,21,42,21],[41,24,42,24],[41,25,42,25],[41,26,42,26],[41,27,42,27],[41,28,42,28],[43,17,44,17],[43,19,44,19],[43,21,44,21],[37,24,38,24],[39,31,40,31],[41,3,42,3],[41,5,42,5],[41,7,42,7],[41,9,42,9],[41,11,42,11],[41,13,42,13],[41,15,42,15],[41,17,42,17],[41,19,42,19],[39,25,40,25],[39,26,40,26],[39,27,40,27],[39,28,40,28],[39,29,40,29],[39,30,40,30],[39,13,40,13],[39,15,40,15],[39,17,40,17],[39,19,40,19],[39,21,40,21],[39,24,40,24],[41,29,42,29],[35,3,36,3],[39,3,40,3],[39,5,40,5],[39,7,40,7],[39,9,40,9],[39,11,40,11],[37,17,38,17],[37,19,38,19],[37,21,38,21],[33,20,33,21],[35,29,36,29],[35,30,36,30],[35,31,36,31],[37,3,38,3],[37,5,38,5],[37,7,38,7],[37,9,38,9],[37,11,38,11],[37,13,38,13],[37,15,38,15],[35,21,36,21],[35,24,36,24],[35,25,36,25],[35,26,36,26],[35,27,36,27],[35,28,36,28],[37,27,38,27],[37,28,38,28],[37,29,38,29],[37,30,38,30],[37,31,38,31],[37,25,38,25],[37,26,38,26],[34,8,34,9],[34,10,34,11],[34,12,34,13],[34,14,34,15],[34,16,34,17],[34,18,34,19],[35,5,36,5],[35,7,36,7],[35,9,36,9],[35,11,36,11],[35,13,36,13],[35,15,36,15],[35,17,36,17],[35,19,36,19],[33,2,33,3],[33,4,33,5],[33,6,33,7],[33,12,33,13],[33,14,33,15],[33,18,33,19],[34,20,34,21],[31,20,31,21],[32,2,32,3],[32,4,32,5],[32,6,32,7],[32,12,32,13],[32,14,32,15],[32,18,32,19],[32,20,32,21],[31,2,31,3],[31,4,31,5],[31,6,31,7],[31,12,31,13],[31,14,31,15],[31,18,31,19],[34,2,34,3],[34,4,34,5],[34,6,34,7],[29,20,29,21],[30,2,30,3],[30,4,30,5],[30,6,30,7],[30,12,30,13],[30,14,30,15],[30,18,30,19],[30,20,30,21],[29,2,29,3],[29,4,29,5],[29,6,29,7],[29,12,29,13],[29,14,29,15],[29,18,29,19],[27,20,27,21],[28,2,28,3],[28,4,28,5],[28,6,28,7],[28,12,28,13],[28,14,28,15],[28,18,28,19],[28,20,28,21],[27,2,27,3],[27,4,27,5],[27,6,27,7],[27,12,27,13],[27,14,27,15],[27,18,27,19],[25,20,25,21],[26,2,26,3],[26,4,26,5],[26,6,26,7],[26,12,26,13],[26,14,26,15],[26,18,26,19],[26,20,26,21],[25,2,25,3],[25,4,25,5],[25,6,25,7],[25,12,25,13],[25,14,25,15],[25,18,25,19],[23,20,23,21],[24,2,24,3],[24,4,24,5],[24,6,24,7],[24,12,24,13],[24,14,24,15],[24,18,24,19],[24,20,24,21],[23,2,23,3],[23,4,23,5],[23,6,23,7],[23,12,23,13],[23,14,23,15],[23,18,23,19],[21,20,21,21],[22,2,22,3],[22,4,22,5],[22,6,22,7],[22,12,22,13],[22,14,22,15],[22,18,22,19],[22,20,22,21],[21,2,21,3],[21,4,21,5],[21,6,21,7],[21,12,21,13],[21,14,21,15],[21,18,21,19],[19,20,19,21],[20,2,20,3],[20,4,20,5],[20,6,20,7],[20,12,20,13],[20,14,20,15],[20,18,20,19],[20,20,20,21],[19,2,19,3],[19,4,19,5],[19,6,19,7],[19,12,19,13],[19,14,19,15],[19,18,19,19],[17,20,17,21],[18,2,18,3],[18,4,18,5],[18,6,18,7],[18,12,18,13],[18,14,18,15],[18,18,18,19],[18,20,18,21],[17,2,17,3],[17,4,17,5],[17,6,17,7],[17,12,17,13],[17,14,17,15],[17,18,17,19],[15,20,15,21],[16,2,16,3],[16,4,16,5],[16,6,16,7],[16,12,16,13],[16,14,16,15],[16,18,16,19],[16,20,16,21],[15,2,15,3],[15,4,15,5],[15,6,15,7],[15,12,15,13],[15,14,15,15],[15,18,15,19],[13,20,13,21],[14,2,14,3],[14,4,14,5],[14,6,14,7],[14,12,14,13],[14,14,14,15],[14,18,14,19],[14,20,14,21],[13,2,13,3],[13,4,13,5],[13,6,13,7],[13,12,13,13],[13,14,13,15],[13,18,13,19],[11,20,11,21],[12,2,12,3],[12,4,12,5],[12,6,12,7],[12,12,12,13],[12,14,12,15],[12,18,12,19],[12,20,12,21],[11,2,11,3],[11,4,11,5],[11,6,11,7],[11,12,11,13],[11,14,11,15],[11,18,11,19],[9,20,9,21],[10,2,10,3],[10,4,10,5],[10,6,10,7],[10,12,10,13],[10,14,10,15],[10,18,10,19],[10,20,10,21],[9,2,9,3],[9,4,9,5],[9,6,9,7],[9,12,9,13],[9,14,9,15],[9,18,9,19],[7,20,7,21],[8,2,8,3],[8,4,8,5],[8,6,8,7],[8,12,8,13],[8,14,8,15],[8,18,8,19],[8,20,8,21],[7,2,7,3],[7,4,7,5],[7,6,7,7],[7,12,7,13],[7,14,7,15],[7,18,7,19],[5,20,5,21],[6,2,6,3],[6,4,6,5],[6,6,6,7],[6,12,6,13],[6,14,6,15],[6,18,6,19],[6,20,6,21],[5,2,5,3],[5,4,5,5],[5,6,5,7],[5,12,5,13],[5,14,5,15],[5,18,5,19],[3,16,4,17],[3,18,4,19],[3,20,4,21],[4,6,4,7],[4,8,4,9],[4,10,4,11],[1,3,1,4],[1,14,1,15],[3,2,4,3],[3,4,4,5],[3,6,3,11],[3,12,4,13],[3,14,4,15]]}
[null,"Classe"]
[null,{"$f":"EQUIPES!B2","v":"1TU"},null,{"$f":"EQUIPES!D3","v":"JAUNE"},null,"score",null,"-",null,null,null,null,null,"score","VERT"]
[null,null,{"$f":"HLOOKUP(C4,$Y$36:$AF$44,9,FALSE)","v":1},{"$f":"HLOOKUP(D4,$Y$36:$AF$44,9,FALSE)","v":{"$error":"#N/A"}},{"$f":"HLOOKUP(E4,$Y$36:$AF$44,9,FALSE)","v":2},{"$f":"(HLOOKUP(F4,DEBUT!#REF!,9,FALSE))","v":{"$error":"#REF!"}},{"$f":"(HLOOKUP(G4,$Y$36:$AF$44,9,FALSE))","v":3},{"$f":"HLOOKUP(H4,$Y$36:$AF$44,9,FALSE)","v":{"$error":"#N/A"}},{"$f":"(HLOOKUP(I4,DEBUT!#REF!,9,FALSE))","v":{"$error":"#REF!"}},{"$f":"(HLOOKUP(J4,DEBUT!#REF!,9,FALSE))","v":{"$error":"#REF!"}},{"$f":"(HLOOKUP(K4,DEBUT!#REF!,9,FALSE))","v":{"$error":"#REF!"}},{"$f":"(HLOOKUP(L4,DEBUT!#REF!,9,FALSE))","v":{"$error":"#REF!"}},{"$f":"(HLOOKUP(M4,$Y$36:$AF$44,9,FALSE))","v":5},{"$f":"HLOOKUP(N4,$Y$36:$AF$44,9,FALSE)","v":{"$error":"#N/A"}},{"$f":"(HLOOKUP(O4,$Y$36:$AF$44,9,FALSE))","v":6},{"$f":"HLOOKUP(P4,$Y$36:$AF$44,9,FALSE)","v":{"$error":"#N/A"}},{"$f":"(HLOOKUP(Q4,DEBUT!#REF!,9,FALSE))","v":{"$error":"#REF!"}},{"$f":"(HLOOKUP(R4,DEBUT!#REF!,9,FALSE))","v":{"$error":"#REF!"}},{"$f":"(HLOOKUP(S4,$Y$36:$AF$44,9,FALSE))","v":7},{"$f":"HLOOKUP(T4,$Y$36:$AF$44,9,FALSE)","v":{"$error":"#N/A"}},{"$f":"(HLOOKUP(U4,$Y$36:$AF$44,9,FALSE))","v":8},{"$f":"HLOOKUP(V4,$Y$36:$AF$44,9,FALSE)","v":{"$error":"#N/A"}}]
[null,null,{"$f":"'OBS1'!C4","v":"FAUTE"},null,{"$f":"'OBS1'!E4","v":"BALLON PERDU"},null,{"$f":"'OBS1'!G4","v":"POSSESSION"},null,null,null,null,null,{"$f":"'OBS1'!M4","v":"TIRS"},null,{"$f":"'OBS1'!O4","v":"BONS TIRS"},null,"PANIERS",null,{"$f":"'OBS1'!S4","v":"PANIERS"},null,{"$f":"'OBS1'!U4","v":"% REUSSITE"}]
[null,null,null,null,null,null,0]
[null,1]
[null,2]
[null,3]
[null,4]
[null,5]
[null,6]
[null,7]
[null,8]
[null,9]
[null,10]
[null,11]
[null,12]
[null,13]
[null,14]
[null,15]
[null,16]
[null,17]
[null,18]
[null,19]
[null,20]
[null,21]
[null,22]
[null,23]
[null,24]
[null,25]
[null,26]
[null,27]
[null,28]
[null,29]
[null,30]
[null,{"$f":"D2","v":"JAUNE"},{"$f":"(SUMPRODUCT(N(ISTEXT(C6:C35))))","v":0},{"$f":"IF(AND($C$3=1,C36<$Y$46),$Y$48,IF(AND($C$3=1,C36>=$Y$46),$Y$50,IF(AND($C$3=2,C36<$Z$46),$Z$48,IF(AND($C$3=2,C36>=$Z$46),$Z$50,IF(AND($C$3=3,C36<$AA$46),$AA$48,IF(AND($C$3=3,C36>=$AA$46),$AA$50,IF(AND($C$3=4,C36<$AB$46),$AB$48,IF(AND($C$3=4,C36>=$AB$46),$AB$50,IF(AND($C$3=5,C36<$AC$46),$AC$48,IF(AND($C$3=5,C36>=$AC$46),$AC$50,IF(AND($C$3=6,C36<$AD$46),$AD$48,IF(AND($C$3=6,C36>=$AD$46),$AD$50,IF(AND($C$3=7,C36<$AE$46),$AE$48,IF(AND($C$3=7,C36>=$AE$46),$AE$50,IF(AND($C$3=8,C36<$AF$46),$AF$48,IF(AND($C$3=8,C36>=$AF$46),$AF$50))))))))))))))))","v":"Vous êtes bien organisé"},{"$f":"(SUMPRODUCT(N(ISTEXT(E6:E35))))","v":0},{"$f":"IF(AND($E$3=1,C36<$Y$46),$Y$48,IF(AND($E$3=1,C36>=$Y$46),$Y$50,IF(AND($E$3=2,C36<$Z$46),$Z$48,IF(AND($E$3=2,C36>=$Z$46),$Z$50,IF(AND($E$3=3,C36<$AA$46),$AA$48,IF(AND($E$3=3,C36>=$AA$46),$AA$50,IF(AND($E$3=4,C36<$AB$46),$AB$48,IF(AND($E$3=4,C36>=$AB$46),$AB$50,IF(AND($E$3=5,C36<$AC$46),$AC$48,IF(AND($E$3=5,C36>=$AC$46),$AC$50,IF(AND($E$3=6,C36<$AD$46),$AD$48,IF(AND($E$3=6,C36>=$AD$46),$AD$50,IF(AND($E$3=7,C36<$AE$46),$AE$48,IF(AND($E$3=7,C36>=$AE$46),$AE$50,IF(AND($E$3=8,C36<$AF$46),$AF$48,IF(AND($E$3=8,C36>=$AF$46),$AF$50))))))))))))))))","v":"C'est bien vous faites des passes"},{"$f":"(SUMPRODUCT(N(ISTEXT(G6:G35))))","v":0},{"$f":"IF(AND($G$3=1,C36<$Y$46),$Y$48,IF(AND($G$3=1,C36>=$Y$46),$Y$50,IF(AND($G$3=2,C36<$Z$46),$Z$48,IF(AND($G$3=2,C36>=$Z$46),$Z$50,IF(AND($G$3=3,C36<$AA$46),$AA$48,IF(AND($G$3=3,C36>=$AA$46),$AA$50,IF(AND($G$3=4,C36<$AB$46),$AB$48,IF(AND($G$3=4,C36>=$AB$46),$AB$50,IF(AND($G$3=5,C36<$AC$46),$AC$48,IF(AND($G$3=5,C36>=$AC$46),$AC$50,IF(AND($G$3=6,C36<$AD$46),$AD$48,IF(AND($G$3=6,C36>=$AD$46),$AD$50,IF(AND($G$3=7,C36<$AE$46),$AE$48,IF(AND($G$3=7,C36>=$AE$46),$AE$50,IF(AND($G$3=8,C36<$AF$46),$AF$48,IF(AND($G$3=8,C36>=$AF$46),$AF$50))))))))))))))))","v":"Vous êtes où?"},{"$f":"(SUMPRODUCT(N(ISTEXT(I6:I35))))","v":0},{"$f":"IF(AND($I$3=1,C36<$Y$46),$Y$48,IF(AND($I$3=1,C36>=$Y$46),$Y$50,IF(AND($I$3=2,C36<$Z$46),$Z$48,IF(AND($I$3=2,C36>=$Z$46),$Z$50,IF(AND($I$3=3,C36<$AA$46),$AA$48,IF(AND($I$3=3,C36>=$AA$46),$AA$50,IF(AND($I$3=4,C36<$AB$46),$AB$48,IF(AND($I$3=4,C36>=$AB$46),$AB$50,IF(AND($I$3=5,C36<$AC$46),$AC$48,IF(AND($I$3=5,C36>=$AC$46),$AC$50,IF(AND($I$3=6,C36<$AD$46),$AD$48,IF(AND($I$3=6,C36>=$AD$46),$AD$50,IF(AND($I$3=7,C36<$AE$46),$AE$48,IF(AND($I$3=7,C36>=$AE$46),$AE$50,IF(AND($I$3=8,C36<$AF$46),$AF$48,IF(AND($I$3=8,C36>=$AF$46),$AF$50))))))))))))))))","v":{"$error":"#REF!"}},{"$f":"(SUMPRODUCT(N(ISTEXT(K6:K35))))","v":0},{"$f":"IF(AND($K$3=1,C36<$Y$46),$Y$48,IF(AND($K$3=1,C36>=$Y$46),$Y$50,IF(AND($K$3=2,C36<$Z$46),$Z$48,IF(AND($K$3=2,C36>=$Z$46),$Z$50,IF(AND($K$3=3,C36<$AA$46),$AA$48,IF(AND($K$3=3,C36>=$AA$46),$AA$50,IF(AND($K$3=4,C36<$AB$46),$AB$48,IF(AND($K$3=4,C36>=$AB$46),$AB$50,IF(AND($K$3=5,C36<$AC$46),$AC$48,IF(AND($K$3=5,C36>=$AC$46),$AC$50,IF(AND($K$3=6,C36<$AD$46),$AD$48,IF(AND($K$3=6,C36>=$AD$46),$AD$50,IF(AND($K$3=7,C36<$AE$46),$AE$48,IF(AND($K$3=7,C36>=$AE$46),$AE$50,IF(AND($K$3=8,C36<$AF$46),$AF$48,IF(AND($K$3=8,C36>=$AF$46),$AF$50))))))))))))))))","v":{"$error":"#REF!"}},{"$f":"(SUMPRODUCT(N(ISTEXT(M6:M35))))","v":0},{"$f":"IF(AND($M$3=1,C36<$Y$46),$Y$48,IF(AND($M$3=1,C36>=$Y$46),$Y$50,IF(AND($M$3=2,C36<$Z$46),$Z$48,IF(AND($M$3=2,C36>=$Z$46),$Z$50,IF(AND($M$3=3,C36<$AA$46),$AA$48,IF(AND($M$3=3,C36>=$AA$46),$AA$50,IF(AND($M$3=4,C36<$AB$46),$AB$48,IF(AND($M$3=4,C36>=$AB$46),$AB$50,IF(AND($M$3=5,C36<$AC$46),$AC$48,IF(AND($M$3=5,C36>=$AC$46),$AC$50,IF(AND($M$3=6,C36<$AD$46),$AD$48,IF(AND($M$3=6,C36>=$AD$46),$AD$50,IF(AND($M$3=7,C36<$AE$46),$AE$48,IF(AND($M$3=7,C36>=$AE$46),$AE$50,IF(AND($M$3=8,C36<$AF$46),$AF$48,IF(AND($M$3=8,C36>=$AF$46),$AF$50))))))))))))))))","v":"Faut oser tirer"},{"$f":"(SUMPRODUCT(N(ISTEXT(O6:O35))))","v":0},{"$f":"IF(AND($O$3=1,C36<$Y$46),$Y$48,IF(AND($O$3=1,C36>=$Y$46),$Y$50,IF(AND($O$3=2,C36<$Z$46),$Z$48,IF(AND($O$3=2,C36>=$Z$46),$Z$50,IF(AND($O$3=3,C36<$AA$46),$AA$48,IF(AND($O$3=3,C36>=$AA$46),$AA$50,IF(AND($O$3=4,C36<$AB$46),$AB$48,IF(AND($O$3=4,C36>=$AB$46),$AB$50,IF(AND($O$3=5,C36<$AC$46),$AC$48,IF(AND($O$3=5,C36>=$AC$46),$AC$50,IF(AND($O$3=6,C36<$AD$46),$AD$48,IF(AND($O$3=6,C36>=$AD$46),$AD$50,IF(AND($O$3=7,C36<$AE$46),$AE$48,IF(AND($O$3=7,C36>=$AE$46),$AE$50,IF(AND($O$3=8,C36<$AF$46),$AF$48,IF(AND($O$3=8,C36>=$AF$46),$AF$50))))))))))))))))","v":"Pourquoi vos tirs ne rentrent pas ? "},{"$f":"(SUMPRODUCT(N(ISTEXT(Q6:Q35))))","v":0},{"$f":"IF(AND($Q$3=1,C36<$Y$46),$Y$48,IF(AND($Q$3=1,C36>=$Y$46),$Y$50,IF(AND($Q$3=2,C36<$Z$46),$Z$48,IF(AND($Q$3=2,C36>=$Z$46),$Z$50,IF(AND($Q$3=3,C36<$AA$46),$AA$48,IF(AND($Q$3=3,C36>=$AA$46),$AA$50,IF(AND($Q$3=4,C36<$AB$46),$AB$48,IF(AND($Q$3=4,C36>=$AB$46),$AB$50,IF(AND($Q$3=5,C36<$AC$46),$AC$48,IF(AND($Q$3=5,C36>=$AC$46),$AC$50,IF(AND($Q$3=6,C36<$AD$46),$AD$48,IF(AND($Q$3=6,C36>=$AD$46),$AD$50,IF(AND($Q$3=7,C36<$AE$46),$AE$48,IF(AND($Q$3=7,C36>=$AE$46),$AE$50,IF(AND($Q$3=8,C36<$AF$46),$AF$48,IF(AND($Q$3=8,C36>=$AF$46),$AF$50))))))))))))))))","v":{"$error":"#REF!"}},{"$f":"(SUMPRODUCT(N(ISTEXT(S6:S35))))","v":0},{"$f":"IF(AND($S$3=1,C36<$Y$46),$Y$48,IF(AND($S$3=1,C36>=$Y$46),$Y$50,IF(AND($S$3=2,C36<$Z$46),$Z$48,IF(AND($S$3=2,C36>=$Z$46),$Z$50,IF(AND($S$3=3,C36<$AA$46),$AA$48,IF(AND($S$3=3,C36>=$AA$46),$AA$50,IF(AND($S$3=4,C36<$AB$46),$AB$48,IF(AND($S$3=4,C36>=$AB$46),$AB$50,IF(AND($S$3=5,C36<$AC$46),$AC$48,IF(AND($S$3=5,C36>=$AC$46),$AC$50,IF(AND($S$3=6,C36<$AD$46),$AD$48,IF(AND($S$3=6,C36>=$AD$46),$AD$50,IF(AND($S$3=7,C36<$AE$46),$AE$48,IF(AND($S$3=7,C36>=$AE$46),$AE$50,IF(AND($S$3=8,C36<$AF$46),$AF$48,IF(AND($S$3=8,C36>=$AF$46),$AF$50))))))))))))))))","v":"SI vous tirez il faudra être plus précis"},{"$f":"S36/SUM(M36+O36+S36)*100","v":{"$error":"#DIV/0!"}},{"$f":"IF(AND($U$3=1,C36<$Y$46),$Y$48,IF(AND($U$3=1,C36>=$Y$46),$Y$50,IF(AND($U$3=2,C36<$Z$46),$Z$48,IF(AND($U$3=2,C36>=$Z$46),$Z$50,IF(AND($U$3=3,C36<$AA$46),$AA$48,IF(AND($U$3=3,C36>=$AA$46),$AA$50,IF(AND($U$3=4,C36<$AB$46),$AB$48,IF(AND($U$3=4,C36>=$AB$46),$AB$50,IF(AND($U$3=5,C36<$AC$46),$AC$48,IF(AND($U$3=5,C36>=$AC$46),$AC$50,IF(AND($U$3=6,C36<$AD$46),$AD$48,IF(AND($U$3=6,C36>=$AD$46),$AD$50,IF(AND($U$3=7,C36<$AE$46),$AE$48,IF(AND($U$3=7,C36>=$AE$46),$AE$50,IF(AND($U$3=8,C36<$AF$46),$AF$48,IF(AND($U$3=8,C36>=$AF$46),$AF$50))))))))))))))))","v":"Pas de chance"},{"$f":"B36","v":"JAUNE"},null,{"$f":"DEBUT!Y36","v":"FAUTE"},{"$f":"DEBUT!Z36","v":"BALLON PERDU"},{"$f":"DEBUT!AA36","v":"POSSESSION"},{"$f":"DEBUT!AB36","v":"RECUPERATION B"},{"$f":"DEBUT!AC36","v":"TIRS"},{"$f":"DEBUT!AD36","v":"BONS TIRS"},{"$f":"DEBUT!AE36","v":"PANIERS"},{"$f":"DEBUT!AF36","v":"% REUSSITE"}]
[null,"Contrats ->",null,null,null,null,null,null,null,null,null,null,null,null,null,null,null,null,null,null,null,null,"<-Contrats "]
[null,{"$f":"EQUIPES!B4","v":"Alexis F."},{"$f":"COUNTIF($C$6:$C$35,B38)","v":0},{"$f":"IF(AND($C$3=1,C38<$Y$38),$Y$40,IF(AND($C$3=1,C38>=$Y$38),$Y$42,IF(AND($C$3=2,C38<$Z$38),$Z$40,IF(AND($C$3=2,C38>=$Z$38),$Z$42,IF(AND($C$3=3,C38<$AA$38),$AA$40,IF(AND($C$3=3,C38>=$AA$38),$AA$42,IF(AND($C$3=4,C38<$AB$38),$AB$40,IF(AND($C$3=4,C38>=$AB$38),$AB$42,IF(AND($C$3=5,C38<$AC$38),$AC$40,IF(AND($C$3=5,C38>=$AC$38),$AC$42,IF(AND($C$3=6,C38<$AD$38),$AD$40,IF(AND($C$3=6,C38>=$AD$38),$AD$42,IF(AND($C$3=7,C38<$AE$38),$AE$40,IF(AND($C$3=7,C38>=$AE$38),$AE$42,IF(AND($C$3=8,C38<$AF$38),$AF$40,IF(AND($C$3=8,C38>=$AF$38),$AF$42))))))))))))))))","v":"C'est bien tu gères la distance"},{"$f":"COUNTIF($E$6:$E$35,B38)","v":0},{"$f":"IF(AND($E$3=1,E38<$Y$38),$Y$40,IF(AND($E$3=1,E38>=$Y$38),$Y$42,IF(AND($E$3=2,E38<$Z$38),$Z$40,IF(AND($E$3=2,E38>=$Z$38),$Z$42,IF(AND($E$3=3,E38<$AA$38),$AA$40,IF(AND($E$3=3,E38>=$AA$38),$AA$42,IF(AND($E$3=4,E38<$AB$38),$AB$40,IF(AND($E$3=4,E38>=$AB$38),$AB$42,IF(AND($E$3=5,E38<$AC$38),$AC$40,IF(AND($E$3=5,E38>=$AC$38),$AC$42,IF(AND($E$3=6,E38<$AD$38),$AD$40,IF(AND($E$3=6,E38>=$AD$38),$AD$42,IF(AND($E$3=7,E38<$AE$38),$AE$40,IF(AND($E$3=7,E38>=$AE$38),$AE$42,IF(AND($E$3=8,E38<$AF$38),$AF$40,IF(AND($E$3=8,E38>=$AF$38),$AF$42))))))))))))))))","v":"Bien tu lèves la tête"},{"$f":"COUNTIF($G$6:$G$35,B38)","v":0},{"$f":"IF(AND($G$3=1,G38<$Y$38),$Y$40,IF(AND($G$3=1,G38>=$Y$38),$Y$42,IF(AND($G$3=2,G38<$Z$38),$Z$40,IF(AND($G$3=2,G38>=$Z$38),$Z$42,IF(AND($G$3=3,G38<$AA$38),$AA$40,IF(AND($G$3=3,G38>=$AA$38),$AA$42,IF(AND($G$3=4,G38<$AB$38),$AB$40,IF(AND($G$3=4,G38>=$AB$38),$AB$42,IF(AND($G$3=5,G38<$AC$38),$AC$40,IF(AND($G$3=5,G38>=$AC$38),$AC$42,IF(AND($G$3=6,G38<$AD$38),$AD$40,IF(AND($G$3=6,G38>=$AD$38),$AD$42,IF(AND($G$3=7,G38<$AE$38),$AE$40,IF(AND($G$3=7,G38>=$AE$38),$AE$42,IF(AND($G$3=8,G38<$AF$38),$AF$40,IF(AND($G$3=8,G38>=$AF$38),$AF$42))))))))))))))))","v":"Tu touches le ballon"},{"$f":"COUNTIF($I$6:$I$35,B38)","v":0},{"$f":"IF(AND($I$3=1,I38<$Y$38),$Y$40,IF(AND($I$3=1,I38>=$Y$38),$Y$42,IF(AND($I$3=2,I38<$Z$38),$Z$40,IF(AND($I$3=2,I38>=$Z$38),$Z$42,IF(AND($I$3=3,I38<$AA$38),$AA$40,IF(AND($I$3=3,I38>=$AA$38),$AA$42,IF(AND($I$3=4,I38<$AB$38),$AB$40,IF(AND($I$3=4,I38>=$AB$38),$AB$42,IF(AND($I$3=5,I38<$AC$38),$AC$40,IF(AND($I$3=5,I38>=$AC$38),$AC$42,IF(AND($I$3=6,I38<$AD$38),$AD$40,IF(AND($I$3=6,I38>=$AD$38),$AD$42,IF(AND($I$3=7,I38<$AE$38),$AE$40,IF(AND($I$3=7,I38>=$AE$38),$AE$42,IF(AND($I$3=8,I38<$AF$38),$AF$40,IF(AND($I$3=8,I38>=$AF$38),$AF$42))))))))))))))))","v":{"$error":"#REF!"}},{"$f":"COUNTIF($K$6:$K$35,B38)","v":0},{"$f":"IF(AND($K$3=1,K38<$Y$38),$Y$40,IF(AND($K$3=1,K38>=$Y$38),$Y$42,IF(AND($K$3=2,K38<$Z$38),$Z$40,IF(AND($K$3=2,K38>=$Z$38),$Z$42,IF(AND($K$3=3,K38<$AA$38),$AA$40,IF(AND($K$3=3,K38>=$AA$38),$AA$42,IF(AND($K$3=4,K38<$AB$38),$AB$40,IF(AND($K$3=4,K38>=$AB$38),$AB$42,IF(AND($K$3=5,K38<$AC$38),$AC$40,IF(AND($K$3=5,K38>=$AC$38),$AC$42,IF(AND($K$3=6,K38<$AD$38),$AD$40,IF(AND($K$3=6,K38>=$AD$38),$AD$42,IF(AND($K$3=7,K38<$AE$38),$AE$40,IF(AND($K$3=7,K38>=$AE$38),$AE$42,IF(AND($K$3=8,K38<$AF$38),$AF$40,IF(AND($K$3=8,K38>=$AF$38),$AF$42))))))))))))))))","v":{"$error":"#REF!"}},{"$f":"COUNTIF($M$6:$M$35,B38)","v":0},{"$f":"IF(AND($M$3=1,M38<$Y$38),$Y$40,IF(AND($M$3=1,M38>=$Y$38),$Y$42,IF(AND($M$3=2,M38<$Z$38),$Z$40,IF(AND($M$3=2,M38>=$Z$38),$Z$42,IF(AND($M$3=3,M38<$AA$38),$AA$40,IF(AND($M$3=3,M38>=$AA$38),$AA$42,IF(AND($M$3=4,M38<$AB$38),$AB$40,IF(AND($M$3=4,M38>=$AB$38),$AB$42,IF(AND($M$3=5,M38<$AC$38),$AC$40,IF(AND($M$3=5,M38>=$AC$38),$AC$42,IF(AND($M$3=6,M38<$AD$38),$AD$40,IF(AND($M$3=6,M38>=$AD$38),$AD$42,IF(AND($M$3=7,M38<$AE$38),$AE$40,IF(AND($M$3=7,M38>=$AE$38),$AE$42,IF(AND($M$3=8,M38<$AF$38),$AF$40,IF(AND($M$3=8,M38>=$AF$38),$AF$42))))))))))))))))","v":"Faut oser tirer"},{"$f":"COUNTIF($O$6:$O$35,B38)","v":0},{"$f":"IF(AND($O$3=1,O38<$Y$38),$Y$40,IF(AND($O$3=1,O38>=$Y$38),$Y$42,IF(AND($O$3=2,O38<$Z$38),$Z$40,IF(AND($O$3=2,O38>=$Z$38),$Z$42,IF(AND($O$3=3,O38<$AA$38),$AA$40,IF(AND($O$3=3,O38>=$AA$38),$AA$42,IF(AND($O$3=4,O38<$AB$38),$AB$40,IF(AND($O$3=4,O38>=$AB$38),$AB$42,IF(AND($O$3=5,O38<$AC$38),$AC$40,IF(AND($O$3=5,O38>=$AC$38),$AC$42,IF(AND($O$3=6,O38<$AD$38),$AD$40,IF(AND($O$3=6,O38>=$AD$38),$AD$42,IF(AND($O$3=7,O38<$AE$38),$AE$40,IF(AND($O$3=7,O38>=$AE$38),$AE$42,IF(AND($O$3=8,O38<$AF$38),$AF$40,IF(AND($O$3=8,O38>=$AF$38),$AF$42))))))))))))))))","v":"Pourquoi tes tirs ne rentrent pas ?"},{"$f":"COUNTIF($Q$6:$Q$35,B38)","v":0},{"$f":"IF(AND($Q$3=1,Q38<$Y$38),$Y$40,IF(AND($Q$3=1,Q38>=$Y$38),$Y$42,IF(AND($Q$3=2,Q38<$Z$38),$Z$40,IF(AND($Q$3=2,Q38>=$Z$38),$Z$42,IF(AND($Q$3=3,Q38<$AA$38),$AA$40,IF(AND($Q$3=3,Q38>=$AA$38),$AA$42,IF(AND($Q$3=4,Q38<$AB$38),$AB$40,IF(AND($Q$3=4,Q38>=$AB$38),$AB$42,IF(AND($Q$3=5,Q38<$AC$38),$AC$40,IF(AND($Q$3=5,Q38>=$AC$38),$AC$42,IF(AND($Q$3=6,Q38<$AD$38),$AD$40,IF(AND($Q$3=6,Q38>=$AD$38),$AD$42,IF(AND($Q$3=7,Q38<$AE$38),$AE$40,IF(AND($Q$3=7,Q38>=$AE$38),$AE$42,IF(AND($Q$3=8,Q38<$AF$38),$AF$40,IF(AND($Q$3=8,Q38>=$AF$38),$AF$42))))))))))))))))","v":{"$error":"#REF!"}},{"$f":"COUNTIF($S$6:$S$35,B38)","v":0},{"$f":"IF(AND($S$3=1,S38<$Y$38),$Y$40,IF(AND($S$3=1,S38>=$Y$38),$Y$42,IF(AND($S$3=2,S38<$Z$38),$Z$40,IF(AND($S$3=2,S38>=$Z$38),$Z$42,IF(AND($S$3=3,S38<$AA$38),$AA$40,IF(AND($S$3=3,S38>=$AA$38),$AA$42,IF(AND($S$3=4,S38<$AB$38),$AB$40,IF(AND($S$3=4,S38>=$AB$38),$AB$42,IF(AND($S$3=5,S38<$AC$38),$AC$40,IF(AND($S$3=5,S38>=$AC$38),$AC$42,IF(AND($S$3=6,S38<$AD$38),$AD$40,IF(AND($S$3=6,S38>=$AD$38),$AD$42,IF(AND($S$3=7,S38<$AE$38),$AE$40,IF(AND($S$3=7,S38>=$AE$38),$AE$42,IF(AND($S$3=8,S38<$AF$38),$AF$40,IF(AND($S$3=8,S38>=$AF$38),$AF$42))))))))))))))))","v":"SI tu tires il faudra être plus précis"},{"$f":"S38/SUM(M38+O38+S38)*100","v":{"$error":"#DIV/0!"}},{"$f":"IF(AND($U$3=1,U38<$Y$38),$Y$40,IF(AND($U$3=1,U38>=$Y$38),$Y$42,IF(AND($U$3=2,U38<$Z$38),$Z$40,IF(AND($U$3=2,U38>=$Z$38),$Z$42,IF(AND($U$3=3,U38<$AA$38),$AA$40,IF(AND($U$3=3,U38>=$AA$38),$AA$42,IF(AND($U$3=4,U38<$AB$38),$AB$40,IF(AND($U$3=4,U38>=$AB$38),$AB$42,IF(AND($U$3=5,U38<$AC$38),$AC$40,IF(AND($U$3=5,U38>=$AC$38),$AC$42,IF(AND($U$3=6,U38<$AD$38),$AD$40,IF(AND($U$3=6,U38>=$AD$38),$AD$42,IF(AND($U$3=7,U38<$AE$38),$AE$40,IF(AND($U$3=7,U38>=$AE$38),$AE$42,IF(AND($U$3=8,U38<$AF$38),$AF$40,IF(AND($U$3=8,U38>=$AF$38),$AF$42))))))))))))))))","v":{"$error":"#DIV/0!"}},{"$f":"B38","v":"Alexis F."},null,{"$f":"DEBUT!Y38","v":2},{"$f":"DEBUT!Z38","v":2},{"$f":"DEBUT!AA38","v":2},{"$f":"DEBUT!AB38","v":2},{"$f":"DEBUT!AC38","v":2},{"$f":"DEBUT!AD38","v":2},{"$f":"DEBUT!AE38","v":2},{"$f":"DEBUT!AF38","v":0.2}]
[null,"Contrats ->",null,null,null,null,null,null,null,null,null,null,null,null,null,null,null,null,null,null,null,null,"<-Contrats ","Contrats ind"]
[null,{"$f":"EQUIPES!B5","v":0},{"$f":"COUNTIF($C$6:$C$35,B40)","v":0},{"$f":"IF(AND($C$3=1,C40<$Y$38),$Y$40,IF(AND($C$3=1,C40>=$Y$38),$Y$42,IF(AND($C$3=2,C40<$Z$38),$Z$40,IF(AND($C$3=2,C40>=$Z$38),$Z$42,IF(AND($C$3=3,C40<$AA$38),$AA$40,IF(AND($C$3=3,C40>=$AA$38),$AA$42,IF(AND($C$3=4,C40<$AB$38),$AB$40,IF(AND($C$3=4,C40>=$AB$38),$AB$42,IF(AND($C$3=5,C40<$AC$38),$AC$40,IF(AND($C$3=5,C40>=$AC$38),$AC$42,IF(AND($C$3=6,C40<$AD$38),$AD$40,IF(AND($C$3=6,C40>=$AD$38),$AD$42,IF(AND($C$3=7,C40<$AE$38),$AE$40,IF(AND($C$3=7,C40>=$AE$38),$AE$42,IF(AND($C$3=8,C40<$AF$38),$AF$40,IF(AND($C$3=8,C40>=$AF$38),$AF$42))))))))))))))))","v":"C'est bien tu gères la distance"},{"$f":"COUNTIF($E$6:$E$35,B40)","v":0},{"$f":"IF(AND($E$3=1,E40<$Y$38),$Y$40,IF(AND($E$3=1,E40>=$Y$38),$Y$42,IF(AND($E$3=2,E40<$Z$38),$Z$40,IF(AND($E$3=2,E40>=$Z$38),$Z$42,IF(AND($E$3=3,E40<$AA$38),$AA$40,IF(AND($E$3=3,E40>=$AA$38),$AA$42,IF(AND($E$3=4,E40<$AB$38),$AB$40,IF(AND($E$3=4,E40>=$AB$38),$AB$42,IF(AND($E$3=5,E40<$AC$38),$AC$40,IF(AND($E$3=5,E40>=$AC$38),$AC$42,IF(AND($E$3=6,E40<$AD$38),$AD$40,IF(AND($E$3=6,E40>=$AD$38),$AD$42,IF(AND($E$3=7,E40<$AE$38),$AE$40,IF(AND($E$3=7,E40>=$AE$38),$AE$42,IF(AND($E$3=8,E40<$AF$38),$AF$40,IF(AND($E$3=8,E40>=$AF$38),$AF$42))))))))))))))))","v":"Bien tu lèves la tête"},{"$f":"COUNTIF($G$6:$G$35,B40)","v":0},{"$f":"IF(AND($G$3=1,G40<$Y$38),$Y$40,IF(AND($G$3=1,G40>=$Y$38),$Y$42,IF(AND($G$3=2,G40<$Z$38),$Z$40,IF(AND($G$3=2,G40>=$Z$38),$Z$42,IF(AND($G$3=3,G40<$AA$38),$AA$40,IF(AND($G$3=3,G40>=$AA$38),$AA$42,IF(AND($G$3=4,G40<$AB$38),$AB$40,IF(AND($G$3=4,G40>=$AB$38),$AB$42,IF(AND($G$3=5,G40<$AC$38),$AC$40,IF(AND($G$3=5,G40>=$AC$38),$AC$42,IF(AND($G$3=6,G40<$AD$38),$AD$40,IF(AND($G$3=6,G40>=$AD$38),$AD$42,IF(AND($G$3=7,G40<$AE$38),$AE$40,IF(AND($G$3=7,G40>=$AE$38),$AE$42,IF(AND($G$3=8,G40<$AF$38),$AF$40,IF(AND($G$3=8,G40>=$AF$38),$AF$42))))))))))))))))","v":"Tu touches le ballon"},null,{"$f":"IF(AND($I$3=1,I40<$Y$38),$Y$40,IF(AND($I$3=1,I40>=$Y$38),$Y$42,IF(AND($I$3=2,I40<$Z$38),$Z$40,IF(AND($I$3=2,I40>=$Z$38),$Z$42,IF(AND($I$3=3,I40<$AA$38),$AA$40,IF(AND($I$3=3,I40>=$AA$38),$AA$42,IF(AND($I$3=4,I40<$AB$38),$AB$40,IF(AND($I$3=4,I40>=$AB$38),$AB$42,IF(AND($I$3=5,I40<$AC$38),$AC$40,IF(AND($I$3=5,I40>=$AC$38),$AC$42,IF(AND($I$3=6,I40<$AD$38),$AD$40,IF(AND($I$3=6,I40>=$AD$38),$AD$42,IF(AND($I$3=7,I40<$AE$38),$AE$40,IF(AND($I$3=7,I40>=$AE$38),$AE$42,IF(AND($I$3=8,I40<$AF$38),$AF$40,IF(AND($I$3=8,I40>=$AF$38),$AF$42))))))))))))))))","v":{"$error":"#REF!"}},{"$f":"COUNTIF($K$6:$K$35,B40)","v":0},{"$f":"IF(AND($K$3=1,K40<$Y$38),$Y$40,IF(AND($K$3=1,K40>=$Y$38),$Y$42,IF(AND($K$3=2,K40<$Z$38),$Z$40,IF(AND($K$3=2,K40>=$Z$38),$Z$42,IF(AND($K$3=3,K40<$AA$38),$AA$40,IF(AND($K$3=3,K40>=$AA$38),$AA$42,IF(AND($K$3=4,K40<$AB$38),$AB$40,IF(AND($K$3=4,K40>=$AB$38),$AB$42,IF(AND($K$3=5,K40<$AC$38),$AC$40,IF(AND($K$3=5,K40>=$AC$38),$AC$42,IF(AND($K$3=6,K40<$AD$38),$AD$40,IF(AND($K$3=6,K40>=$AD$38),$AD$42,IF(AND($K$3=7,K40<$AE$38),$AE$40,IF(AND($K$3=7,K40>=$AE$38),$AE$42,IF(AND($K$3=8,K40<$AF$38),$AF$40,IF(AND($K$3=8,K40>=$AF$38),$AF$42))))))))))))))))","v":{"$error":"#REF!"}},{"$f":"COUNTIF($M$6:$M$35,B40)","v":0},{"$f":"IF(AND($M$3=1,M40<$Y$38),$Y$40,IF(AND($M$3=1,M40>=$Y$38),$Y$42,IF(AND($M$3=2,M40<$Z$38),$Z$40,IF(AND($M$3=2,M40>=$Z$38),$Z$42,IF(AND($M$3=3,M40<$AA$38),$AA$40,IF(AND($M$3=3,M40>=$AA$38),$AA$42,IF(AND($M$3=4,M40<$AB$38),$AB$40,IF(AND($M$3=4,M40>=$AB$38),$AB$42,IF(AND($M$3=5,M40<$AC$38),$AC$40,IF(AND($M$3=5,M40>=$AC$38),$AC$42,IF(AND($M$3=6,M40<$AD$38),$AD$40,IF(AND($M$3=6,M40>=$AD$38),$AD$42,IF(AND($M$3=7,M40<$AE$38),$AE$40,IF(AND($M$3=7,M40>=$AE$38),$AE$42,IF(AND($M$3=8,M40<$AF$38),$AF$40,IF(AND($M$3=8,M40>=$AF$38),$AF$42))))))))))))))))","v":"Faut oser tirer"},{"$f":"COUNTIF($O$6:$O$35,B40)","v":0},{"$f":"IF(AND($O$3=1,O40<$Y$38),$Y$40,IF(AND($O$3=1,O40>=$Y$38),$Y$42,IF(AND($O$3=2,O40<$Z$38),$Z$40,IF(AND($O$3=2,O40>=$Z$38),$Z$42,IF(AND($O$3=3,O40<$AA$38),$AA$40,IF(AND($O$3=3,O40>=$AA$38),$AA$42,IF(AND($O$3=4,O40<$AB$38),$AB$40,IF(AND($O$3=4,O40>=$AB$38),$AB$42,IF(AND($O$3=5,O40<$AC$38),$AC$40,IF(AND($O$3=5,O40>=$AC$38),$AC$42,IF(AND($O$3=6,O40<$AD$38),$AD$40,IF(AND($O$3=6,O40>=$AD$38),$AD$42,IF(AND($O$3=7,O40<$AE$38),$AE$40,IF(AND($O$3=7,O40>=$AE$38),$AE$42,IF(AND($O$3=8,O40<$AF$38),$AF$40,IF(AND($O$3=8,O40>=$AF$38),$AF$42))))))))))))))))","v":"Pourquoi tes tirs ne rentrent pas ?"},{"$f":"COUNTIF($Q$6:$Q$35,B40)","v":0},{"$f":"IF(AND($Q$3=1,Q40<$Y$38),$Y$40,IF(AND($Q$3=1,Q40>=$Y$38),$Y$42,IF(AND($Q$3=2,Q40<$Z$38),$Z$40,IF(AND($Q$3=2,Q40>=$Z$38),$Z$42,IF(AND($Q$3=3,Q40<$AA$38),$AA$40,IF(AND($Q$3=3,Q40>=$AA$38),$AA$42,IF(AND($Q$3=4,Q40<$AB$38),$AB$40,IF(AND($Q$3=4,Q40>=$AB$38),$AB$42,IF(AND($Q$3=5,Q40<$AC$38),$AC$40,IF(AND($Q$3=5,Q40>=$AC$38),$AC$42,IF(AND($Q$3=6,Q40<$AD$38),$AD$40,IF(AND($Q$3=6,Q40>=$AD$38),$AD$42,IF(AND($Q$3=7,Q40<$AE$38),$AE$40,IF(AND($Q$3=7,Q40>=$AE$38),$AE$42,IF(AND($Q$3=8,Q40<$AF$38),$AF$40,IF(AND($Q$3=8,Q40>=$AF$38),$AF$42))))))))))))))))","v":{"$error":"#REF!"}},{"$f":"COUNTIF($S$6:$S$35,B40)","v":0},{"$f":"IF(AND($S$3=1,S40<$Y$38),$Y$40,IF(AND($S$3=1,S40>=$Y$38),$Y$42,IF(AND($S$3=2,S40<$Z$38),$Z$40,IF(AND($S$3=2,S40>=$Z$38),$Z$42,IF(AND($S$3=3,S40<$AA$38),$AA$40,IF(AND($S$3=3,S40>=$AA$38),$AA$42,IF(AND($S$3=4,S40<$AB$38),$AB$40,IF(AND($S$3=4,S40>=$AB$38),$AB$42,IF(AND($S$3=5,S40<$AC$38),$AC$40,IF(AND($S$3=5,S40>=$AC$38),$AC$42,IF(AND($S$3=6,S40<$AD$38),$AD$40,IF(AND($S$3=6,S40>=$AD$38),$AD$42,IF(AND($S$3=7,S40<$AE$38),$AE$40,IF(AND($S$3=7,S40>=$AE$38),$AE$42,IF(AND($S$3=8,S40<$AF$38),$AF$40,IF(AND($S$3=8,S40>=$AF$38),$AF$42))))))))))))))))","v":"SI tu tires il faudra être plus précis"},{"$f":"S40/SUM(M40+O40+S40)*100","v":{"$error":"#DIV/0!"}},{"$f":"IF(AND($U$3=1,U40<$Y$38),$Y$40,IF(AND($U$3=1,U40>=$Y$38),$Y$42,IF(AND($U$3=2,U40<$Z$38),$Z$40,IF(AND($U$3=2,U40>=$Z$38),$Z$42,IF(AND($U$3=3,U40<$AA$38),$AA$40,IF(AND($U$3=3,U40>=$AA$38),$AA$42,IF(AND($U$3=4,U40<$AB$38),$AB$40,IF(AND($U$3=4,U40>=$AB$38),$AB$42,IF(AND($U$3=5,U40<$AC$38),$AC$40,IF(AND($U$3=5,U40>=$AC$38),$AC$42,IF(AND($U$3=6,U40<$AD$38),$AD$40,IF(AND($U$3=6,U40>=$AD$38),$AD$42,IF(AND($U$3=7,U40<$AE$38),$AE$40,IF(AND($U$3=7,U40>=$AE$38),$AE$42,IF(AND($U$3=8,U40<$AF$38),$AF$40,IF(AND($U$3=8,U40>=$AF$38),$AF$42))))))))))))))))","v":{"$error":"#DIV/0!"}},{"$f":"B40","v":0},0,{"$f":"DEBUT!Y40","v":"C'est bien tu gères la distance"},{"$f":"DEBUT!Z40","v":"Bien tu lèves la tête"},{"$f":"DEBUT!AA40","v":"Tu touches le ballon"},{"$f":"DEBUT!AB40","v":"Faut se bouger davantage"},{"$f":"DEBUT!AC40","v":"Faut oser tirer"},{"$f":"DEBUT!AD40","v":"Pourquoi tes tirs ne rentrent pas ?"},{"$f":"DEBUT!AE40","v":"SI tu tires il faudra être plus précis"},{"$f":"DEBUT!AF40","v":"Pas de chance"}]
[null,"Contrats ->",null,null,null,null,null,null,null,null,null,null,null,null,null,null,null,null,null,null,null,null,"<-Contrats "]
[null,{"$f":"EQUIPES!B6","v":0},{"$f":"COUNTIF($C$6:$C$35,B42)","v":0},{"$f":"IF(AND($C$3=1,C42<$Y$38),$Y$40,IF(AND($C$3=1,C42>=$Y$38),$Y$42,IF(AND($C$3=2,C42<$Z$38),$Z$40,IF(AND($C$3=2,C42>=$Z$38),$Z$42,IF(AND($C$3=3,C42<$AA$38),$AA$40,IF(AND($C$3=3,C42>=$AA$38),$AA$42,IF(AND($C$3=4,C42<$AB$38),$AB$40,IF(AND($C$3=4,C42>=$AB$38),$AB$42,IF(AND($C$3=5,C42<$AC$38),$AC$40,IF(AND($C$3=5,C42>=$AC$38),$AC$42,IF(AND($C$3=6,C42<$AD$38),$AD$40,IF(AND($C$3=6,C42>=$AD$38),$AD$42,IF(AND($C$3=7,C42<$AE$38),$AE$40,IF(AND($C$3=7,C42>=$AE$38),$AE$42,IF(AND($C$3=8,C42<$AF$38),$AF$40,IF(AND($C$3=8,C42>=$AF$38),$AF$42))))))))))))))))","v":"C'est bien tu gères la distance"},{"$f":"COUNTIF($E$6:$E$35,B42)","v":0},{"$f":"IF(AND($E$3=1,E42<$Y$38),$Y$40,IF(AND($E$3=1,E42>=$Y$38),$Y$42,IF(AND($E$3=2,E42<$Z$38),$Z$40,IF(AND($E$3=2,E42>=$Z$38),$Z$42,IF(AND($E$3=3,E42<$AA$38),$AA$40,IF(AND($E$3=3,E42>=$AA$38),$AA$42,IF(AND($E$3=4,E42<$AB$38),$AB$40,IF(AND($E$3=4,E42>=$AB$38),$AB$42,IF(AND($E$3=5,E42<$AC$38),$AC$40,IF(AND($E$3=5,E42>=$AC$38),$AC$42,IF(AND($E$3=6,E42<$AD$38),$AD$40,IF(AND($E$3=6,E42>=$AD$38),$AD$42,IF(AND($E$3=7,E42<$AE$38),$AE$40,IF(AND($E$3=7,E42>=$AE$38),$AE$42,IF(AND($E$3=8,E42<$AF$38),$AF$40,IF(AND($E$3=8,E42>=$AF$38),$AF$42))))))))))))))))","v":"Bien tu lèves la tête"},{"$f":"COUNTIF($G$6:$G$35,B42)","v":0},{"$f":"IF(AND($G$3=1,G42<$Y$38),$Y$40,IF(AND($G$3=1,G42>=$Y$38),$Y$42,IF(AND($G$3=2,G42<$Z$38),$Z$40,IF(AND($G$3=2,G42>=$Z$38),$Z$42,IF(AND($G$3=3,G42<$AA$38),$AA$40,IF(AND($G$3=3,G42>=$AA$38),$AA$42,IF(AND($G$3=4,G42<$AB$38),$AB$40,IF(AND($G$3=4,G42>=$AB$38),$AB$42,IF(AND($G$3=5,G42<$AC$38),$AC$40,IF(AND($G$3=5,G42>=$AC$38),$AC$42,IF(AND($G$3=6,G42<$AD$38),$AD$40,IF(AND($G$3=6,G42>=$AD$38),$AD$42,IF(AND($G$3=7,G42<$AE$38),$AE$40,IF(AND($G$3=7,G42>=$AE$38),$AE$42,IF(AND($G$3=8,G42<$AF$38),$AF$40,IF(AND($G$3=8,G42>=$AF$38),$AF$42))))))))))))))))","v":"Tu touches le ballon"},null,{"$f":"IF(AND($I$3=1,I42<$Y$38),$Y$40,IF(AND($I$3=1,I42>=$Y$38),$Y$42,IF(AND($I$3=2,I42<$Z$38),$Z$40,IF(AND($I$3=2,I42>=$Z$38),$Z$42,IF(AND($I$3=3,I42<$AA$38),$AA$40,IF(AND($I$3=3,I42>=$AA$38),$AA$42,IF(AND($I$3=4,I42<$AB$38),$AB$40,IF(AND($I$3=4,I42>=$AB$38),$AB$42,IF(AND($I$3=5,I42<$AC$38),$AC$40,IF(AND($I$3=5,I42>=$AC$38),$AC$42,IF(AND($I$3=6,I42<$AD$38),$AD$40,IF(AND($I$3=6,I42>=$AD$38),$AD$42,IF(AND($I$3=7,I42<$AE$38),$AE$40,IF(AND($I$3=7,I42>=$AE$38),$AE$42,IF(AND($I$3=8,I42<$AF$38),$AF$40,IF(AND($I$3=8,I42>=$AF$38),$AF$42))))))))))))))))","v":{"$error":"#REF!"}},{"$f":"COUNTIF($K$6:$K$35,B42)","v":0},{"$f":"IF(AND($K$3=1,K42<$Y$38),$Y$40,IF(AND($K$3=1,K42>=$Y$38),$Y$42,IF(AND($K$3=2,K42<$Z$38),$Z$40,IF(AND($K$3=2,K42>=$Z$38),$Z$42,IF(AND($K$3=3,K42<$AA$38),$AA$40,IF(AND($K$3=3,K42>=$AA$38),$AA$42,IF(AND($K$3=4,K42<$AB$38),$AB$40,IF(AND($K$3=4,K42>=$AB$38),$AB$42,IF(AND($K$3=5,K42<$AC$38),$AC$40,IF(AND($K$3=5,K42>=$AC$38),$AC$42,IF(AND($K$3=6,K42<$AD$38),$AD$40,IF(AND($K$3=6,K42>=$AD$38),$AD$42,IF(AND($K$3=7,K42<$AE$38),$AE$40,IF(AND($K$3=7,K42>=$AE$38),$AE$42,IF(AND($K$3=8,K42<$AF$38),$AF$40,IF(AND($K$3=8,K42>=$AF$38),$AF$42))))))))))))))))","v":{"$error":"#REF!"}},{"$f":"COUNTIF($M$6:$M$35,B42)","v":0},{"$f":"IF(AND($M$3=1,M42<$Y$38),$Y$40,IF(AND($M$3=1,M42>=$Y$38),$Y$42,IF(AND($M$3=2,M42<$Z$38),$Z$40,IF(AND($M$3=2,M42>=$Z$38),$Z$42,IF(AND($M$3=3,M42<$AA$38),$AA$40,IF(AND($M$3=3,M42>=$AA$38),$AA$42,IF(AND($M$3=4,M42<$AB$38),$AB$40,IF(AND($M$3=4,M42>=$AB$38),$AB$42,IF(AND($M$3=5,M42<$AC$38),$AC$40,IF(AND($M$3=5,M42>=$AC$38),$AC$42,IF(AND($M$3=6,M42<$AD$38),$AD$40,IF(AND($M$3=6,M42>=$AD$38),$AD$42,IF(AND($M$3=7,M42<$AE$38),$AE$40,IF(AND($M$3=7,M42>=$AE$38),$AE$42,IF(AND($M$3=8,M42<$AF$38),$AF$40,IF(AND($M$3=8,M42>=$AF$38),$AF$42))))))))))))))))","v":"Faut oser tirer"},{"$f":"COUNTIF($O$6:$O$35,B42)","v":0},{"$f":"IF(AND($O$3=1,O42<$Y$38),$Y$40,IF(AND($O$3=1,O42>=$Y$38),$Y$42,IF(AND($O$3=2,O42<$Z$38),$Z$40,IF(AND($O$3=2,O42>=$Z$38),$Z$42,IF(AND($O$3=3,O42<$AA$38),$AA$40,IF(AND($O$3=3,O42>=$AA$38),$AA$42,IF(AND($O$3=4,O42<$AB$38),$AB$40,IF(AND($O$3=4,O42>=$AB$38),$AB$42,IF(AND($O$3=5,O42<$AC$38),$AC$40,IF(AND($O$3=5,O42>=$AC$38),$AC$42,IF(AND($O$3=6,O42<$AD$38),$AD$40,IF(AND($O$3=6,O42>=$AD$38),$AD$42,IF(AND($O$3=7,O42<$AE$38),$AE$40,IF(AND($O$3=7,O42>=$AE$38),$AE$42,IF(AND($O$3=8,O42<$AF$38),$AF$40,IF(AND($O$3=8,O42>=$AF$38),$AF$42))))))))))))))))","v":"Pourquoi tes tirs ne rentrent pas ?"},{"$f":"COUNTIF($Q$6:$Q$35,B42)","v":0},{"$f":"IF(AND($Q$3=1,Q42<$Y$38),$Y$40,IF(AND($Q$3=1,Q42>=$Y$38),$Y$42,IF(AND($Q$3=2,Q42<$Z$38),$Z$40,IF(AND($Q$3=2,Q42>=$Z$38),$Z$42,IF(AND($Q$3=3,Q42<$AA$38),$AA$40,IF(AND($Q$3=3,Q42>=$AA$38),$AA$42,IF(AND($Q$3=4,Q42<$AB$38),$AB$40,IF(AND($Q$3=4,Q42>=$AB$38),$AB$42,IF(AND($Q$3=5,Q42<$AC$38),$AC$40,IF(AND($Q$3=5,Q42>=$AC$38),$AC$42,IF(AND($Q$3=6,Q42<$AD$38),$AD$40,IF(AND($Q$3=6,Q42>=$AD$38),$AD$42,IF(AND($Q$3=7,Q42<$AE$38),$AE$40,IF(AND($Q$3=7,Q42>=$AE$38),$AE$42,IF(AND($Q$3=8,Q42<$AF$38),$AF$40,IF(AND($Q$3=8,Q42>=$AF$38),$AF$42))))))))))))))))","v":{"$error":"#REF!"}},{"$f":"COUNTIF($S$6:$S$35,B42)","v":0},{"$f":"IF(AND($S$3=1,S42<$Y$38),$Y$40,IF(AND($S$3=1,S42>=$Y$38),$Y$42,IF(AND($S$3=2,S42<$Z$38),$Z$40,IF(AND($S$3=2,S42>=$Z$38),$Z$42,IF(AND($S$3=3,S42<$AA$38),$AA$40,IF(AND($S$3=3,S42>=$AA$38),$AA$42,IF(AND($S$3=4,S42<$AB$38),$AB$40,IF(AND($S$3=4,S42>=$AB$38),$AB$42,IF(AND($S$3=5,S42<$AC$38),$AC$40,IF(AND($S$3=5,S42>=$AC$38),$AC$42,IF(AND($S$3=6,S42<$AD$38),$AD$40,IF(AND($S$3=6,S42>=$AD$38),$AD$42,IF(AND($S$3=7,S42<$AE$38),$AE$40,IF(AND($S$3=7,S42>=$AE$38),$AE$42,IF(AND($S$3=8,S42<$AF$38),$AF$40,IF(AND($S$3=8,S42>=$AF$38),$AF$42))))))))))))))))","v":"SI tu tires il faudra être plus précis"},{"$f":"S42/SUM(M42+O42+S42)*100","v":{"$error":"#DIV/0!"}},{"$f":"IF(AND($U$3=1,U42<$Y$38),$Y$40,IF(AND($U$3=1,U42>=$Y$38),$Y$42,IF(AND($U$3=2,U42<$Z$38),$Z$40,IF(AND($U$3=2,U42>=$Z$38),$Z$42,IF(AND($U$3=3,U42<$AA$38),$AA$40,IF(AND($U$3=3,U42>=$AA$38),$AA$42,IF(AND($U$3=4,U42<$AB$38),$AB$40,IF(AND($U$3=4,U42>=$AB$38),$AB$42,IF(AND($U$3=5,U42<$AC$38),$AC$40,IF(AND($U$3=5,U42>=$AC$38),$AC$42,IF(AND($U$3=6,U42<$AD$38),$AD$40,IF(AND($U$3=6,U42>=$AD$38),$AD$42,IF(AND($U$3=7,U42<$AE$38),$AE$40,IF(AND($U$3=7,U42>=$AE$38),$AE$42,IF(AND($U$3=8,U42<$AF$38),$AF$40,IF(AND($U$3=8,U42>=$AF$38),$AF$42))))))))))))))))","v":{"$error":"#DIV/0!"}},{"$f":"B42","v":0},null,{"$f":"DEBUT!Y42","v":"Doucement "},{"$f":"DEBUT!Z42","v":"A qui tu fais la passe?"},{"$f":"DEBUT!AA42","v":"T'es plutot actif"},{"$f":"DEBUT!AB42","v":"Bien harcelé"},{"$f":"DEBUT!AC42","v":"Bien essayé mais faudra travailler l'adresse"},{"$f":"DEBUT!AD42","v":"On va travailler la précision"},{"$f":"DEBUT!AE42","v":"Joli"},{"$f":"DEBUT!AF42","v":"Bien visé"}]
[null,"Contrats ->",null,null,null,null,null,null,null,null,null,null,null,null,null,null,null,null,null,null,null,null,"<-Contrats "]
[null,{"$f":"EQUIPES!B7","v":0},{"$f":"COUNTIF($C$6:$C$35,B44)","v":0},{"$f":"IF(AND($C$3=1,C44<$Y$38),$Y$40,IF(AND($C$3=1,C44>=$Y$38),$Y$42,IF(AND($C$3=2,C44<$Z$38),$Z$40,IF(AND($C$3=2,C44>=$Z$38),$Z$42,IF(AND($C$3=3,C44<$AA$38),$AA$40,IF(AND($C$3=3,C44>=$AA$38),$AA$42,IF(AND($C$3=4,C44<$AB$38),$AB$40,IF(AND($C$3=4,C44>=$AB$38),$AB$42,IF(AND($C$3=5,C44<$AC$38),$AC$40,IF(AND($C$3=5,C44>=$AC$38),$AC$42,IF(AND($C$3=6,C44<$AD$38),$AD$40,IF(AND($C$3=6,C44>=$AD$38),$AD$42,IF(AND($C$3=7,C44<$AE$38),$AE$40,IF(AND($C$3=7,C44>=$AE$38),$AE$42,IF(AND($C$3=8,C44<$AF$38),$AF$40,IF(AND($C$3=8,C44>=$AF$38),$AF$42))))))))))))))))","v":"C'est bien tu gères la distance"},{"$f":"COUNTIF($E$6:$E$35,B44)","v":0},{"$f":"IF(AND($E$3=1,E44<$Y$38),$Y$40,IF(AND($E$3=1,E44>=$Y$38),$Y$42,IF(AND($E$3=2,E44<$Z$38),$Z$40,IF(AND($E$3=2,E44>=$Z$38),$Z$42,IF(AND($E$3=3,E44<$AA$38),$AA$40,IF(AND($E$3=3,E44>=$AA$38),$AA$42,IF(AND($E$3=4,E44<$AB$38),$AB$40,IF(AND($E$3=4,E44>=$AB$38),$AB$42,IF(AND($E$3=5,E44<$AC$38),$AC$40,IF(AND($E$3=5,E44>=$AC$38),$AC$42,IF(AND($E$3=6,E44<$AD$38),$AD$40,IF(AND($E$3=6,E44>=$AD$38),$AD$42,IF(AND($E$3=7,E44<$AE$38),$AE$40,IF(AND($E$3=7,E44>=$AE$38),$AE$42,IF(AND($E$3=8,E44<$AF$38),$AF$40,IF(AND($E$3=8,E44>=$AF$38),$AF$42))))))))))))))))","v":"Bien tu lèves la tête"},{"$f":"COUNTIF($G$6:$G$35,B44)","v":0},{"$f":"IF(AND($G$3=1,G44<$Y$38),$Y$40,IF(AND($G$3=1,G44>=$Y$38),$Y$42,IF(AND($G$3=2,G44<$Z$38),$Z$40,IF(AND($G$3=2,G44>=$Z$38),$Z$42,IF(AND($G$3=3,G44<$AA$38),$AA$40,IF(AND($G$3=3,G44>=$AA$38),$AA$42,IF(AND($G$3=4,G44<$AB$38),$AB$40,IF(AND($G$3=4,G44>=$AB$38),$AB$42,IF(AND($G$3=5,G44<$AC$38),$AC$40,IF(AND($G$3=5,G44>=$AC$38),$AC$42,IF(AND($G$3=6,G44<$AD$38),$AD$40,IF(AND($G$3=6,G44>=$AD$38),$AD$42,IF(AND($G$3=7,G44<$AE$38),$AE$40,IF(AND($G$3=7,G44>=$AE$38),$AE$42,IF(AND($G$3=8,G44<$AF$38),$AF$40,IF(AND($G$3=8,G44>=$AF$38),$AF$42))))))))))))))))","v":"Tu touches le ballon"},null,{"$f":"IF(AND($I$3=1,I44<$Y$38),$Y$40,IF(AND($I$3=1,I44>=$Y$38),$Y$42,IF(AND($I$3=2,I44<$Z$38),$Z$40,IF(AND($I$3=2,I44>=$Z$38),$Z$42,IF(AND($I$3=3,I44<$AA$38),$AA$40,IF(AND($I$3=3,I44>=$AA$38),$AA$42,IF(AND($I$3=4,I44<$AB$38),$AB$40,IF(AND($I$3=4,I44>=$AB$38),$AB$42,IF(AND($I$3=5,I44<$AC$38),$AC$40,IF(AND($I$3=5,I44>=$AC$38),$AC$42,IF(AND($I$3=6,I44<$AD$38),$AD$40,IF(AND($I$3=6,I44>=$AD$38),$AD$42,IF(AND($I$3=7,I44<$AE$38),$AE$40,IF(AND($I$3=7,I44>=$AE$38),$AE$42,IF(AND($I$3=8,I44<$AF$38),$AF$40,IF(AND($I$3=8,I44>=$AF$38),$AF$42))))))))))))))))","v":{"$error":"#REF!"}},{"$f":"COUNTIF($K$6:$K$35,B44)","v":0},{"$f":"IF(AND($K$3=1,K44<$Y$38),$Y$40,IF(AND($K$3=1,K44>=$Y$38),$Y$42,IF(AND($K$3=2,K44<$Z$38),$Z$40,IF(AND($K$3=2,K44>=$Z$38),$Z$42,IF(AND($K$3=3,K44<$AA$38),$AA$40,IF(AND($K$3=3,K44>=$AA$38),$AA$42,IF(AND($K$3=4,K44<$AB$38),$AB$40,IF(AND($K$3=4,K44>=$AB$38),$AB$42,IF(AND($K$3=5,K44<$AC$38),$AC$40,IF(AND($K$3=5,K44>=$AC$38),$AC$42,IF(AND($K$3=6,K44<$AD$38),$AD$40,IF(AND($K$3=6,K44>=$AD$38),$AD$42,IF(AND($K$3=7,K44<$AE$38),$AE$40,IF(AND($K$3=7,K44>=$AE$38),$AE$42,IF(AND($K$3=8,K44<$AF$38),$AF$40,IF(AND($K$3=8,K44>=$AF$38),$AF$42))))))))))))))))","v":{"$error":"#REF!"}},{"$f":"COUNTIF($M$6:$M$35,B44)","v":0},{"$f":"IF(AND($M$3=1,M44<$Y$38),$Y$40,IF(AND($M$3=1,M44>=$Y$38),$Y$42,IF(AND($M$3=2,M44<$Z$38),$Z$40,IF(AND($M$3=2,M44>=$Z$38),$Z$42,IF(AND($M$3=3,M44<$AA$38),$AA$40,IF(AND($M$3=3,M44>=$AA$38),$AA$42,IF(AND($M$3=4,M44<$AB$38),$AB$40,IF(AND($M$3=4,M44>=$AB$38),$AB$42,IF(AND($M$3=5,M44<$AC$38),$AC$40,IF(AND($M$3=5,M44>=$AC$38),$AC$42,IF(AND($M$3=6,M44<$AD$38),$AD$40,IF(AND($M$3=6,M44>=$AD$38),$AD$42,IF(AND($M$3=7,M44<$AE$38),$AE$40,IF(AND($M$3=7,M44>=$AE$38),$AE$42,IF(AND($M$3=8,M44<$AF$38),$AF$40,IF(AND($M$3=8,M44>=$AF$38),$AF$42))))))))))))))))","v":"Faut oser tirer"},{"$f":"COUNTIF($O$6:$O$35,B44)","v":0},{"$f":"IF(AND($O$3=1,O44<$Y$38),$Y$40,IF(AND($O$3=1,O44>=$Y$38),$Y$42,IF(AND($O$3=2,O44<$Z$38),$Z$40,IF(AND($O$3=2,O44>=$Z$38),$Z$42,IF(AND($O$3=3,O44<$AA$38),$AA$40,IF(AND($O$3=3,O44>=$AA$38),$AA$42,IF(AND($O$3=4,O44<$AB$38),$AB$40,IF(AND($O$3=4,O44>=$AB$38),$AB$42,IF(AND($O$3=5,O44<$AC$38),$AC$40,IF(AND($O$3=5,O44>=$AC$38),$AC$42,IF(AND($O$3=6,O44<$AD$38),$AD$40,IF(AND($O$3=6,O44>=$AD$38),$AD$42,IF(AND($O$3=7,O44<$AE$38),$AE$40,IF(AND($O$3=7,O44>=$AE$38),$AE$42,IF(AND($O$3=8,O44<$AF$38),$AF$40,IF(AND($O$3=8,O44>=$AF$38),$AF$42))))))))))))))))","v":"Pourquoi tes tirs ne rentrent pas ?"},{"$f":"COUNTIF($Q$6:$Q$35,B44)","v":0},{"$f":"IF(AND($Q$3=1,Q44<$Y$38),$Y$40,IF(AND($Q$3=1,Q44>=$Y$38),$Y$42,IF(AND($Q$3=2,Q44<$Z$38),$Z$40,IF(AND($Q$3=2,Q44>=$Z$38),$Z$42,IF(AND($Q$3=3,Q44<$AA$38),$AA$40,IF(AND($Q$3=3,Q44>=$AA$38),$AA$42,IF(AND($Q$3=4,Q44<$AB$38),$AB$40,IF(AND($Q$3=4,Q44>=$AB$38),$AB$42,IF(AND($Q$3=5,Q44<$AC$38),$AC$40,IF(AND($Q$3=5,Q44>=$AC$38),$AC$42,IF(AND($Q$3=6,Q44<$AD$38),$AD$40,IF(AND($Q$3=6,Q44>=$AD$38),$AD$42,IF(AND($Q$3=7,Q44<$AE$38),$AE$40,IF(AND($Q$3=7,Q44>=$AE$38),$AE$42,IF(AND($Q$3=8,Q44<$AF$38),$AF$40,IF(AND($Q$3=8,Q44>=$AF$38),$AF$42))))))))))))))))","v":{"$error":"#REF!"}},{"$f":"COUNTIF($S$6:$S$35,B44)","v":0},{"$f":"IF(AND($S$3=1,S44<$Y$38),$Y$40,IF(AND($S$3=1,S44>=$Y$38),$Y$42,IF(AND($S$3=2,S44<$Z$38),$Z$40,IF(AND($S$3=2,S44>=$Z$38),$Z$42,IF(AND($S$3=3,S44<$AA$38),$AA$40,IF(AND($S$3=3,S44>=$AA$38),$AA$42,IF(AND($S$3=4,S44<$AB$38),$AB$40,IF(AND($S$3=4,S44>=$AB$38),$AB$42,IF(AND($S$3=5,S44<$AC$38),$AC$40,IF(AND($S$3=5,S44>=$AC$38),$AC$42,IF(AND($S$3=6,S44<$AD$38),$AD$40,IF(AND($S$3=6,S44>=$AD$38),$AD$42,IF(AND($S$3=7,S44<$AE$38),$AE$40,IF(AND($S$3=7,S44>=$AE$38),$AE$42,IF(AND($S$3=8,S44<$AF$38),$AF$40,IF(AND($S$3=8,S44>=$AF$38),$AF$42))))))))))))))))","v":"SI tu tires il faudra être plus précis"},{"$f":"S44/SUM(M44+O44+S44)*100","v":{"$error":"#DIV/0!"}},{"$f":"IF(AND($U$3=1,U44<$Y$38),$Y$40,IF(AND($U$3=1,U44>=$Y$38),$Y$42,IF(AND($U$3=2,U44<$Z$38),$Z$40,IF(AND($U$3=2,U44>=$Z$38),$Z$42,IF(AND($U$3=3,U44<$AA$38),$AA$40,IF(AND($U$3=3,U44>=$AA$38),$AA$42,IF(AND($U$3=4,U44<$AB$38),$AB$40,IF(AND($U$3=4,U44>=$AB$38),$AB$42,IF(AND($U$3=5,U44<$AC$38),$AC$40,IF(AND($U$3=5,U44>=$AC$38),$AC$42,IF(AND($U$3=6,U44<$AD$38),$AD$40,IF(AND($U$3=6,U44>=$AD$38),$AD$42,IF(AND($U$3=7,U44<$AE$38),$AE$40,IF(AND($U$3=7,U44>=$AE$38),$AE$42,IF(AND($U$3=8,U44<$AF$38),$AF$40,IF(AND($U$3=8,U44>=$AF$38),$AF$42))))))))))))))))","v":{"$error":"#DIV/0!"}},{"$f":"B44","v":0},"Aide aux formules",{"$f":"DEBUT!Y44","v":1},{"$f":"DEBUT!Z44","v":2},{"$f":"DEBUT!AA44","v":3},{"$f":"DEBUT!AB44","v":4},{"$f":"DEBUT!AC44","v":5},{"$f":"DEBUT!AD44","v":6},{"$f":"DEBUT!AE44","v":7},{"$f":"DEBUT!AF44","v":8},9,10]
[null,"Contrats ->",null,null,null,null,null,null,null,null,null,null,null,null,null,null,null,null,null,null,null,null,"<-Contrats ",null,{"$f":"DEBUT!Y45","v":0},{"$f":"DEBUT!Z45","v":0},{"$f":"DEBUT!AA45","v":0},{"$f":"DEBUT!AB45","v":0},{"$f":"DEBUT!AC45","v":0},{"$f":"DEBUT!AD45","v":0},{"$f":"DEBUT!AE45","v":0},{"$f":"DEBUT!AF45","v":0}]
[null,{"$f":"EQUIPES!B8","v":0},{"$f":"COUNTIF($C$6:$C$35,B46)","v":0},{"$f":"IF(AND($C$3=1,C46<$Y$38),$Y$40,IF(AND($C$3=1,C46>=$Y$38),$Y$42,IF(AND($C$3=2,C46<$Z$38),$Z$40,IF(AND($C$3=2,C46>=$Z$38),$Z$42,IF(AND($C$3=3,C46<$AA$38),$AA$40,IF(AND($C$3=3,C46>=$AA$38),$AA$42,IF(AND($C$3=4,C46<$AB$38),$AB$40,IF(AND($C$3=4,C46>=$AB$38),$AB$42,IF(AND($C$3=5,C46<$AC$38),$AC$40,IF(AND($C$3=5,C46>=$AC$38),$AC$42,IF(AND($C$3=6,C46<$AD$38),$AD$40,IF(AND($C$3=6,C46>=$AD$38),$AD$42,IF(AND($C$3=7,C46<$AE$38),$AE$40,IF(AND($C$3=7,C46>=$AE$38),$AE$42,IF(AND($C$3=8,C46<$AF$38),$AF$40,IF(AND($C$3=8,C46>=$AF$38),$AF$42))))))))))))))))","v":"C'est bien tu gères la distance"},{"$f":"COUNTIF($E$6:$E$35,B46)","v":0},{"$f":"IF(AND($E$3=1,E46<$Y$38),$Y$40,IF(AND($E$3=1,E46>=$Y$38),$Y$42,IF(AND($E$3=2,E46<$Z$38),$Z$40,IF(AND($E$3=2,E46>=$Z$38),$Z$42,IF(AND($E$3=3,E46<$AA$38),$AA$40,IF(AND($E$3=3,E46>=$AA$38),$AA$42,IF(AND($E$3=4,E46<$AB$38),$AB$40,IF(AND($E$3=4,E46>=$AB$38),$AB$42,IF(AND($E$3=5,E46<$AC$38),$AC$40,IF(AND($E$3=5,E46>=$AC$38),$AC$42,IF(AND($E$3=6,E46<$AD$38),$AD$40,IF(AND($E$3=6,E46>=$AD$38),$AD$42,IF(AND($E$3=7,E46<$AE$38),$AE$40,IF(AND($E$3=7,E46>=$AE$38),$AE$42,IF(AND($E$3=8,E46<$AF$38),$AF$40,IF(AND($E$3=8,E46>=$AF$38),$AF$42))))))))))))))))","v":"Bien tu lèves la tête"},{"$f":"COUNTIF($G$6:$G$35,B46)","v":0},{"$f":"IF(AND($G$3=1,G46<$Y$38),$Y$40,IF(AND($G$3=1,G46>=$Y$38),$Y$42,IF(AND($G$3=2,G46<$Z$38),$Z$40,IF(AND($G$3=2,G46>=$Z$38),$Z$42,IF(AND($G$3=3,G46<$AA$38),$AA$40,IF(AND($G$3=3,G46>=$AA$38),$AA$42,IF(AND($G$3=4,G46<$AB$38),$AB$40,IF(AND($G$3=4,G46>=$AB$38),$AB$42,IF(AND($G$3=5,G46<$AC$38),$AC$40,IF(AND($G$3=5,G46>=$AC$38),$AC$42,IF(AND($G$3=6,G46<$AD$38),$AD$40,IF(AND($G$3=6,G46>=$AD$38),$AD$42,IF(AND($G$3=7,G46<$AE$38),$AE$40,IF(AND($G$3=7,G46>=$AE$38),$AE$42,IF(AND($G$3=8,G46<$AF$38),$AF$40,IF(AND($G$3=8,G46>=$AF$38),$AF$42))))))))))))))))","v":"Tu touches le ballon"},null,{"$f":"IF(AND($I$3=1,I46<$Y$38),$Y$40,IF(AND($I$3=1,I46>=$Y$38),$Y$42,IF(AND($I$3=2,I46<$Z$38),$Z$40,IF(AND($I$3=2,I46>=$Z$38),$Z$42,IF(AND($I$3=3,I46<$AA$38),$AA$40,IF(AND($I$3=3,I46>=$AA$38),$AA$42,IF(AND($I$3=4,I46<$AB$38),$AB$40,IF(AND($I$3=4,I46>=$AB$38),$AB$42,IF(AND($I$3=5,I46<$AC$38),$AC$40,IF(AND($I$3=5,I46>=$AC$38),$AC$42,IF(AND($I$3=6,I46<$AD$38),$AD$40,IF(AND($I$3=6,I46>=$AD$38),$AD$42,IF(AND($I$3=7,I46<$AE$38),$AE$40,IF(AND($I$3=7,I46>=$AE$38),$AE$42,IF(AND($I$3=8,I46<$AF$38),$AF$40,IF(AND($I$3=8,I46>=$AF$38),$AF$42))))))))))))))))","v":{"$error":"#REF!"}},{"$f":"COUNTIF($K$6:$K$35,B46)","v":0},{"$f":"IF(AND($K$3=1,K46<$Y$38),$Y$40,IF(AND($K$3=1,K46>=$Y$38),$Y$42,IF(AND($K$3=2,K46<$Z$38),$Z$40,IF(AND($K$3=2,K46>=$Z$38),$Z$42,IF(AND($K$3=3,K46<$AA$38),$AA$40,IF(AND($K$3=3,K46>=$AA$38),$AA$42,IF(AND($K$3=4,K46<$AB$38),$AB$40,IF(AND($K$3=4,K46>=$AB$38),$AB$42,IF(AND($K$3=5,K46<$AC$38),$AC$40,IF(AND($K$3=5,K46>=$AC$38),$AC$42,IF(AND($K$3=6,K46<$AD$38),$AD$40,IF(AND($K$3=6,K46>=$AD$38),$AD$42,IF(AND($K$3=7,K46<$AE$38),$AE$40,IF(AND($K$3=7,K46>=$AE$38),$AE$42,IF(AND($K$3=8,K46<$AF$38),$AF$40,IF(AND($K$3=8,K46>=$AF$38),$AF$42))))))))))))))))","v":{"$error":"#REF!"}},{"$f":"COUNTIF($M$6:$M$35,B46)","v":0},{"$f":"IF(AND($M$3=1,M46<$Y$38),$Y$40,IF(AND($M$3=1,M46>=$Y$38),$Y$42,IF(AND($M$3=2,M46<$Z$38),$Z$40,IF(AND($M$3=2,M46>=$Z$38),$Z$42,IF(AND($M$3=3,M46<$AA$38),$AA$40,IF(AND($M$3=3,M46>=$AA$38),$AA$42,IF(AND($M$3=4,M46<$AB$38),$AB$40,IF(AND($M$3=4,M46>=$AB$38),$AB$42,IF(AND($M$3=5,M46<$AC$38),$AC$40,IF(AND($M$3=5,M46>=$AC$38),$AC$42,IF(AND($M$3=6,M46<$AD$38),$AD$40,IF(AND($M$3=6,M46>=$AD$38),$AD$42,IF(AND($M$3=7,M46<$AE$38),$AE$40,IF(AND($M$3=7,M46>=$AE$38),$AE$42,IF(AND($M$3=8,M46<$AF$38),$AF$40,IF(AND($M$3=8,M46>=$AF$38),$AF$42))))))))))))))))","v":"Faut oser tirer"},{"$f":"COUNTIF($O$6:$O$35,B46)","v":0},{"$f":"IF(AND($O$3=1,O46<$Y$38),$Y$40,IF(AND($O$3=1,O46>=$Y$38),$Y$42,IF(AND($O$3=2,O46<$Z$38),$Z$40,IF(AND($O$3=2,O46>=$Z$38),$Z$42,IF(AND($O$3=3,O46<$AA$38),$AA$40,IF(AND($O$3=3,O46>=$AA$38),$AA$42,IF(AND($O$3=4,O46<$AB$38),$AB$40,IF(AND($O$3=4,O46>=$AB$38),$AB$42,IF(AND($O$3=5,O46<$AC$38),$AC$40,IF(AND($O$3=5,O46>=$AC$38),$AC$42,IF(AND($O$3=6,O46<$AD$38),$AD$40,IF(AND($O$3=6,O46>=$AD$38),$AD$42,IF(AND($O$3=7,O46<$AE$38),$AE$40,IF(AND($O$3=7,O46>=$AE$38),$AE$42,IF(AND($O$3=8,O46<$AF$38),$AF$40,IF(AND($O$3=8,O46>=$AF$38),$AF$42))))))))))))))))","v":"Pourquoi tes tirs ne rentrent pas ?"},{"$f":"COUNTIF($Q$6:$Q$35,B46)","v":0},{"$f":"IF(AND($Q$3=1,Q46<$Y$38),$Y$40,IF(AND($Q$3=1,Q46>=$Y$38),$Y$42,IF(AND($Q$3=2,Q46<$Z$38),$Z$40,IF(AND($Q$3=2,Q46>=$Z$38),$Z$42,IF(AND($Q$3=3,Q46<$AA$38),$AA$40,IF(AND($Q$3=3,Q46>=$AA$38),$AA$42,IF(AND($Q$3=4,Q46<$AB$38),$AB$40,IF(AND($Q$3=4,Q46>=$AB$38),$AB$42,IF(AND($Q$3=5,Q46<$AC$38),$AC$40,IF(AND($Q$3=5,Q46>=$AC$38),$AC$42,IF(AND($Q$3=6,Q46<$AD$38),$AD$40,IF(AND($Q$3=6,Q46>=$AD$38),$AD$42,IF(AND($Q$3=7,Q46<$AE$38),$AE$40,IF(AND($Q$3=7,Q46>=$AE$38),$AE$42,IF(AND($Q$3=8,Q46<$AF$38),$AF$40,IF(AND($Q$3=8,Q46>=$AF$38),$AF$42))))))))))))))))","v":{"$error":"#REF!"}},{"$f":"COUNTIF($S$6:$S$35,B46)","v":0},{"$f":"IF(AND($S$3=1,S46<$Y$38),$Y$40,IF(AND($S$3=1,S46>=$Y$38),$Y$42,IF(AND($S$3=2,S46<$Z$38),$Z$40,IF(AND($S$3=2,S46>=$Z$38),$Z$42,IF(AND($S$3=3,S46<$AA$38),$AA$40,IF(AND($S$3=3,S46>=$AA$38),$AA$42,IF(AND($S$3=4,S46<$AB$38),$AB$40,IF(AND($S$3=4,S46>=$AB$38),$AB$42,IF(AND($S$3=5,S46<$AC$38),$AC$40,IF(AND($S$3=5,S46>=$AC$38),$AC$42,IF(AND($S$3=6,S46<$AD$38),$AD$40,IF(AND($S$3=6,S46>=$AD$38),$AD$42,IF(AND($S$3=7,S46<$AE$38),$AE$40,IF(AND($S$3=7,S46>=$AE$38),$AE$42,IF(AND($S$3=8,S46<$AF$38),$AF$40,IF(AND($S$3=8,S46>=$AF$38),$AF$42))))))))))))))))","v":"SI tu tires il faudra être plus précis"},{"$f":"S46/SUM(M46+O46+S46)*100","v":{"$error":"#DIV/0!"}},{"$f":"IF(AND($U$3=1,U46<$Y$38),$Y$40,IF(AND($U$3=1,U46>=$Y$38),$Y$42,IF(AND($U$3=2,U46<$Z$38),$Z$40,IF(AND($U$3=2,U46>=$Z$38),$Z$42,IF(AND($U$3=3,U46<$AA$38),$AA$40,IF(AND($U$3=3,U46>=$AA$38),$AA$42,IF(AND($U$3=4,U46<$AB$38),$AB$40,IF(AND($U$3=4,U46>=$AB$38),$AB$42,IF(AND($U$3=5,U46<$AC$38),$AC$40,IF(AND($U$3=5,U46>=$AC$38),$AC$42,IF(AND($U$3=6,U46<$AD$38),$AD$40,IF(AND($U$3=6,U46>=$AD$38),$AD$42,IF(AND($U$3=7,U46<$AE$38),$AE$40,IF(AND($U$3=7,U46>=$AE$38),$AE$42,IF(AND($U$3=8,U46<$AF$38),$AF$40,IF(AND($U$3=8,U46>=$AF$38),$AF$42))))))))))))))))","v":{"$error":"#DIV/0!"}},{"$f":"B46","v":0},null,{"$f":"DEBUT!Y46","v":3},{"$f":"DEBUT!Z46","v":5},{"$f":"DEBUT!AA46","v":15},{"$f":"DEBUT!AB46","v":5},{"$f":"DEBUT!AC46","v":5},{"$f":"DEBUT!AD46","v":6},{"$f":"DEBUT!AE46","v":5},{"$f":"DEBUT!AF46","v":0.25}]
[null,"Contrats ->",null,null,null,null,null,null,null,null,null,null,null,null,null,null,null,null,null,null,null,null,"<-Contrats ","Contrats collectifs"]
[null,{"$f":"EQUIPES!B9","v":0},{"$f":"COUNTIF($C$6:$C$35,B48)","v":0},{"$f":"IF(AND($C$3=1,C48<$Y$38),$Y$40,IF(AND($C$3=1,C48>=$Y$38),$Y$42,IF(AND($C$3=2,C48<$Z$38),$Z$40,IF(AND($C$3=2,C48>=$Z$38),$Z$42,IF(AND($C$3=3,C48<$AA$38),$AA$40,IF(AND($C$3=3,C48>=$AA$38),$AA$42,IF(AND($C$3=4,C48<$AB$38),$AB$40,IF(AND($C$3=4,C48>=$AB$38),$AB$42,IF(AND($C$3=5,C48<$AC$38),$AC$40,IF(AND($C$3=5,C48>=$AC$38),$AC$42,IF(AND($C$3=6,C48<$AD$38),$AD$40,IF(AND($C$3=6,C48>=$AD$38),$AD$42,IF(AND($C$3=7,C48<$AE$38),$AE$40,IF(AND($C$3=7,C48>=$AE$38),$AE$42,IF(AND($C$3=8,C48<$AF$38),$AF$40,IF(AND($C$3=8,C48>=$AF$38),$AF$42))))))))))))))))","v":"C'est bien tu gères la distance"},{"$f":"COUNTIF($E$6:$E$35,B48)","v":0},{"$f":"IF(AND($E$3=1,E48<$Y$38),$Y$40,IF(AND($E$3=1,E48>=$Y$38),$Y$42,IF(AND($E$3=2,E48<$Z$38),$Z$40,IF(AND($E$3=2,E48>=$Z$38),$Z$42,IF(AND($E$3=3,E48<$AA$38),$AA$40,IF(AND($E$3=3,E48>=$AA$38),$AA$42,IF(AND($E$3=4,E48<$AB$38),$AB$40,IF(AND($E$3=4,E48>=$AB$38),$AB$42,IF(AND($E$3=5,E48<$AC$38),$AC$40,IF(AND($E$3=5,E48>=$AC$38),$AC$42,IF(AND($E$3=6,E48<$AD$38),$AD$40,IF(AND($E$3=6,E48>=$AD$38),$AD$42,IF(AND($E$3=7,E48<$AE$38),$AE$40,IF(AND($E$3=7,E48>=$AE$38),$AE$42,IF(AND($E$3=8,E48<$AF$38),$AF$40,IF(AND($E$3=8,E48>=$AF$38),$AF$42))))))))))))))))","v":"Bien tu lèves la tête"},{"$f":"COUNTIF($G$6:$G$35,B48)","v":0},{"$f":"IF(AND($G$3=1,G48<$Y$38),$Y$40,IF(AND($G$3=1,G48>=$Y$38),$Y$42,IF(AND($G$3=2,G48<$Z$38),$Z$40,IF(AND($G$3=2,G48>=$Z$38),$Z$42,IF(AND($G$3=3,G48<$AA$38),$AA$40,IF(AND($G$3=3,G48>=$AA$38),$AA$42,IF(AND($G$3=4,G48<$AB$38),$AB$40,IF(AND($G$3=4,G48>=$AB$38),$AB$42,IF(AND($G$3=5,G48<$AC$38),$AC$40,IF(AND($G$3=5,G48>=$AC$38),$AC$42,IF(AND($G$3=6,G48<$AD$38),$AD$40,IF(AND($G$3=6,G48>=$AD$38),$AD$42,IF(AND($G$3=7,G48<$AE$38),$AE$40,IF(AND($G$3=7,G48>=$AE$38),$AE$42,IF(AND($G$3=8,G48<$AF$38),$AF$40,IF(AND($G$3=8,G48>=$AF$38),$AF$42))))))))))))))))","v":"Tu touches le ballon"},null,{"$f":"IF(AND($I$3=1,I48<$Y$38),$Y$40,IF(AND($I$3=1,I48>=$Y$38),$Y$42,IF(AND($I$3=2,I48<$Z$38),$Z$40,IF(AND($I$3=2,I48>=$Z$38),$Z$42,IF(AND($I$3=3,I48<$AA$38),$AA$40,IF(AND($I$3=3,I48>=$AA$38),$AA$42,IF(AND($I$3=4,I48<$AB$38),$AB$40,IF(AND($I$3=4,I48>=$AB$38),$AB$42,IF(AND($I$3=5,I48<$AC$38),$AC$40,IF(AND($I$3=5,I48>=$AC$38),$AC$42,IF(AND($I$3=6,I48<$AD$38),$AD$40,IF(AND($I$3=6,I48>=$AD$38),$AD$42,IF(AND($I$3=7,I48<$AE$38),$AE$40,IF(AND($I$3=7,I48>=$AE$38),$AE$42,IF(AND($I$3=8,I48<$AF$38),$AF$40,IF(AND($I$3=8,I48>=$AF$38),$AF$42))))))))))))))))","v":{"$error":"#REF!"}},{"$f":"COUNTIF($K$6:$K$35,B48)","v":0},{"$f":"IF(AND($K$3=1,K48<$Y$38),$Y$40,IF(AND($K$3=1,K48>=$Y$38),$Y$42,IF(AND($K$3=2,K48<$Z$38),$Z$40,IF(AND($K$3=2,K48>=$Z$38),$Z$42,IF(AND($K$3=3,K48<$AA$38),$AA$40,IF(AND($K$3=3,K48>=$AA$38),$AA$42,IF(AND($K$3=4,K48<$AB$38),$AB$40,IF(AND($K$3=4,K48>=$AB$38),$AB$42,IF(AND($K$3=5,K48<$AC$38),$AC$40,IF(AND($K$3=5,K48>=$AC$38),$AC$42,IF(AND($K$3=6,K48<$AD$38),$AD$40,IF(AND($K$3=6,K48>=$AD$38),$AD$42,IF(AND($K$3=7,K48<$AE$38),$AE$40,IF(AND($K$3=7,K48>=$AE$38),$AE$42,IF(AND($K$3=8,K48<$AF$38),$AF$40,IF(AND($K$3=8,K48>=$AF$38),$AF$42))))))))))))))))","v":{"$error":"#REF!"}},{"$f":"COUNTIF($M$6:$M$35,B48)","v":0},{"$f":"IF(AND($M$3=1,M48<$Y$38),$Y$40,IF(AND($M$3=1,M48>=$Y$38),$Y$42,IF(AND($M$3=2,M48<$Z$38),$Z$40,IF(AND($M$3=2,M48>=$Z$38),$Z$42,IF(AND($M$3=3,M48<$AA$38),$AA$40,IF(AND($M$3=3,M48>=$AA$38),$AA$42,IF(AND($M$3=4,M48<$AB$38),$AB$40,IF(AND($M$3=4,M48>=$AB$38),$AB$42,IF(AND($M$3=5,M48<$AC$38),$AC$40,IF(AND($M$3=5,M48>=$AC$38),$AC$42,IF(AND($M$3=6,M48<$AD$38),$AD$40,IF(AND($M$3=6,M48>=$AD$38),$AD$42,IF(AND($M$3=7,M48<$AE$38),$AE$40,IF(AND($M$3=7,M48>=$AE$38),$AE$42,IF(AND($M$3=8,M48<$AF$38),$AF$40,IF(AND($M$3=8,M48>=$AF$38),$AF$42))))))))))))))))","v":"Faut oser tirer"},{"$f":"COUNTIF($O$6:$O$35,B48)","v":0},{"$f":"IF(AND($O$3=1,O48<$Y$38),$Y$40,IF(AND($O$3=1,O48>=$Y$38),$Y$42,IF(AND($O$3=2,O48<$Z$38),$Z$40,IF(AND($O$3=2,O48>=$Z$38),$Z$42,IF(AND($O$3=3,O48<$AA$38),$AA$40,IF(AND($O$3=3,O48>=$AA$38),$AA$42,IF(AND($O$3=4,O48<$AB$38),$AB$40,IF(AND($O$3=4,O48>=$AB$38),$AB$42,IF(AND($O$3=5,O48<$AC$38),$AC$40,IF(AND($O$3=5,O48>=$AC$38),$AC$42,IF(AND($O$3=6,O48<$AD$38),$AD$40,IF(AND($O$3=6,O48>=$AD$38),$AD$42,IF(AND($O$3=7,O48<$AE$38),$AE$40,IF(AND($O$3=7,O48>=$AE$38),$AE$42,IF(AND($O$3=8,O48<$AF$38),$AF$40,IF(AND($O$3=8,O48>=$AF$38),$AF$42))))))))))))))))","v":"Pourquoi tes tirs ne rentrent pas ?"},{"$f":"COUNTIF($Q$6:$Q$35,B48)","v":0},{"$f":"IF(AND($Q$3=1,Q48<$Y$38),$Y$40,IF(AND($Q$3=1,Q48>=$Y$38),$Y$42,IF(AND($Q$3=2,Q48<$Z$38),$Z$40,IF(AND($Q$3=2,Q48>=$Z$38),$Z$42,IF(AND($Q$3=3,Q48<$AA$38),$AA$40,IF(AND($Q$3=3,Q48>=$AA$38),$AA$42,IF(AND($Q$3=4,Q48<$AB$38),$AB$40,IF(AND($Q$3=4,Q48>=$AB$38),$AB$42,IF(AND($Q$3=5,Q48<$AC$38),$AC$40,IF(AND($Q$3=5,Q48>=$AC$38),$AC$42,IF(AND($Q$3=6,Q48<$AD$38),$AD$40,IF(AND($Q$3=6,Q48>=$AD$38),$AD$42,IF(AND($Q$3=7,Q48<$AE$38),$AE$40,IF(AND($Q$3=7,Q48>=$AE$38),$AE$42,IF(AND($Q$3=8,Q48<$AF$38),$AF$40,IF(AND($Q$3=8,Q48>=$AF$38),$AF$42))))))))))))))))","v":{"$error":"#REF!"}},{"$f":"COUNTIF($S$6:$S$35,B48)","v":0},{"$f":"IF(AND($S$3=1,S48<$Y$38),$Y$40,IF(AND($S$3=1,S48>=$Y$38),$Y$42,IF(AND($S$3=2,S48<$Z$38),$Z$40,IF(AND($S$3=2,S48>=$Z$38),$Z$42,IF(AND($S$3=3,S48<$AA$38),$AA$40,IF(AND($S$3=3,S48>=$AA$38),$AA$42,IF(AND($S$3=4,S48<$AB$38),$AB$40,IF(AND($S$3=4,S48>=$AB$38),$AB$42,IF(AND($S$3=5,S48<$AC$38),$AC$40,IF(AND($S$3=5,S48>=$AC$38),$AC$42,IF(AND($S$3=6,S48<$AD$38),$AD$40,IF(AND($S$3=6,S48>=$AD$38),$AD$42,IF(AND($S$3=7,S48<$AE$38),$AE$40,IF(AND($S$3=7,S48>=$AE$38),$AE$42,IF(AND($S$3=8,S48<$AF$38),$AF$40,IF(AND($S$3=8,S48>=$AF$38),$AF$42))))))))))))))))","v":"SI tu tires il faudra être plus précis"},{"$f":"S48/SUM(M48+O48+S48)*100","v":{"$error":"#DIV/0!"}},{"$f":"IF(AND($U$3=1,U48<$Y$38),$Y$40,IF(AND($U$3=1,U48>=$Y$38),$Y$42,IF(AND($U$3=2,U48<$Z$38),$Z$40,IF(AND($U$3=2,U48>=$Z$38),$Z$42,IF(AND($U$3=3,U48<$AA$38),$AA$40,IF(AND($U$3=3,U48>=$AA$38),$AA$42,IF(AND($U$3=4,U48<$AB$38),$AB$40,IF(AND($U$3=4,U48>=$AB$38),$AB$42,IF(AND($U$3=5,U48<$AC$38),$AC$40,IF(AND($U$3=5,U48>=$AC$38),$AC$42,IF(AND($U$3=6,U48<$AD$38),$AD$40,IF(AND($U$3=6,U48>=$AD$38),$AD$42,IF(AND($U$3=7,U48<$AE$38),$AE$40,IF(AND($U$3=7,U48>=$AE$38),$AE$42,IF(AND($U$3=8,U48<$AF$38),$AF$40,IF(AND($U$3=8,U48>=$AF$38),$AF$42))))))))))))))))","v":{"$error":"#DIV/0!"}},{"$f":"B48","v":0},null,{"$f":"DEBUT!Y48","v":"Vous êtes bien organisé"},{"$f":"DEBUT!Z48","v":"C'est bien vous faites des passes"},{"$f":"DEBUT!AA48","v":"Vous êtes où?"},{"$f":"DEBUT!AB48","v":"Faut se bouger davantage"},{"$f":"DEBUT!AC48","v":"Faut oser tirer"},{"$f":"DEBUT!AD48","v":"Pourquoi vos tirs ne rentrent pas ? "},{"$f":"DEBUT!AE48","v":"SI vous tirez il faudra être plus précis"},{"$f":"DEBUT!AF48","v":"Pas de chance"}]
[null,"Contrats ->",null,null,null,null,null,null,null,null,null,null,null,null,null,null,null,null,null,null,null,null,"<-Contrats "]
[null,{"$f":"EQUIPES!B10","v":0},{"$f":"COUNTIF($C$6:$C$35,B50)","v":0},{"$f":"IF(AND($C$3=1,C50<$Y$38),$Y$40,IF(AND($C$3=1,C50>=$Y$38),$Y$42,IF(AND($C$3=2,C50<$Z$38),$Z$40,IF(AND($C$3=2,C50>=$Z$38),$Z$42,IF(AND($C$3=3,C50<$AA$38),$AA$40,IF(AND($C$3=3,C50>=$AA$38),$AA$42,IF(AND($C$3=4,C50<$AB$38),$AB$40,IF(AND($C$3=4,C50>=$AB$38),$AB$42,IF(AND($C$3=5,C50<$AC$38),$AC$40,IF(AND($C$3=5,C50>=$AC$38),$AC$42,IF(AND($C$3=6,C50<$AD$38),$AD$40,IF(AND($C$3=6,C50>=$AD$38),$AD$42,IF(AND($C$3=7,C50<$AE$38),$AE$40,IF(AND($C$3=7,C50>=$AE$38),$AE$42,IF(AND($C$3=8,C50<$AF$38),$AF$40,IF(AND($C$3=8,C50>=$AF$38),$AF$42))))))))))))))))","v":"C'est bien tu gères la distance"},{"$f":"COUNTIF($E$6:$E$35,B50)","v":0},{"$f":"IF(AND($E$3=1,E50<$Y$38),$Y$40,IF(AND($E$3=1,E50>=$Y$38),$Y$42,IF(AND($E$3=2,E50<$Z$38),$Z$40,IF(AND($E$3=2,E50>=$Z$38),$Z$42,IF(AND($E$3=3,E50<$AA$38),$AA$40,IF(AND($E$3=3,E50>=$AA$38),$AA$42,IF(AND($E$3=4,E50<$AB$38),$AB$40,IF(AND($E$3=4,E50>=$AB$38),$AB$42,IF(AND($E$3=5,E50<$AC$38),$AC$40,IF(AND($E$3=5,E50>=$AC$38),$AC$42,IF(AND($E$3=6,E50<$AD$38),$AD$40,IF(AND($E$3=6,E50>=$AD$38),$AD$42,IF(AND($E$3=7,E50<$AE$38),$AE$40,IF(AND($E$3=7,E50>=$AE$38),$AE$42,IF(AND($E$3=8,E50<$AF$38),$AF$40,IF(AND($E$3=8,E50>=$AF$38),$AF$42))))))))))))))))","v":"Bien tu lèves la tête"},{"$f":"COUNTIF($G$6:$G$35,B50)","v":0},{"$f":"IF(AND($G$3=1,G50<$Y$38),$Y$40,IF(AND($G$3=1,G50>=$Y$38),$Y$42,IF(AND($G$3=2,G50<$Z$38),$Z$40,IF(AND($G$3=2,G50>=$Z$38),$Z$42,IF(AND($G$3=3,G50<$AA$38),$AA$40,IF(AND($G$3=3,G50>=$AA$38),$AA$42,IF(AND($G$3=4,G50<$AB$38),$AB$40,IF(AND($G$3=4,G50>=$AB$38),$AB$42,IF(AND($G$3=5,G50<$AC$38),$AC$40,IF(AND($G$3=5,G50>=$AC$38),$AC$42,IF(AND($G$3=6,G50<$AD$38),$AD$40,IF(AND($G$3=6,G50>=$AD$38),$AD$42,IF(AND($G$3=7,G50<$AE$38),$AE$40,IF(AND($G$3=7,G50>=$AE$38),$AE$42,IF(AND($G$3=8,G50<$AF$38),$AF$40,IF(AND($G$3=8,G50>=$AF$38),$AF$42))))))))))))))))","v":"Tu touches le ballon"},null,{"$f":"IF(AND($I$3=1,I50<$Y$38),$Y$40,IF(AND($I$3=1,I50>=$Y$38),$Y$42,IF(AND($I$3=2,I50<$Z$38),$Z$40,IF(AND($I$3=2,I50>=$Z$38),$Z$42,IF(AND($I$3=3,I50<$AA$38),$AA$40,IF(AND($I$3=3,I50>=$AA$38),$AA$42,IF(AND($I$3=4,I50<$AB$38),$AB$40,IF(AND($I$3=4,I50>=$AB$38),$AB$42,IF(AND($I$3=5,I50<$AC$38),$AC$40,IF(AND($I$3=5,I50>=$AC$38),$AC$42,IF(AND($I$3=6,I50<$AD$38),$AD$40,IF(AND($I$3=6,I50>=$AD$38),$AD$42,IF(AND($I$3=7,I50<$AE$38),$AE$40,IF(AND($I$3=7,I50>=$AE$38),$AE$42,IF(AND($I$3=8,I50<$AF$38),$AF$40,IF(AND($I$3=8,I50>=$AF$38),$AF$42))))))))))))))))","v":{"$error":"#REF!"}},{"$f":"COUNTIF($K$6:$K$35,B50)","v":0},{"$f":"IF(AND($K$3=1,K50<$Y$38),$Y$40,IF(AND($K$3=1,K50>=$Y$38),$Y$42,IF(AND($K$3=2,K50<$Z$38),$Z$40,IF(AND($K$3=2,K50>=$Z$38),$Z$42,IF(AND($K$3=3,K50<$AA$38),$AA$40,IF(AND($K$3=3,K50>=$AA$38),$AA$42,IF(AND($K$3=4,K50<$AB$38),$AB$40,IF(AND($K$3=4,K50>=$AB$38),$AB$42,IF(AND($K$3=5,K50<$AC$38),$AC$40,IF(AND($K$3=5,K50>=$AC$38),$AC$42,IF(AND($K$3=6,K50<$AD$38),$AD$40,IF(AND($K$3=6,K50>=$AD$38),$AD$42,IF(AND($K$3=7,K50<$AE$38),$AE$40,IF(AND($K$3=7,K50>=$AE$38),$AE$42,IF(AND($K$3=8,K50<$AF$38),$AF$40,IF(AND($K$3=8,K50>=$AF$38),$AF$42))))))))))))))))","v":{"$error":"#REF!"}},{"$f":"COUNTIF($M$6:$M$35,B50)","v":0},{"$f":"IF(AND($M$3=1,M50<$Y$38),$Y$40,IF(AND($M$3=1,M50>=$Y$38),$Y$42,IF(AND($M$3=2,M50<$Z$38),$Z$40,IF(AND($M$3=2,M50>=$Z$38),$Z$42,IF(AND($M$3=3,M50<$AA$38),$AA$40,IF(AND($M$3=3,M50>=$AA$38),$AA$42,IF(AND($M$3=4,M50<$AB$38),$AB$40,IF(AND($M$3=4,M50>=$AB$38),$AB$42,IF(AND($M$3=5,M50<$AC$38),$AC$40,IF(AND($M$3=5,M50>=$AC$38),$AC$42,IF(AND($M$3=6,M50<$AD$38),$AD$40,IF(AND($M$3=6,M50>=$AD$38),$AD$42,IF(AND($M$3=7,M50<$AE$38),$AE$40,IF(AND($M$3=7,M50>=$AE$38),$AE$42,IF(AND($M$3=8,M50<$AF$38),$AF$40,IF(AND($M$3=8,M50>=$AF$38),$AF$42))))))))))))))))","v":"Faut oser tirer"},{"$f":"COUNTIF($O$6:$O$35,B50)","v":0},{"$f":"IF(AND($O$3=1,O50<$Y$38),$Y$40,IF(AND($O$3=1,O50>=$Y$38),$Y$42,IF(AND($O$3=2,O50<$Z$38),$Z$40,IF(AND($O$3=2,O50>=$Z$38),$Z$42,IF(AND($O$3=3,O50<$AA$38),$AA$40,IF(AND($O$3=3,O50>=$AA$38),$AA$42,IF(AND($O$3=4,O50<$AB$38),$AB$40,IF(AND($O$3=4,O50>=$AB$38),$AB$42,IF(AND($O$3=5,O50<$AC$38),$AC$40,IF(AND($O$3=5,O50>=$AC$38),$AC$42,IF(AND($O$3=6,O50<$AD$38),$AD$40,IF(AND($O$3=6,O50>=$AD$38),$AD$42,IF(AND($O$3=7,O50<$AE$38),$AE$40,IF(AND($O$3=7,O50>=$AE$38),$AE$42,IF(AND($O$3=8,O50<$AF$38),$AF$40,IF(AND($O$3=8,O50>=$AF$38),$AF$42))))))))))))))))","v":"Pourquoi tes tirs ne rentrent pas ?"},{"$f":"COUNTIF($Q$6:$Q$35,B50)","v":0},{"$f":"IF(AND($Q$3=1,Q50<$Y$38),$Y$40,IF(AND($Q$3=1,Q50>=$Y$38),$Y$42,IF(AND($Q$3=2,Q50<$Z$38),$Z$40,IF(AND($Q$3=2,Q50>=$Z$38),$Z$42,IF(AND($Q$3=3,Q50<$AA$38),$AA$40,IF(AND($Q$3=3,Q50>=$AA$38),$AA$42,IF(AND($Q$3=4,Q50<$AB$38),$AB$40,IF(AND($Q$3=4,Q50>=$AB$38),$AB$42,IF(AND($Q$3=5,Q50<$AC$38),$AC$40,IF(AND($Q$3=5,Q50>=$AC$38),$AC$42,IF(AND($Q$3=6,Q50<$AD$38),$AD$40,IF(AND($Q$3=6,Q50>=$AD$38),$AD$42,IF(AND($Q$3=7,Q50<$AE$38),$AE$40,IF(AND($Q$3=7,Q50>=$AE$38),$AE$42,IF(AND($Q$3=8,Q50<$AF$38),$AF$40,IF(AND($Q$3=8,Q50>=$AF$38),$AF$42))))))))))))))))","v":{"$error":"#REF!"}},{"$f":"COUNTIF($S$6:$S$35,B50)","v":0},{"$f":"IF(AND($S$3=1,S50<$Y$38),$Y$40,IF(AND($S$3=1,S50>=$Y$38),$Y$42,IF(AND($S$3=2,S50<$Z$38),$Z$40,IF(AND($S$3=2,S50>=$Z$38),$Z$42,IF(AND($S$3=3,S50<$AA$38),$AA$40,IF(AND($S$3=3,S50>=$AA$38),$AA$42,IF(AND($S$3=4,S50<$AB$38),$AB$40,IF(AND($S$3=4,S50>=$AB$38),$AB$42,IF(AND($S$3=5,S50<$AC$38),$AC$40,IF(AND($S$3=5,S50>=$AC$38),$AC$42,IF(AND($S$3=6,S50<$AD$38),$AD$40,IF(AND($S$3=6,S50>=$AD$38),$AD$42,IF(AND($S$3=7,S50<$AE$38),$AE$40,IF(AND($S$3=7,S50>=$AE$38),$AE$42,IF(AND($S$3=8,S50<$AF$38),$AF$40,IF(AND($S$3=8,S50>=$AF$38),$AF$42))))))))))))))))","v":"SI tu tires il faudra être plus précis"},{"$f":"S50/SUM(M50+O50+S50)*100","v":{"$error":"#DIV/0!"}},{"$f":"IF(AND($U$3=1,U50<$Y$38),$Y$40,IF(AND($U$3=1,U50>=$Y$38),$Y$42,IF(AND($U$3=2,U50<$Z$38),$Z$40,IF(AND($U$3=2,U50>=$Z$38),$Z$42,IF(AND($U$3=3,U50<$AA$38),$AA$40,IF(AND($U$3=3,U50>=$AA$38),$AA$42,IF(AND($U$3=4,U50<$AB$38),$AB$40,IF(AND($U$3=4,U50>=$AB$38),$AB$42,IF(AND($U$3=5,U50<$AC$38),$AC$40,IF(AND($U$3=5,U50>=$AC$38),$AC$42,IF(AND($U$3=6,U50<$AD$38),$AD$40,IF(AND($U$3=6,U50>=$AD$38),$AD$42,IF(AND($U$3=7,U50<$AE$38),$AE$40,IF(AND($U$3=7,U50>=$AE$38),$AE$42,IF(AND($U$3=8,U50<$AF$38),$AF$40,IF(AND($U$3=8,U50>=$AF$38),$AF$42))))))))))))))))","v":{"$error":"#DIV/0!"}},{"$f":"B50","v":0},null,{"$f":"DEBUT!Y50","v":"Trop de fautes collectives"},{"$f":"DEBUT!Z50","v":"Trop de ballons perdus"},{"$f":"DEBUT!AA50","v":"Bonne activité collective"},{"$f":"DEBUT!AB50","v":"Bien harcelé"},{"$f":"DEBUT!AC50","v":"Bien essayé mais faudra travailler l'adresse"},{"$f":"DEBUT!AD50","v":"On va travailler la précision"},{"$f":"DEBUT!AE50","v":"Joli"},{"$f":"DEBUT!AF50","v":"Bien visé"}]
[null,"Contrats ->",null,null,null,null,null,null,null,null,null,null,null,null,null,null,null,null,null,null,null,null,"<-Contrats "]
[null,{"$f":"EQUIPES!B11","v":"Emmanuel"},{"$f":"COUNTIF($C$6:$C$35,B52)","v":0},{"$f":"IF(AND($C$3=1,C52<$Y$38),$Y$40,IF(AND($C$3=1,C52>=$Y$38),$Y$42,IF(AND($C$3=2,C52<$Z$38),$Z$40,IF(AND($C$3=2,C52>=$Z$38),$Z$42,IF(AND($C$3=3,C52<$AA$38),$AA$40,IF(AND($C$3=3,C52>=$AA$38),$AA$42,IF(AND($C$3=4,C52<$AB$38),$AB$40,IF(AND($C$3=4,C52>=$AB$38),$AB$42,IF(AND($C$3=5,C52<$AC$38),$AC$40,IF(AND($C$3=5,C52>=$AC$38),$AC$42,IF(AND($C$3=6,C52<$AD$38),$AD$40,IF(AND($C$3=6,C52>=$AD$38),$AD$42,IF(AND($C$3=7,C52<$AE$38),$AE$40,IF(AND($C$3=7,C52>=$AE$38),$AE$42,IF(AND($C$3=8,C52<$AF$38),$AF$40,IF(AND($C$3=8,C52>=$AF$38),$AF$42))))))))))))))))","v":"C'est bien tu gères la distance"},{"$f":"COUNTIF($E$6:$E$35,B52)","v":0},{"$f":"IF(AND($E$3=1,E52<$Y$38),$Y$40,IF(AND($E$3=1,E52>=$Y$38),$Y$42,IF(AND($E$3=2,E52<$Z$38),$Z$40,IF(AND($E$3=2,E52>=$Z$38),$Z$42,IF(AND($E$3=3,E52<$AA$38),$AA$40,IF(AND($E$3=3,E52>=$AA$38),$AA$42,IF(AND($E$3=4,E52<$AB$38),$AB$40,IF(AND($E$3=4,E52>=$AB$38),$AB$42,IF(AND($E$3=5,E52<$AC$38),$AC$40,IF(AND($E$3=5,E52>=$AC$38),$AC$42,IF(AND($E$3=6,E52<$AD$38),$AD$40,IF(AND($E$3=6,E52>=$AD$38),$AD$42,IF(AND($E$3=7,E52<$AE$38),$AE$40,IF(AND($E$3=7,E52>=$AE$38),$AE$42,IF(AND($E$3=8,E52<$AF$38),$AF$40,IF(AND($E$3=8,E52>=$AF$38),$AF$42))))))))))))))))","v":"Bien tu lèves la tête"},{"$f":"COUNTIF($G$6:$G$35,B52)","v":0},{"$f":"IF(AND($G$3=1,G52<$Y$38),$Y$40,IF(AND($G$3=1,G52>=$Y$38),$Y$42,IF(AND($G$3=2,G52<$Z$38),$Z$40,IF(AND($G$3=2,G52>=$Z$38),$Z$42,IF(AND($G$3=3,G52<$AA$38),$AA$40,IF(AND($G$3=3,G52>=$AA$38),$AA$42,IF(AND($G$3=4,G52<$AB$38),$AB$40,IF(AND($G$3=4,G52>=$AB$38),$AB$42,IF(AND($G$3=5,G52<$AC$38),$AC$40,IF(AND($G$3=5,G52>=$AC$38),$AC$42,IF(AND($G$3=6,G52<$AD$38),$AD$40,IF(AND($G$3=6,G52>=$AD$38),$AD$42,IF(AND($G$3=7,G52<$AE$38),$AE$40,IF(AND($G$3=7,G52>=$AE$38),$AE$42,IF(AND($G$3=8,G52<$AF$38),$AF$40,IF(AND($G$3=8,G52>=$AF$38),$AF$42))))))))))))))))","v":"Tu touches le ballon"},null,{"$f":"IF(AND($I$3=1,I52<$Y$38),$Y$40,IF(AND($I$3=1,I52>=$Y$38),$Y$42,IF(AND($I$3=2,I52<$Z$38),$Z$40,IF(AND($I$3=2,I52>=$Z$38),$Z$42,IF(AND($I$3=3,I52<$AA$38),$AA$40,IF(AND($I$3=3,I52>=$AA$38),$AA$42,IF(AND($I$3=4,I52<$AB$38),$AB$40,IF(AND($I$3=4,I52>=$AB$38),$AB$42,IF(AND($I$3=5,I52<$AC$38),$AC$40,IF(AND($I$3=5,I52>=$AC$38),$AC$42,IF(AND($I$3=6,I52<$AD$38),$AD$40,IF(AND($I$3=6,I52>=$AD$38),$AD$42,IF(AND($I$3=7,I52<$AE$38),$AE$40,IF(AND($I$3=7,I52>=$AE$38),$AE$42,IF(AND($I$3=8,I52<$AF$38),$AF$40,IF(AND($I$3=8,I52>=$AF$38),$AF$42))))))))))))))))","v":{"$error":"#REF!"}},{"$f":"COUNTIF($K$6:$K$35,B52)","v":0},{"$f":"IF(AND($K$3=1,K52<$Y$38),$Y$40,IF(AND($K$3=1,K52>=$Y$38),$Y$42,IF(AND($K$3=2,K52<$Z$38),$Z$40,IF(AND($K$3=2,K52>=$Z$38),$Z$42,IF(AND($K$3=3,K52<$AA$38),$AA$40,IF(AND($K$3=3,K52>=$AA$38),$AA$42,IF(AND($K$3=4,K52<$AB$38),$AB$40,IF(AND($K$3=4,K52>=$AB$38),$AB$42,IF(AND($K$3=5,K52<$AC$38),$AC$40,IF(AND($K$3=5,K52>=$AC$38),$AC$42,IF(AND($K$3=6,K52<$AD$38),$AD$40,IF(AND($K$3=6,K52>=$AD$38),$AD$42,IF(AND($K$3=7,K52<$AE$38),$AE$40,IF(AND($K$3=7,K52>=$AE$38),$AE$42,IF(AND($K$3=8,K52<$AF$38),$AF$40,IF(AND($K$3=8,K52>=$AF$38),$AF$42))))))))))))))))","v":{"$error":"#REF!"}},{"$f":"COUNTIF($M$6:$M$35,B52)","v":0},{"$f":"IF(AND($M$3=1,M52<$Y$38),$Y$40,IF(AND($M$3=1,M52>=$Y$38),$Y$42,IF(AND($M$3=2,M52<$Z$38),$Z$40,IF(AND($M$3=2,M52>=$Z$38),$Z$42,IF(AND($M$3=3,M52<$AA$38),$AA$40,IF(AND($M$3=3,M52>=$AA$38),$AA$42,IF(AND($M$3=4,M52<$AB$38),$AB$40,IF(AND($M$3=4,M52>=$AB$38),$AB$42,IF(AND($M$3=5,M52<$AC$38),$AC$40,IF(AND($M$3=5,M52>=$AC$38),$AC$42,IF(AND($M$3=6,M52<$AD$38),$AD$40,IF(AND($M$3=6,M52>=$AD$38),$AD$42,IF(AND($M$3=7,M52<$AE$38),$AE$40,IF(AND($M$3=7,M52>=$AE$38),$AE$42,IF(AND($M$3=8,M52<$AF$38),$AF$40,IF(AND($M$3=8,M52>=$AF$38),$AF$42))))))))))))))))","v":"Faut oser tirer"},{"$f":"COUNTIF($O$6:$O$35,B52)","v":0},{"$f":"IF(AND($O$3=1,O52<$Y$38),$Y$40,IF(AND($O$3=1,O52>=$Y$38),$Y$42,IF(AND($O$3=2,O52<$Z$38),$Z$40,IF(AND($O$3=2,O52>=$Z$38),$Z$42,IF(AND($O$3=3,O52<$AA$38),$AA$40,IF(AND($O$3=3,O52>=$AA$38),$AA$42,IF(AND($O$3=4,O52<$AB$38),$AB$40,IF(AND($O$3=4,O52>=$AB$38),$AB$42,IF(AND($O$3=5,O52<$AC$38),$AC$40,IF(AND($O$3=5,O52>=$AC$38),$AC$42,IF(AND($O$3=6,O52<$AD$38),$AD$40,IF(AND($O$3=6,O52>=$AD$38),$AD$42,IF(AND($O$3=7,O52<$AE$38),$AE$40,IF(AND($O$3=7,O52>=$AE$38),$AE$42,IF(AND($O$3=8,O52<$AF$38),$AF$40,IF(AND($O$3=8,O52>=$AF$38),$AF$42))))))))))))))))","v":"Pourquoi tes tirs ne rentrent pas ?"},{"$f":"COUNTIF($Q$6:$Q$35,B52)","v":0},{"$f":"IF(AND($Q$3=1,Q52<$Y$38),$Y$40,IF(AND($Q$3=1,Q52>=$Y$38),$Y$42,IF(AND($Q$3=2,Q52<$Z$38),$Z$40,IF(AND($Q$3=2,Q52>=$Z$38),$Z$42,IF(AND($Q$3=3,Q52<$AA$38),$AA$40,IF(AND($Q$3=3,Q52>=$AA$38),$AA$42,IF(AND($Q$3=4,Q52<$AB$38),$AB$40,IF(AND($Q$3=4,Q52>=$AB$38),$AB$42,IF(AND($Q$3=5,Q52<$AC$38),$AC$40,IF(AND($Q$3=5,Q52>=$AC$38),$AC$42,IF(AND($Q$3=6,Q52<$AD$38),$AD$40,IF(AND($Q$3=6,Q52>=$AD$38),$AD$42,IF(AND($Q$3=7,Q52<$AE$38),$AE$40,IF(AND($Q$3=7,Q52>=$AE$38),$AE$42,IF(AND($Q$3=8,Q52<$AF$38),$AF$40,IF(AND($Q$3=8,Q52>=$AF$38),$AF$42))))))))))))))))","v":{"$error":"#REF!"}},{"$f":"COUNTIF($S$6:$S$35,B52)","v":0},{"$f":"IF(AND($S$3=1,S52<$Y$38),$Y$40,IF(AND($S$3=1,S52>=$Y$38),$Y$42,IF(AND($S$3=2,S52<$Z$38),$Z$40,IF(AND($S$3=2,S52>=$Z$38),$Z$42,IF(AND($S$3=3,S52<$AA$38),$AA$40,IF(AND($S$3=3,S52>=$AA$38),$AA$42,IF(AND($S$3=4,S52<$AB$38),$AB$40,IF(AND($S$3=4,S52>=$AB$38),$AB$42,IF(AND($S$3=5,S52<$AC$38),$AC$40,IF(AND($S$3=5,S52>=$AC$38),$AC$42,IF(AND($S$3=6,S52<$AD$38),$AD$40,IF(AND($S$3=6,S52>=$AD$38),$AD$42,IF(AND($S$3=7,S52<$AE$38),$AE$40,IF(AND($S$3=7,S52>=$AE$38),$AE$42,IF(AND($S$3=8,S52<$AF$38),$AF$40,IF(AND($S$3=8,S52>=$AF$38),$AF$42))))))))))))))))","v":"SI tu tires il faudra être plus précis"},{"$f":"S52/SUM(M52+O52+S52)*100","v":{"$error":"#DIV/0!"}},{"$f":"IF(AND($U$3=1,U52<$Y$38),$Y$40,IF(AND($U$3=1,U52>=$Y$38),$Y$42,IF(AND($U$3=2,U52<$Z$38),$Z$40,IF(AND($U$3=2,U52>=$Z$38),$Z$42,IF(AND($U$3=3,U52<$AA$38),$AA$40,IF(AND($U$3=3,U52>=$AA$38),$AA$42,IF(AND($U$3=4,U52<$AB$38),$AB$40,IF(AND($U$3=4,U52>=$AB$38),$AB$42,IF(AND($U$3=5,U52<$AC$38),$AC$40,IF(AND($U$3=5,U52>=$AC$38),$AC$42,IF(AND($U$3=6,U52<$AD$38),$AD$40,IF(AND($U$3=6,U52>=$AD$38),$AD$42,IF(AND($U$3=7,U52<$AE$38),$AE$40,IF(AND($U$3=7,U52>=$AE$38),$AE$42,IF(AND($U$3=8,U52<$AF$38),$AF$40,IF(AND($U$3=8,U52>=$AF$38),$AF$42))))))))))))))))","v":{"$error":"#DIV/0!"}},{"$f":"B52","v":"Emmanuel"}]
[null,"Contrats ->",null,null,null,null,null,null,null,null,0,null,null,null,null,null,null,null,null,null,null,null,"<-Contrats "]
[]
[null,{"$f":"B36","v":"JAUNE"},{"$f":"C36","v":0},"Vous êtes bien organisé",0,"C'est bien vous faites des passes",0,"Vous êtes où?",0,{"$error":"#REF!"},0,{"$error":"#REF!"},0,"Faut oser tirer",0,"Pourquoi vos tirs ne rentrent pas ? ",0,{"$error":"#REF!"},0,"SI vous tirez il faudra être plus précis",{"$error":"#DIV/0!"},"Pas de chance"]
[null,"Contrats ->"]
[]
[null,"EQUIPE","FAUTES\n/POSSESSION",null,"PERTE DE BALLE\n/POSSESSION",null,null,null,null,null,"RECUPERATION\n/POSSESSION",null,null,null,"TIR\n/POSSESSION",null,"CONTRE ATTAQUE\n/POSSESSION",null,"PANIER\n/POSSESSION",null,"TIR REUSSI\n/TIR TENTE",null,null,null,"FAUTES/POSSESSION","PERTE DE BALLE /POSSESSION","RECUPERATION /POSSESSION","CONTRE ATTAQUE /POSSESSION","ATTEINTE ZONE AVANT /POSSESSION","TIR REUSSI / TIR TENTE","TIR /POSSESSION","PANIER /POSSESSION"]
[null,{"$f":"B55","v":"JAUNE"},{"$f":"C55/G5","v":{"$error":"#DIV/0!"}},{"$f":"IF(C59>Y60,Y64,Y62)","v":{"$error":"#DIV/0!"}},{"$f":"#REF!/G5","v":{"$error":"#REF!"}},{"$f":"IF(E59>Z60,Z64,Z62)","v":{"$error":"#REF!"}},null,null,null,null,{"$f":"K55/K35","v":{"$error":"#DIV/0!"}},{"$f":"IF(K59>AA60,AA64,AA62)","v":{"$error":"#DIV/0!"}},null,null,{"$f":"O55/G5","v":{"$error":"#DIV/0!"}},{"$f":"IF(O59>AE60,AE64,AE62)","v":{"$error":"#DIV/0!"}},null,null,{"$f":"S55/G5","v":{"$error":"#DIV/0!"}},{"$f":"IF(S59>AF60,AF64,AF62)","v":{"$error":"#DIV/0!"}},{"$f":"S55/(M55+O55+S55)","v":{"$error":"#DIV/0!"}},{"$f":"IF(U59>AD60,AD64,AD62)","v":{"$error":"#DIV/0!"}}]
[null,"Contrats ->",null,null,null,null,null,null,null,null,null,null,null,null,null,null,null,null,null,null,null,null,null,null,0.05,0.1,0.2,0.5,null,0.3,0.5,0.3]
[null,"PROFILS DE JEU ET SITUATIONS A TRAVAILLER"]
[null,null,"MON POINT FORT",null,"MON POINT FAIBLE",null,"JE VEUX TRAVAILLER …",null,null,null,"SITUATIONS A TRAVAILLER n°",null,"Nom de la situation A TRAVAILLER",null,null,null,null,null,"PROFIL DE JEU DE NOTRE EQUIPE",null,"Nom de la SITUATION A TRAVAILLER",null,null,null,"Bonne maitrise","c'est bien vous demandez le ballon","Allez on s'organise un peu","Dès récupération du ballon il faut s'organiser ensemble","Trop de ballons perdus","Manque d'adresse","Chaque action devrait aboutir à un bon tir","Il faut shooter plus"]
[null,{"$f":"B38","v":"Alexis F."},"TIR",null,"DEFENSE INDIVIDUELLE",null,"PASSE",null,null,null,{"$f":"VLOOKUP(C63,#REF!,4,TRUE)","v":{"$error":"#REF!"}},null,{"$f":"VLOOKUP(G63,DEBUT!$R$3:$V$12,2,FALSE)","v":{"$error":"#N/A"}},null,null,null,null,null,"Contre attaque",null,{"$f":"VLOOKUP(S63,DEBUT!R13:V26,2,FALSE)","v":{"$error":"#N/A"}}]
[null,{"$f":"B40","v":0},"PASSE",null,"DEFENSE INDIVIDUELLE",null,"TIR",null,null,null,{"$f":"VLOOKUP(C64,#REF!,4,TRUE)","v":{"$error":"#REF!"}},null,{"$f":"VLOOKUP(G64,DEBUT!$R$3:$V$12,2,FALSE)","v":{"$error":"#N/A"}},null,null,null,null,null,null,null,null,null,null,null,"Faut se calmer","Trop de ballon perdu : faut lever la t^te","ça défend bien","ça va vite chez vous","Maintenant il faut réussir à tirer","Oh mais c'est Golden State","C'est bien mais faut travailler l'adresse","Efficacité"]
[null,{"$f":"B42","v":0},null,null,"DEFENSE INDIVIDUELLE",null,"TIR",null,null,null,{"$f":"VLOOKUP(C65,#REF!,4,TRUE)","v":{"$error":"#REF!"}},null,{"$f":"VLOOKUP(G65,DEBUT!$R$3:$V$12,2,FALSE)","v":{"$error":"#N/A"}}]
[null,{"$f":"B44","v":0},null,null,"DEFENSE INDIVIDUELLE",null,"TIR",null,null,null,{"$f":"VLOOKUP(C66,#REF!,4,TRUE)","v":{"$error":"#REF!"}},null,{"$f":"VLOOKUP(G66,DEBUT!$R$3:$V$12,2,FALSE)","v":{"$error":"#N/A"}}]
[null,{"$f":"B46","v":0},null,null,"DEFENSE INDIVIDUELLE",null,"TIR",null,null,null,{"$f":"VLOOKUP(C67,#REF!,4,TRUE)","v":{"$error":"#REF!"}},null,{"$f":"VLOOKUP(G67,DEBUT!$R$3:$V$12,2,FALSE)","v":{"$error":"#N/A"}}]
[null,{"$f":"B48","v":0},null,null,"DEFENSE INDIVIDUELLE",null,"TIR",null,null,null,{"$f":"VLOOKUP(C68,#REF!,4,TRUE)","v":{"$error":"#REF!"}},null,{"$f":"VLOOKUP(G68,DEBUT!$R$3:$V$12,2,FALSE)","v":{"$error":"#N/A"}}]
[null,{"$f":"B50","v":0},null,null,"DEFENSE INDIVIDUELLE",null,"TIR",null,null,null,{"$f":"VLOOKUP(C69,#REF!,4,TRUE)","v":{"$error":"#REF!"}},null,{"$f":"VLOOKUP(G69,DEBUT!$R$3:$V$12,2,FALSE)","v":{"$error":"#N/A"}}]
[null,{"$f":"B52","v":"Emmanuel"},null,null,"DEFENSE INDIVIDUELLE",null,"TIR",null,null,null,{"$f":"VLOOKUP(C70,#REF!,4,TRUE)","v":{"$error":"#REF!"}},null,{"$f":"VLOOKUP(G70,DEBUT!$R$3:$V$12,2,FALSE)","v":{"$error":"#N/A"}}]
[]
[null,null,null,"Le profil de jeu peut être choisi par l'élève à partir de l'analyse de ses stats ou alors à partir d'une formule du type : si TIR = 0 alors travailler SA1"]

{"sheet":"OBS3","index":4,"n_rows":72,"n_cols":34,"rows_kept":72,"cut":false,"hidden":false,"merged":[[66,2,66,3],[66,4,66,5],[66,6,66,7],[66,10,66,11],[66,12,66,14],[69,2,69,3],[69,4,69,5],[69,6,69,7],[69,10,69,11],[69,12,69,14],[67,2,67,3],[67,4,67,5],[67,6,67,7],[67,10,67,11],[67,12,67,14],[68,2,68,3],[68,4,68,5],[68,6,68,7],[68,10,68,11],[68,12,68,14],[63,30,64,30],[63,2,63,3],[63,4,63,5],[63,6,63,7],[63,10,63,11],[63,12,63,14],[63,24,64,24],[65,2,65,3],[65,4,65,5],[65,6,65,7],[65,10,65,11],[65,12,65,14],[64,4,64,5],[64,6,64,7],[64,10,64,11],[64,12,64,14],[63,25,64,25],[63,26,64,26],[63,27,64,27],[63,28,64,28],[63,29,64,29],[61,29,62,29],[61,30,62,30],[61,31,62,31],[62,2,62,3],[62,4,62,5],[62,6,62,7],[62,10,62,11],[62,12,62,14],[62,18,69,19],[62,20,69,21],[61,20,61,21],[61,24,62,24],[61,25,62,25],[61,26,62,26],[61,27,62,27],[61,28,62,28],[61,2,61,3],[61,4,61,5],[61,6,61,7],[61,10,61,11],[61,12,61,14],[61,18,61,19],[63,31,64,31],[64,2,64,3],[59,27,60,27],[59,28,60,28],[59,29,60,29],[59,30,60,30],[59,31,60,31],[60,1,60,21],[58,17,59,17],[58,19,59,19],[58,21,59,21],[59,24,60,24],[59,25,60,25],[59,26,60,26],[57,29,58,29],[57,30,58,30],[57,31,58,31],[58,3,59,3],[58,5,59,5],[58,7,59,7],[58,9,59,9],[58,11,59,11],[58,13,59,13],[58,15,59,15],[57,20,57,21],[57,24,58,24],[57,25,58,25],[57,26,58,26],[57,27,58,27],[57,28,58,28],[54,21,55,21],[57,2,57,3],[57,4,57,5],[57,6,57,7],[57,8,57,9],[57,10,57,11],[57,12,57,13],[57,14,57,15],[57,16,57,17],[57,18,57,19],[54,3,55,3],[54,5,55,5],[54,7,55,7],[54,9,55,9],[54,11,55,11],[54,13,55,13],[54,15,55,15],[54,17,55,17],[54,19,55,19],[47,19,48,19],[47,21,48,21],[47,24,48,24],[49,21,50,21],[51,3,52,3],[51,5,52,5],[51,7,52,7],[51,9,52,9],[51,11,52,11],[51,13,52,13],[51,15,52,15],[51,17,52,17],[51,19,52,19],[51,21,52,21],[49,3,50,3],[49,5,50,5],[49,7,50,7],[49,9,50,9],[49,11,50,11],[49,13,50,13],[49,15,50,15],[49,17,50,17],[49,19,50,19],[45,29,46,29],[45,30,46,30],[45,31,46,31],[47,3,48,3],[47,5,48,5],[47,7,48,7],[47,9,48,9],[47,11,48,11],[45,17,46,17],[45,19,46,19],[45,21,46,21],[45,24,46,24],[45,25,46,25],[45,26,46,26],[47,31,48,31],[47,25,48,25],[47,26,48,26],[47,27,48,27],[47,28,48,28],[47,29,48,29],[47,30,48,30],[47,13,48,13],[47,15,48,15],[47,17,48,17],[45,3,46,3],[45,5,46,5],[45,7,46,7],[45,9,46,9],[45,11,46,11],[45,13,46,13],[45,15,46,15],[45,27,46,27],[45,28,46,28],[41,30,42,30],[41,31,42,31],[43,3,44,3],[43,5,44,5],[43,7,44,7],[43,9,44,9],[43,11,44,11],[43,13,44,13],[43,15,44,15],[41,21,42,21],[41,24,42,24],[41,25,42,25],[41,26,42,26],[41,27,42,27],[41,28,42,28],[43,17,44,17],[43,19,44,19],[43,21,44,21],[37,24,38,24],[39,31,40,31],[41,3,42,3],[41,5,42,5],[41,7,42,7],[41,9,42,9],[41,11,42,11],[41,13,42,13],[41,15,42,15],[41,17,42,17],[41,19,42,19],[39,25,40,25],[39,26,40,26],[39,27,40,27],[39,28,40,28],[39,29,40,29],[39,30,40,30],[39,13,40,13],[39,15,40,15],[39,17,40,17],[39,19,40,19],[39,21,40,21],[39,24,40,24],[41,29,42,29],[35,3,36,3],[39,3,40,3],[39,5,40,5],[39,7,40,7],[39,9,40,9],[39,11,40,11],[37,17,38,17],[37,19,38,19],[37,21,38,21],[33,20,33,21],[35,29,36,29],[35,30,36,30],[35,31,36,31],[37,3,38,3],[37,5,38,5],[37,7,38,7],[37,9,38,9],[37,11,38,11],[37,13,38,13],[37,15,38,15],[35,21,36,21],[35,24,36,24],[35,25,36,25],[35,26,36,26],[35,27,36,27],[35,28,36,28],[37,27,38,27],[37,28,38,28],[37,29,38,29],[37,30,38,30],[37,31,38,31],[37,25,38,25],[37,26,38,26],[34,8,34,9],[34,10,34,11],[34,12,34,13],[34,14,34,15],[34,16,34,17],[34,18,34,19],[35,5,36,5],[35,7,36,7],[35,9,36,9],[35,11,36,11],[35,13,36,13],[35,15,36,15],[35,17,36,17],[35,19,36,19],[33,2,33,3],[33,4,33,5],[33,6,33,7],[33,12,33,13],[33,14,33,15],[33,18,33,19],[34,20,34,21],[31,20,31,21],[32,2,32,3],[32,4,32,5],[32,6,32,7],[32,12,32,13],[32,14,32,15],[32,18,32,19],[32,20,32,21],[31,2,31,3],[31,4,31,5],[31,6,31,7],[31,12,31,13],[31,14,31,15],[31,18,31,19],[34,2,34,3],[34,4,34,5],[34,6,34,7],[29,20,29,21],[30,2,30,3],[30,4,30,5],[30,6,30,7],[30,12,30,13],[30,14,30,15],[30,18,30,19],[30,20,30,21],[29,2,29,3],[29,4,29,5],[29,6,29,7],[29,12,29,13],[29,14,29,15],[29,18,29,19],[27,20,27,21],[28,2,28,3],[28,4,28,5],[28,6,28,7],[28,12,28,13],[28,14,28,15],[28,18,28,19],[28,20,28,21],[27,2,27,3],[27,4,27,5],[27,6,27,7],[27,12,27,13],[27,14,27,15],[27,18,27,19],[25,20,25,21],[26,2,26,3],[26,4,26,5],[26,6,26,7],[26,12,26,13],[26,14,26,15],[26,18,26,19],[26,20,26,21],[25,2,25,3],[25,4,25,5],[25,6,25,7],[25,12,25,13],[25,14,25,15],[25,18,25,19],[23,20,23,21],[24,2,24,3],[24,4,24,5],[24,6,24,7],[24,12,24,13],[24,14,24,15],[24,18,24,19],[24,20,24,21],[23,2,23,3],[23,4,23,5],[23,6,23,7],[23,12,23,13],[23,14,23,15],[23,18,23,19],[21,20,21,21],[22,2,22,3],[22,4,22,5],[22,6,22,7],[22,12,22,13],[22,14,22,15],[22,18,22,19],[22,20,22,21],[21,2,21,3],[21,4,21,5],[21,6,21,7],[21,12,21,13],[21,14,21,15],[21,18,21,19],[19,20,19,21],[20,2,20,3],[20,4,20,5],[20,6,20,7],[20,12,20,13],[20,14,20,15],[20,18,20,19],[20,20,20,21],[19,2,19,3],[19,4,19,5],[19,6,19,7],[19,12,19,13],[19,14,19,15],[19,18,19,19],[17,20,17,21],[18,2,18,3],[18,4,18,5],[18,6,18,7],[18,12,18,13],[18,14,18,15],[18,18,18,19],[18,20,18,21],[17,2,17,3],[17,4,17,5],[17,6,17,7],[17,12,17,13],[17,14,17,15],[17,18,17,19],[15,20,15,21],[16,2,16,3],[16,4,16,5],[16,6,16,7],[16,12,16,13],[16,14,16,15],[16,18,16,19],[16,20,16,21],[15,2,15,3],[15,4,15,5],[15,6,15,7],[15,12,15,13],[15,14,15,15],[15,18,15,19],[13,20,13,21],[14,2,14,3],[14,4,14,5],[14,6,14,7],[14,12,14,13],[14,14,14,15],[14,18,14,19],[14,20,14,21],[13,2,13,3],[13,4,13,5],[13,6,13,7],[13,12,13,13],[13,14,13,15],[13,18,13,19],[11,20,11,21],[12,2,12,3],[12,4,12,5],[12,6,12,7],[12,12,12,13],[12,14,12,15],[12,18,12,19],[12,20,12,21],[11,2,11,3],[11,4,11,5],[11,6,11,7],[11,12,11,13],[11,14,11,15],[11,18,11,19],[9,20,9,21],[10,2,10,3],[10,4,10,5],[10,6,10,7],[10,12,10,13],[10,14,10,15],[10,18,10,19],[10,20,10,21],[9,2,9,3],[9,4,9,5],[9,6,9,7],[9,12,9,13],[9,14,9,15],[9,18,9,19],[7,20,7,21],[8,2,8,3],[8,4,8,5],[8,6,8,7],[8,12,8,13],[8,14,8,15],[8,18,8,19],[8,20,8,21],[7,2,7,3],[7,4,7,5],[7,6,7,7],[7,12,7,13],[7,14,7,15],[7,18,7,19],[5,20,5,21],[6,2,6,3],[6,4,6,5],[6,6,6,7],[6,12,6,13],[6,14,6,15],[6,18,6,19],[6,20,6,21],[5,2,5,3],[5,4,5,5],[5,6,5,7],[5,12,5,13],[5,14,5,15],[5,18,5,19],[3,16,4,17],[3,18,4,19],[3,20,4,21],[4,6,4,7],[4,8,4,9],[4,10,4,11],[1,3,1,4],[1,14,1,15],[3,2,4,3],[3,4,4,5],[3,6,3,11],[3,12,4,13],[3,14,4,15]]}
[null,"Classe"]
[null,{"$f":"EQUIPES!B2","v":"1TU"},null,{"$f":"EQUIPES!F3","v":"ORANGE"},null,"score",null,"-",null,null,null,null,null,"score","VERT"]
[null,null,{"$f":"HLOOKUP(C4,$Y$36:$AF$44,9,FALSE)","v":1},{"$f":"HLOOKUP(D4,$Y$36:$AF$44,9,FALSE)","v":{"$error":"#N/A"}},{"$f":"HLOOKUP(E4,$Y$36:$AF$44,9,FALSE)","v":2},{"$f":"(HLOOKUP(F4,DEBUT!#REF!,9,FALSE))","v":{"$error":"#REF!"}},{"$f":"(HLOOKUP(G4,$Y$36:$AF$44,9,FALSE))","v":3},{"$f":"HLOOKUP(H4,$Y$36:$AF$44,9,FALSE)","v":{"$error":"#N/A"}},{"$f":"(HLOOKUP(I4,DEBUT!#REF!,9,FALSE))","v":{"$error":"#REF!"}},{"$f":"(HLOOKUP(J4,DEBUT!#REF!,9,FALSE))","v":{"$error":"#REF!"}},{"$f":"(HLOOKUP(K4,DEBUT!#REF!,9,FALSE))","v":{"$error":"#REF!"}},{"$f":"(HLOOKUP(L4,DEBUT!#REF!,9,FALSE))","v":{"$error":"#REF!"}},{"$f":"(HLOOKUP(M4,$Y$36:$AF$44,9,FALSE))","v":5},{"$f":"HLOOKUP(N4,$Y$36:$AF$44,9,FALSE)","v":{"$error":"#N/A"}},{"$f":"(HLOOKUP(O4,$Y$36:$AF$44,9,FALSE))","v":6},{"$f":"HLOOKUP(P4,$Y$36:$AF$44,9,FALSE)","v":{"$error":"#N/A"}},{"$f":"(HLOOKUP(Q4,DEBUT!#REF!,9,FALSE))","v":{"$error":"#REF!"}},{"$f":"(HLOOKUP(R4,DEBUT!#REF!,9,FALSE))","v":{"$error":"#REF!"}},{"$f":"(HLOOKUP(S4,$Y$36:$AF$44,9,FALSE))","v":7},{"$f":"HLOOKUP(T4,$Y$36:$AF$44,9,FALSE)","v":{"$error":"#N/A"}},{"$f":"(HLOOKUP(U4,$Y$36:$AF$44,9,FALSE))","v":8},{"$f":"HLOOKUP(V4,$Y$36:$AF$44,9,FALSE)","v":{"$error":"#N/A"}}]
[null,null,{"$f":"'OBS1'!C4","v":"FAUTE"},null,{"$f":"'OBS1'!E4","v":"BALLON PERDU"},null,{"$f":"'OBS1'!G4","v":"POSSESSION"},null,null,null,null,null,{"$f":"'OBS1'!M4","v":"TIRS"},null,{"$f":"'OBS1'!O4","v":"BONS TIRS"},null,"PANIERS",null,{"$f":"'OBS1'!S4","v":"PANIERS"},null,{"$f":"'OBS1'!U4","v":"% REUSSITE"}]
[null,null,null,null,null,null,0]
[null,1]
[null,2]
[null,3]
[null,4]
[null,5]
[null,6]
[null,7]
[null,8]
[null,9]
[null,10]
[null,11]
[null,12]
[null,13]
[null,14]
[null,15]
[null,16]
[null,17]
[null,18]
[null,19]
[null,20]
[null,21]
[null,22]
[null,23]
[null,24]
[null,25]
[null,26]
[null,27]
[null,28]
[null,29]
[null,30]
[null,{"$f":"D2","v":"ORANGE"},{"$f":"(SUMPRODUCT(N(ISTEXT(C6:C35))))","v":0},{"$f":"IF(AND($C$3=1,C36<$Y$46),$Y$48,IF(AND($C$3=1,C36>=$Y$46),$Y$50,IF(AND($C$3=2,C36<$Z$46),$Z$48,IF(AND($C$3=2,C36>=$Z$46),$Z$50,IF(AND($C$3=3,C36<$AA$46),$AA$48,IF(AND($C$3=3,C36>=$AA$46),$AA$50,IF(AND($C$3=4,C36<$AB$46),$AB$48,IF(AND($C$3=4,C36>=$AB$46),$AB$50,IF(AND($C$3=5,C36<$AC$46),$AC$48,IF(AND($C$3=5,C36>=$AC$46),$AC$50,IF(AND($C$3=6,C36<$AD$46),$AD$48,IF(AND($C$3=6,C36>=$AD$46),$AD$50,IF(AND($C$3=7,C36<$AE$46),$AE$48,IF(AND($C$3=7,C36>=$AE$46),$AE$50,IF(AND($C$3=8,C36<$AF$46),$AF$48,IF(AND($C$3=8,C36>=$AF$46),$AF$50))))))))))))))))","v":"Vous êtes bien organisé"},{"$f":"(SUMPRODUCT(N(ISTEXT(E6:E35))))","v":0},{"$f":"IF(AND($E$3=1,C36<$Y$46),$Y$48,IF(AND($E$3=1,C36>=$Y$46),$Y$50,IF(AND($E$3=2,C36<$Z$46),$Z$48,IF(AND($E$3=2,C36>=$Z$46),$Z$50,IF(AND($E$3=3,C36<$AA$46),$AA$48,IF(AND($E$3=3,C36>=$AA$46),$AA$50,IF(AND($E$3=4,C36<$AB$46),$AB$48,IF(AND($E$3=4,C36>=$AB$46),$AB$50,IF(AND($E$3=5,C36<$AC$46),$AC$48,IF(AND($E$3=5,C36>=$AC$46),$AC$50,IF(AND($E$3=6,C36<$AD$46),$AD$48,IF(AND($E$3=6,C36>=$AD$46),$AD$50,IF(AND($E$3=7,C36<$AE$46),$AE$48,IF(AND($E$3=7,C36>=$AE$46),$AE$50,IF(AND($E$3=8,C36<$AF$46),$AF$48,IF(AND($E$3=8,C36>=$AF$46),$AF$50))))))))))))))))","v":"C'est bien vous faites des passes"},{"$f":"(SUMPRODUCT(N(ISTEXT(G6:G35))))","v":0},{"$f":"IF(AND($G$3=1,C36<$Y$46),$Y$48,IF(AND($G$3=1,C36>=$Y$46),$Y$50,IF(AND($G$3=2,C36<$Z$46),$Z$48,IF(AND($G$3=2,C36>=$Z$46),$Z$50,IF(AND($G$3=3,C36<$AA$46),$AA$48,IF(AND($G$3=3,C36>=$AA$46),$AA$50,IF(AND($G$3=4,C36<$AB$46),$AB$48,IF(AND($G$3=4,C36>=$AB$46),$AB$50,IF(AND($G$3=5,C36<$AC$46),$AC$48,IF(AND($G$3=5,C36>=$AC$46),$AC$50,IF(AND($G$3=6,C36<$AD$46),$AD$48,IF(AND($G$3=6,C36>=$AD$46),$AD$50,IF(AND($G$3=7,C36<$AE$46),$AE$48,IF(AND($G$3=7,C36>=$AE$46),$AE$50,IF(AND($G$3=8,C36<$AF$46),$AF$48,IF(AND($G$3=8,C36>=$AF$46),$AF$50))))))))))))))))","v":"Vous êtes où?"},{"$f":"(SUMPRODUCT(N(ISTEXT(I6:I35))))","v":0},{"$f":"IF(AND($I$3=1,C36<$Y$46),$Y$48,IF(AND($I$3=1,C36>=$Y$46),$Y$50,IF(AND($I$3=2,C36<$Z$46),$Z$48,IF(AND($I$3=2,C36>=$Z$46),$Z$50,IF(AND($I$3=3,C36<$AA$46),$AA$48,IF(AND($I$3=3,C36>=$AA$46),$AA$50,IF(AND($I$3=4,C36<$AB$46),$AB$48,IF(AND($I$3=4,C36>=$AB$46),$AB$50,IF(AND($I$3=5,C36<$AC$46),$AC$48,IF(AND($I$3=5,C36>=$AC$46),$AC$50,IF(AND($I$3=6,C36<$AD$46),$AD$48,IF(AND($I$3=6,C36>=$AD$46),$AD$50,IF(AND($I$3=7,C36<$AE$46),$AE$48,IF(AND($I$3=7,C36>=$AE$46),$AE$50,IF(AND($I$3=8,C36<$AF$46),$AF$48,IF(AND($I$3=8,C36>=$AF$46),$AF$50))))))))))))))))","v":{"$error":"#REF!"}},{"$f":"(SUMPRODUCT(N(ISTEXT(K6:K35))))","v":0},{"$f":"IF(AND($K$3=1,C36<$Y$46),$Y$48,IF(AND($K$3=1,C36>=$Y$46),$Y$50,IF(AND($K$3=2,C36<$Z$46),$Z$48,IF(AND($K$3=2,C36>=$Z$46),$Z$50,IF(AND($K$3=3,C36<$AA$46),$AA$48,IF(AND($K$3=3,C36>=$AA$46),$AA$50,IF(AND($K$3=4,C36<$AB$46),$AB$48,IF(AND($K$3=4,C36>=$AB$46),$AB$50,IF(AND($K$3=5,C36<$AC$46),$AC$48,IF(AND($K$3=5,C36>=$AC$46),$AC$50,IF(AND($K$3=6,C36<$AD$46),$AD$48,IF(AND($K$3=6,C36>=$AD$46),$AD$50,IF(AND($K$3=7,C36<$AE$46),$AE$48,IF(AND($K$3=7,C36>=$AE$46),$AE$50,IF(AND($K$3=8,C36<$AF$46),$AF$48,IF(AND($K$3=8,C36>=$AF$46),$AF$50))))))))))))))))","v":{"$error":"#REF!"}},{"$f":"(SUMPRODUCT(N(ISTEXT(M6:M35))))","v":0},{"$f":"IF(AND($M$3=1,C36<$Y$46),$Y$48,IF(AND($M$3=1,C36>=$Y$46),$Y$50,IF(AND($M$3=2,C36<$Z$46),$Z$48,IF(AND($M$3=2,C36>=$Z$46),$Z$50,IF(AND($M$3=3,C36<$AA$46),$AA$48,IF(AND($M$3=3,C36>=$AA$46),$AA$50,IF(AND($M$3=4,C36<$AB$46),$AB$48,IF(AND($M$3=4,C36>=$AB$46),$AB$50,IF(AND($M$3=5,C36<$AC$46),$AC$48,IF(AND($M$3=5,C36>=$AC$46),$AC$50,IF(AND($M$3=6,C36<$AD$46),$AD$48,IF(AND($M$3=6,C36>=$AD$46),$AD$50,IF(AND($M$3=7,C36<$AE$46),$AE$48,IF(AND($M$3=7,C36>=$AE$46),$AE$50,IF(AND($M$3=8,C36<$AF$46),$AF$48,IF(AND($M$3=8,C36>=$AF$46),$AF$50))))))))))))))))","v":"Faut oser tirer"},{"$f":"(SUMPRODUCT(N(ISTEXT(O6:O35))))","v":0},{"$f":"IF(AND($O$3=1,C36<$Y$46),$Y$48,IF(AND($O$3=1,C36>=$Y$46),$Y$50,IF(AND($O$3=2,C36<$Z$46),$Z$48,IF(AND($O$3=2,C36>=$Z$46),$Z$50,IF(AND($O$3=3,C36<$AA$46),$AA$48,IF(AND($O$3=3,C36>=$AA$46),$AA$50,IF(AND($O$3=4,C36<$AB$46),$AB$48,IF(AND($O$3=4,C36>=$AB$46),$AB$50,IF(AND($O$3=5,C36<$AC$46),$AC$48,IF(AND($O$3=5,C36>=$AC$46),$AC$50,IF(AND($O$3=6,C36<$AD$46),$AD$48,IF(AND($O$3=6,C36>=$AD$46),$AD$50,IF(AND($O$3=7,C36<$AE$46),$AE$48,IF(AND($O$3=7,C36>=$AE$46),$AE$50,IF(AND($O$3=8,C36<$AF$46),$AF$48,IF(AND($O$3=8,C36>=$AF$46),$AF$50))))))))))))))))","v":"Pourquoi vos tirs ne rentrent pas ? "},{"$f":"(SUMPRODUCT(N(ISTEXT(Q6:Q35))))","v":0},{"$f":"IF(AND($Q$3=1,C36<$Y$46),$Y$48,IF(AND($Q$3=1,C36>=$Y$46),$Y$50,IF(AND($Q$3=2,C36<$Z$46),$Z$48,IF(AND($Q$3=2,C36>=$Z$46),$Z$50,IF(AND($Q$3=3,C36<$AA$46),$AA$48,IF(AND($Q$3=3,C36>=$AA$46),$AA$50,IF(AND($Q$3=4,C36<$AB$46),$AB$48,IF(AND($Q$3=4,C36>=$AB$46),$AB$50,IF(AND($Q$3=5,C36<$AC$46),$AC$48,IF(AND($Q$3=5,C36>=$AC$46),$AC$50,IF(AND($Q$3=6,C36<$AD$46),$AD$48,IF(AND($Q$3=6,C36>=$AD$46),$AD$50,IF(AND($Q$3=7,C36<$AE$46),$AE$48,IF(AND($Q$3=7,C36>=$AE$46),$AE$50,IF(AND($Q$3=8,C36<$AF$46),$AF$48,IF(AND($Q$3=8,C36>=$AF$46),$AF$50))))))))))))))))","v":{"$error":"#REF!"}},{"$f":"(SUMPRODUCT(N(ISTEXT(S6:S35))))","v":0},{"$f":"IF(AND($S$3=1,C36<$Y$46),$Y$48,IF(AND($S$3=1,C36>=$Y$46),$Y$50,IF(AND($S$3=2,C36<$Z$46),$Z$48,IF(AND($S$3=2,C36>=$Z$46),$Z$50,IF(AND($S$3=3,C36<$AA$46),$AA$48,IF(AND($S$3=3,C36>=$AA$46),$AA$50,IF(AND($S$3=4,C36<$AB$46),$AB$48,IF(AND($S$3=4,C36>=$AB$46),$AB$50,IF(AND($S$3=5,C36<$AC$46),$AC$48,IF(AND($S$3=5,C36>=$AC$46),$AC$50,IF(AND($S$3=6,C36<$AD$46),$AD$48,IF(AND($S$3=6,C36>=$AD$46),$AD$50,IF(AND($S$3=7,C36<$AE$46),$AE$48,IF(AND($S$3=7,C36>=$AE$46),$AE$50,IF(AND($S$3=8,C36<$AF$46),$AF$48,IF(AND($S$3=8,C36>=$AF$46),$AF$50))))))))))))))))","v":"SI vous tirez il faudra être plus précis"},{"$f":"S36/SUM(M36+O36+S36)*100","v":{"$error":"#DIV/0!"}},{"$f":"IF(AND($U$3=1,C36<$Y$46),$Y$48,IF(AND($U$3=1,C36>=$Y$46),$Y$50,IF(AND($U$3=2,C36<$Z$46),$Z$48,IF(AND($U$3=2,C36>=$Z$46),$Z$50,IF(AND($U$3=3,C36<$AA$46),$AA$48,IF(AND($U$3=3,C36>=$AA$46),$AA$50,IF(AND($U$3=4,C36<$AB$46),$AB$48,IF(AND($U$3=4,C36>=$AB$46),$AB$50,IF(AND($U$3=5,C36<$AC$46),$AC$48,IF(AND($U$3=5,C36>=$AC$46),$AC$50,IF(AND($U$3=6,C36<$AD$46),$AD$48,IF(AND($U$3=6,C36>=$AD$46),$AD$50,IF(AND($U$3=7,C36<$AE$46),$AE$48,IF(AND($U$3=7,C36>=$AE$46),$AE$50,IF(AND($U$3=8,C36<$AF$46),$AF$48,IF(AND($U$3=8,C36>=$AF$46),$AF$50))))))))))))))))","v":"Pas de chance"},{"$f":"B36","v":"ORANGE"},null,{"$f":"DEBUT!Y36","v":"FAUTE"},{"$f":"DEBUT!Z36","v":"BALLON PERDU"},{"$f":"DEBUT!AA36","v":"POSSESSION"},{"$f":"DEBUT!AB36","v":"RECUPERATION B"},{"$f":"DEBUT!AC36","v":"TIRS"},{"$f":"DEBUT!AD36","v":"BONS TIRS"},{"$f":"DEBUT!AE36","v":"PANIERS"},{"$f":"DEBUT!AF36","v":"% REUSSITE"}]
[null,"Contrats ->",null,null,null,null,null,null,null,null,null,null,null,null,null,null,null,null,null,null,null,null,"<-Contrats "]
[null,{"$f":"EQUIPES!B4","v":"Alexis F."},{"$f":"COUNTIF($C$6:$C$35,B38)","v":0},{"$f":"IF(AND($C$3=1,C38<$Y$38),$Y$40,IF(AND($C$3=1,C38>=$Y$38),$Y$42,IF(AND($C$3=2,C38<$Z$38),$Z$40,IF(AND($C$3=2,C38>=$Z$38),$Z$42,IF(AND($C$3=3,C38<$AA$38),$AA$40,IF(AND($C$3=3,C38>=$AA$38),$AA$42,IF(AND($C$3=4,C38<$AB$38),$AB$40,IF(AND($C$3=4,C38>=$AB$38),$AB$42,IF(AND($C$3=5,C38<$AC$38),$AC$40,IF(AND($C$3=5,C38>=$AC$38),$AC$42,IF(AND($C$3=6,C38<$AD$38),$AD$40,IF(AND($C$3=6,C38>=$AD$38),$AD$42,IF(AND($C$3=7,C38<$AE$38),$AE$40,IF(AND($C$3=7,C38>=$AE$38),$AE$42,IF(AND($C$3=8,C38<$AF$38),$AF$40,IF(AND($C$3=8,C38>=$AF$38),$AF$42))))))))))))))))","v":"C'est bien tu gères la distance"},{"$f":"COUNTIF($E$6:$E$35,B38)","v":0},{"$f":"IF(AND($E$3=1,E38<$Y$38),$Y$40,IF(AND($E$3=1,E38>=$Y$38),$Y$42,IF(AND($E$3=2,E38<$Z$38),$Z$40,IF(AND($E$3=2,E38>=$Z$38),$Z$42,IF(AND($E$3=3,E38<$AA$38),$AA$40,IF(AND($E$3=3,E38>=$AA$38),$AA$42,IF(AND($E$3=4,E38<$AB$38),$AB$40,IF(AND($E$3=4,E38>=$AB$38),$AB$42,IF(AND($E$3=5,E38<$AC$38),$AC$40,IF(AND($E$3=5,E38>=$AC$38),$AC$42,IF(AND($E$3=6,E38<$AD$38),$AD$40,IF(AND($E$3=6,E38>=$AD$38),$AD$42,IF(AND($E$3=7,E38<$AE$38),$AE$40,IF(AND($E$3=7,E38>=$AE$38),$AE$42,IF(AND($E$3=8,E38<$AF$38),$AF$40,IF(AND($E$3=8,E38>=$AF$38),$AF$42))))))))))))))))","v":"Bien tu lèves la tête"},{"$f":"COUNTIF($G$6:$G$35,B38)","v":0},{"$f":"IF(AND($G$3=1,G38<$Y$38),$Y$40,IF(AND($G$3=1,G38>=$Y$38),$Y$42,IF(AND($G$3=2,G38<$Z$38),$Z$40,IF(AND($G$3=2,G38>=$Z$38),$Z$42,IF(AND($G$3=3,G38<$AA$38),$AA$40,IF(AND($G$3=3,G38>=$AA$38),$AA$42,IF(AND($G$3=4,G38<$AB$38),$AB$40,IF(AND($G$3=4,G38>=$AB$38),$AB$42,IF(AND($G$3=5,G38<$AC$38),$AC$40,IF(AND($G$3=5,G38>=$AC$38),$AC$42,IF(AND($G$3=6,G38<$AD$38),$AD$40,IF(AND($G$3=6,G38>=$AD$38),$AD$42,IF(AND($G$3=7,G38<$AE$38),$AE$40,IF(AND($G$3=7,G38>=$AE$38),$AE$42,IF(AND($G$3=8,G38<$AF$38),$AF$40,IF(AND($G$3=8,G38>=$AF$38),$AF$42))))))))))))))))","v":"Tu touches le ballon"},{"$f":"COUNTIF($I$6:$I$35,B38)","v":0},{"$f":"IF(AND($I$3=1,I38<$Y$38),$Y$40,IF(AND($I$3=1,I38>=$Y$38),$Y$42,IF(AND($I$3=2,I38<$Z$38),$Z$40,IF(AND($I$3=2,I38>=$Z$38),$Z$42,IF(AND($I$3=3,I38<$AA$38),$AA$40,IF(AND($I$3=3,I38>=$AA$38),$AA$42,IF(AND($I$3=4,I38<$AB$38),$AB$40,IF(AND($I$3=4,I38>=$AB$38),$AB$42,IF(AND($I$3=5,I38<$AC$38),$AC$40,IF(AND($I$3=5,I38>=$AC$38),$AC$42,IF(AND($I$3=6,I38<$AD$38),$AD$40,IF(AND($I$3=6,I38>=$AD$38),$AD$42,IF(AND($I$3=7,I38<$AE$38),$AE$40,IF(AND($I$3=7,I38>=$AE$38),$AE$42,IF(AND($I$3=8,I38<$AF$38),$AF$40,IF(AND($I$3=8,I38>=$AF$38),$AF$42))))))))))))))))","v":{"$error":"#REF!"}},{"$f":"COUNTIF($K$6:$K$35,B38)","v":0},{"$f":"IF(AND($K$3=1,K38<$Y$38),$Y$40,IF(AND($K$3=1,K38>=$Y$38),$Y$42,IF(AND($K$3=2,K38<$Z$38),$Z$40,IF(AND($K$3=2,K38>=$Z$38),$Z$42,IF(AND($K$3=3,K38<$AA$38),$AA$40,IF(AND($K$3=3,K38>=$AA$38),$AA$42,IF(AND($K$3=4,K38<$AB$38),$AB$40,IF(AND($K$3=4,K38>=$AB$38),$AB$42,IF(AND($K$3=5,K38<$AC$38),$AC$40,IF(AND($K$3=5,K38>=$AC$38),$AC$42,IF(AND($K$3=6,K38<$AD$38),$AD$40,IF(AND($K$3=6,K38>=$AD$38),$AD$42,IF(AND($K$3=7,K38<$AE$38),$AE$40,IF(AND($K$3=7,K38>=$AE$38),$AE$42,IF(AND($K$3=8,K38<$AF$38),$AF$40,IF(AND($K$3=8,K38>=$AF$38),$AF$42))))))))))))))))","v":{"$error":"#REF!"}},{"$f":"COUNTIF($M$6:$M$35,B38)","v":0},{"$f":"IF(AND($M$3=1,M38<$Y$38),$Y$40,IF(AND($M$3=1,M38>=$Y$38),$Y$42,IF(AND($M$3=2,M38<$Z$38),$Z$40,IF(AND($M$3=2,M38>=$Z$38),$Z$42,IF(AND($M$3=3,M38<$AA$38),$AA$40,IF(AND($M$3=3,M38>=$AA$38),$AA$42,IF(AND($M$3=4,M38<$AB$38),$AB$40,IF(AND($M$3=4,M38>=$AB$38),$AB$42,IF(AND($M$3=5,M38<$AC$38),$AC$40,IF(AND($M$3=5,M38>=$AC$38),$AC$42,IF(AND($M$3=6,M38<$AD$38),$AD$40,IF(AND($M$3=6,M38>=$AD$38),$AD$42,IF(AND($M$3=7,M38<$AE$38),$AE$40,IF(AND($M$3=7,M38>=$AE$38),$AE$42,IF(AND($M$3=8,M38<$AF$38),$AF$40,IF(AND($M$3=8,M38>=$AF$38),$AF$42))))))))))))))))","v":"Faut oser tirer"},{"$f":"COUNTIF($O$6:$O$35,B38)","v":0},{"$f":"IF(AND($O$3=1,O38<$Y$38),$Y$40,IF(AND($O$3=1,O38>=$Y$38),$Y$42,IF(AND($O$3=2,O38<$Z$38),$Z$40,IF(AND($O$3=2,O38>=$Z$38),$Z$42,IF(AND($O$3=3,O38<$AA$38),$AA$40,IF(AND($O$3=3,O38>=$AA$38),$AA$42,IF(AND($O$3=4,O38<$AB$38),$AB$40,IF(AND($O$3=4,O38>=$AB$38),$AB$42,IF(AND($O$3=5,O38<$AC$38),$AC$40,IF(AND($O$3=5,O38>=$AC$38),$AC$42,IF(AND($O$3=6,O38<$AD$38),$AD$40,IF(AND($O$3=6,O38>=$AD$38),$AD$42,IF(AND($O$3=7,O38<$AE$38),$AE$40,IF(AND($O$3=7,O38>=$AE$38),$AE$42,IF(AND($O$3=8,O38<$AF$38),$AF$40,IF(AND($O$3=8,O38>=$AF$38),$AF$42))))))))))))))))","v":"Pourquoi tes tirs ne rentrent pas ?"},{"$f":"COUNTIF($Q$6:$Q$35,B38)","v":0},{"$f":"IF(AND($Q$3=1,Q38<$Y$38),$Y$40,IF(AND($Q$3=1,Q38>=$Y$38),$Y$42,IF(AND($Q$3=2,Q38<$Z$38),$Z$40,IF(AND($Q$3=2,Q38>=$Z$38),$Z$42,IF(AND($Q$3=3,Q38<$AA$38),$AA$40,IF(AND($Q$3=3,Q38>=$AA$38),$AA$42,IF(AND($Q$3=4,Q38<$AB$38),$AB$40,IF(AND($Q$3=4,Q38>=$AB$38),$AB$42,IF(AND($Q$3=5,Q38<$AC$38),$AC$40,IF(AND($Q$3=5,Q38>=$AC$38),$AC$42,IF(AND($Q$3=6,Q38<$AD$38),$AD$40,IF(AND($Q$3=6,Q38>=$AD$38),$AD$42,IF(AND($Q$3=7,Q38<$AE$38),$AE$40,IF(AND($Q$3=7,Q38>=$AE$38),$AE$42,IF(AND($Q$3=8,Q38<$AF$38),$AF$40,IF(AND($Q$3=8,Q38>=$AF$38),$AF$42))))))))))))))))","v":{"$error":"#REF!"}},{"$f":"COUNTIF($S$6:$S$35,B38)","v":0},{"$f":"IF(AND($S$3=1,S38<$Y$38),$Y$40,IF(AND($S$3=1,S38>=$Y$38),$Y$42,IF(AND($S$3=2,S38<$Z$38),$Z$40,IF(AND($S$3=2,S38>=$Z$38),$Z$42,IF(AND($S$3=3,S38<$AA$38),$AA$40,IF(AND($S$3=3,S38>=$AA$38),$AA$42,IF(AND($S$3=4,S38<$AB$38),$AB$40,IF(AND($S$3=4,S38>=$AB$38),$AB$42,IF(AND($S$3=5,S38<$AC$38),$AC$40,IF(AND($S$3=5,S38>=$AC$38),$AC$42,IF(AND($S$3=6,S38<$AD$38),$AD$40,IF(AND($S$3=6,S38>=$AD$38),$AD$42,IF(AND($S$3=7,S38<$AE$38),$AE$40,IF(AND($S$3=7,S38>=$AE$38),$AE$42,IF(AND($S$3=8,S38<$AF$38),$AF$40,IF(AND($S$3=8,S38>=$AF$38),$AF$42))))))))))))))))","v":"SI tu tires il faudra être plus précis"},{"$f":"S38/SUM(M38+O38+S38)*100","v":{"$error":"#DIV/0!"}},{"$f":"IF(AND($U$3=1,U38<$Y$38),$Y$40,IF(AND($U$3=1,U38>=$Y$38),$Y$42,IF(AND($U$3=2,U38<$Z$38),$Z$40,IF(AND($U$3=2,U38>=$Z$38),$Z$42,IF(AND($U$3=3,U38<$AA$38),$AA$40,IF(AND($U$3=3,U38>=$AA$38),$AA$42,IF(AND($U$3=4,U38<$AB$38),$AB$40,IF(AND($U$3=4,U38>=$AB$38),$AB$42,IF(AND($U$3=5,U38<$AC$38),$AC$40,IF(AND($U$3=5,U38>=$AC$38),$AC$42,IF(AND($U$3=6,U38<$AD$38),$AD$40,IF(AND($U$3=6,U38>=$AD$38),$AD$42,IF(AND($U$3=7,U38<$AE$38),$AE$40,IF(AND($U$3=7,U38>=$AE$38),$AE$42,IF(AND($U$3=8,U38<$AF$38),$AF$40,IF(AND($U$3=8,U38>=$AF$38),$AF$42))))))))))))))))","v":{"$error":"#DIV/0!"}},{"$f":"B38","v":"Alexis F."},null,{"$f":"DEBUT!Y38","v":2},{"$f":"DEBUT!Z38","v":2},{"$f":"DEBUT!AA38","v":2},{"$f":"DEBUT!AB38","v":2},{"$f":"DEBUT!AC38","v":2},{"$f":"DEBUT!AD38","v":2},{"$f":"DEBUT!AE38","v":2},{"$f":"DEBUT!AF38","v":0.2}]
[null,"Contrats ->",null,null,null,null,null,null,null,null,null,null,null,null,null,null,null,null,null,null,null,null,"<-Contrats ","Contrats ind"]
[null,{"$f":"EQUIPES!B5","v":0},{"$f":"COUNTIF($C$6:$C$35,B40)","v":0},{"$f":"IF(AND($C$3=1,C40<$Y$38),$Y$40,IF(AND($C$3=1,C40>=$Y$38),$Y$42,IF(AND($C$3=2,C40<$Z$38),$Z$40,IF(AND($C$3=2,C40>=$Z$38),$Z$42,IF(AND($C$3=3,C40<$AA$38),$AA$40,IF(AND($C$3=3,C40>=$AA$38),$AA$42,IF(AND($C$3=4,C40<$AB$38),$AB$40,IF(AND($C$3=4,C40>=$AB$38),$AB$42,IF(AND($C$3=5,C40<$AC$38),$AC$40,IF(AND($C$3=5,C40>=$AC$38),$AC$42,IF(AND($C$3=6,C40<$AD$38),$AD$40,IF(AND($C$3=6,C40>=$AD$38),$AD$42,IF(AND($C$3=7,C40<$AE$38),$AE$40,IF(AND($C$3=7,C40>=$AE$38),$AE$42,IF(AND($C$3=8,C40<$AF$38),$AF$40,IF(AND($C$3=8,C40>=$AF$38),$AF$42))))))))))))))))","v":"C'est bien tu gères la distance"},{"$f":"COUNTIF($E$6:$E$35,B40)","v":0},{"$f":"IF(AND($E$3=1,E40<$Y$38),$Y$40,IF(AND($E$3=1,E40>=$Y$38),$Y$42,IF(AND($E$3=2,E40<$Z$38),$Z$40,IF(AND($E$3=2,E40>=$Z$38),$Z$42,IF(AND($E$3=3,E40<$AA$38),$AA$40,IF(AND($E$3=3,E40>=$AA$38),$AA$42,IF(AND($E$3=4,E40<$AB$38),$AB$40,IF(AND($E$3=4,E40>=$AB$38),$AB$42,IF(AND($E$3=5,E40<$AC$38),$AC$40,IF(AND($E$3=5,E40>=$AC$38),$AC$42,IF(AND($E$3=6,E40<$AD$38),$AD$40,IF(AND($E$3=6,E40>=$AD$38),$AD$42,IF(AND($E$3=7,E40<$AE$38),$AE$40,IF(AND($E$3=7,E40>=$AE$38),$AE$42,IF(AND($E$3=8,E40<$AF$38),$AF$40,IF(AND($E$3=8,E40>=$AF$38),$AF$42))))))))))))))))","v":"Bien tu lèves la tête"},{"$f":"COUNTIF($G$6:$G$35,B40)","v":0},{"$f":"IF(AND($G$3=1,G40<$Y$38),$Y$40,IF(AND($G$3=1,G40>=$Y$38),$Y$42,IF(AND($G$3=2,G40<$Z$38),$Z$40,IF(AND($G$3=2,G40>=$Z$38),$Z$42,IF(AND($G$3=3,G40<$AA$38),$AA$40,IF(AND($G$3=3,G40>=$AA$38),$AA$42,IF(AND($G$3=4,G40<$AB$38),$AB$40,IF(AND($G$3=4,G40>=$AB$38),$AB$42,IF(AND($G$3=5,G40<$AC$38),$AC$40,IF(AND($G$3=5,G40>=$AC$38),$AC$42,IF(AND($G$3=6,G40<$AD$38),$AD$40,IF(AND($G$3=6,G40>=$AD$38),$AD$42,IF(AND($G$3=7,G40<$AE$38),$AE$40,IF(AND($G$3=7,G40>=$AE$38),$AE$42,IF(AND($G$3=8,G40<$AF$38),$AF$40,IF(AND($G$3=8,G40>=$AF$38),$AF$42))))))))))))))))","v":"Tu touches le ballon"},null,{"$f":"IF(AND($I$3=1,I40<$Y$38),$Y$40,IF(AND($I$3=1,I40>=$Y$38),$Y$42,IF(AND($I$3=2,I40<$Z$38),$Z$40,IF(AND($I$3=2,I40>=$Z$38),$Z$42,IF(AND($I$3=3,I40<$AA$38),$AA$40,IF(AND($I$3=3,I40>=$AA$38),$AA$42,IF(AND($I$3=4,I40<$AB$38),$AB$40,IF(AND($I$3=4,I40>=$AB$38),$AB$42,IF(AND($I$3=5,I40<$AC$38),$AC$40,IF(AND($I$3=5,I40>=$AC$38),$AC$42,IF(AND($I$3=6,I40<$AD$38),$AD$40,IF(AND($I$3=6,I40>=$AD$38),$AD$42,IF(AND($I$3=7,I40<$AE$38),$AE$40,IF(AND($I$3=7,I40>=$AE$38),$AE$42,IF(AND($I$3=8,I40<$AF$38),$AF$40,IF(AND($I$3=8,I40>=$AF$38),$AF$42))))))))))))))))","v":{"$error":"#REF!"}},{"$f":"COUNTIF($K$6:$K$35,B40)","v":0},{"$f":"IF(AND($K$3=1,K40<$Y$38),$Y$40,IF(AND($K$3=1,K40>=$Y$38),$Y$42,IF(AND($K$3=2,K40<$Z$38),$Z$40,IF(AND($K$3=2,K40>=$Z$38),$Z$42,IF(AND($K$3=3,K40<$AA$38),$AA$40,IF(AND($K$3=3,K40>=$AA$38),$AA$42,IF(AND($K$3=4,K40<$AB$38),$AB$40,IF(AND($K$3=4,K40>=$AB$38),$AB$42,IF(AND($K$3=5,K40<$AC$38),$AC$40,IF(AND($K$3=5,K40>=$AC$38),$AC$42,IF(AND($K$3=6,K40<$AD$38),$AD$40,IF(AND($K$3=6,K40>=$AD$38),$AD$42,IF(AND($K$3=7,K40<$AE$38),$AE$40,IF(AND($K$3=7,K40>=$AE$38),$AE$42,IF(AND($K$3=8,K40<$AF$38),$AF$40,IF(AND($K$3=8,K40>=$AF$38),$AF$42))))))))))))))))","v":{"$error":"#REF!"}},{"$f":"COUNTIF($M$6:$M$35,B40)","v":0},{"$f":"IF(AND($M$3=1,M40<$Y$38),$Y$40,IF(AND($M$3=1,M40>=$Y$38),$Y$42,IF(AND($M$3=2,M40<$Z$38),$Z$40,IF(AND($M$3=2,M40>=$Z$38),$Z$42,IF(AND($M$3=3,M40<$AA$38),$AA$40,IF(AND($M$3=3,M40>=$AA$38),$AA$42,IF(AND($M$3=4,M40<$AB$38),$AB$40,IF(AND($M$3=4,M40>=$AB$38),$AB$42,IF(AND($M$3=5,M40<$AC$38),$AC$40,IF(AND($M$3=5,M40>=$AC$38),$AC$42,IF(AND($M$3=6,M40<$AD$38),$AD$40,IF(AND($M$3=6,M40>=$AD$38),$AD$42,IF(AND($M$3=7,M40<$AE$38),$AE$40,IF(AND($M$3=7,M40>=$AE$38),$AE$42,IF(AND($M$3=8,M40<$AF$38),$AF$40,IF(AND($M$3=8,M40>=$AF$38),$AF$42))))))))))))))))","v":"Faut oser tirer"},{"$f":"COUNTIF($O$6:$O$35,B40)","v":0},{"$f":"IF(AND($O$3=1,O40<$Y$38),$Y$40,IF(AND($O$3=1,O40>=$Y$38),$Y$42,IF(AND($O$3=2,O40<$Z$38),$Z$40,IF(AND($O$3=2,O40>=$Z$38),$Z$42,IF(AND($O$3=3,O40<$AA$38),$AA$40,IF(AND($O$3=3,O40>=$AA$38),$AA$42,IF(AND($O$3=4,O40<$AB$38),$AB$40,IF(AND($O$3=4,O40>=$AB$38),$AB$42,IF(AND($O$3=5,O40<$AC$38),$AC$40,IF(AND($O$3=5,O40>=$AC$38),$AC$42,IF(AND($O$3=6,O40<$AD$38),$AD$40,IF(AND($O$3=6,O40>=$AD$38),$AD$42,IF(AND($O$3=7,O40<$AE$38),$AE$40,IF(AND($O$3=7,O40>=$AE$38),$AE$42,IF(AND($O$3=8,O40<$AF$38),$AF$40,IF(AND($O$3=8,O40>=$AF$38),$AF$42))))))))))))))))","v":"Pourquoi tes tirs ne rentrent pas ?"},{"$f":"COUNTIF($Q$6:$Q$35,B40)","v":0},{"$f":"IF(AND($Q$3=1,Q40<$Y$38),$Y$40,IF(AND($Q$3=1,Q40>=$Y$38),$Y$42,IF(AND($Q$3=2,Q40<$Z$38),$Z$40,IF(AND($Q$3=2,Q40>=$Z$38),$Z$42,IF(AND($Q$3=3,Q40<$AA$38),$AA$40,IF(AND($Q$3=3,Q40>=$AA$38),$AA$42,IF(AND($Q$3=4,Q40<$AB$38),$AB$40,IF(AND($Q$3=4,Q40>=$AB$38),$AB$42,IF(AND($Q$3=5,Q40<$AC$38),$AC$40,IF(AND($Q$3=5,Q40>=$AC$38),$AC$42,IF(AND($Q$3=6,Q40<$AD$38),$AD$40,IF(AND($Q$3=6,Q40>=$AD$38),$AD$42,IF(AND($Q$3=7,Q40<$AE$38),$AE$40,IF(AND($Q$3=7,Q40>=$AE$38),$AE$42,IF(AND($Q$3=8,Q40<$AF$38),$AF$40,IF(AND($Q$3=8,Q40>=$AF$38),$AF$42))))))))))))))))","v":{"$error":"#REF!"}},{"$f":"COUNTIF($S$6:$S$35,B40)","v":0},{"$f":"IF(AND($S$3=1,S40<$Y$38),$Y$40,IF(AND($S$3=1,S40>=$Y$38),$Y$42,IF(AND($S$3=2,S40<$Z$38),$Z$40,IF(AND($S$3=2,S40>=$Z$38),$Z$42,IF(AND($S$3=3,S40<$AA$38),$AA$40,IF(AND($S$3=3,S40>=$AA$38),$AA$42,IF(AND($S$3=4,S40<$AB$38),$AB$40,IF(AND($S$3=4,S40>=$AB$38),$AB$42,IF(AND($S$3=5,S40<$AC$38),$AC$40,IF(AND($S$3=5,S40>=$AC$38),$AC$42,IF(AND($S$3=6,S40<$AD$38),$AD$40,IF(AND($S$3=6,S40>=$AD$38),$AD$42,IF(AND($S$3=7,S40<$AE$38),$AE$40,IF(AND($S$3=7,S40>=$AE$38),$AE$42,IF(AND($S$3=8,S40<$AF$38),$AF$40,IF(AND($S$3=8,S40>=$AF$38),$AF$42))))))))))))))))","v":"SI tu tires il faudra être plus précis"},{"$f":"S40/SUM(M40+O40+S40)*100","v":{"$error":"#DIV/0!"}},{"$f":"IF(AND($U$3=1,U40<$Y$38),$Y$40,IF(AND($U$3=1,U40>=$Y$38),$Y$42,IF(AND($U$3=2,U40<$Z$38),$Z$40,IF(AND($U$3=2,U40>=$Z$38),$Z$42,IF(AND($U$3=3,U40<$AA$38),$AA$40,IF(AND($U$3=3,U40>=$AA$38),$AA$42,IF(AND($U$3=4,U40<$AB$38),$AB$40,IF(AND($U$3=4,U40>=$AB$38),$AB$42,IF(AND($U$3=5,U40<$AC$38),$AC$40,IF(AND($U$3=5,U40>=$AC$38),$AC$42,IF(AND($U$3=6,U40<$AD$38),$AD$40,IF(AND($U$3=6,U40>=$AD$38),$AD$42,IF(AND($U$3=7,U40<$AE$38),$AE$40,IF(AND($U$3=7,U40>=$AE$38),$AE$42,IF(AND($U$3=8,U40<$AF$38),$AF$40,IF(AND($U$3=8,U40>=$AF$38),$AF$42))))))))))))))))","v":{"$error":"#DIV/0!"}},{"$f":"B40","v":0},0,{"$f":"DEBUT!Y40","v":"C'est bien tu gères la distance"},{"$f":"DEBUT!Z40","v":"Bien tu lèves la tête"},{"$f":"DEBUT!AA40","v":"Tu touches le ballon"},{"$f":"DEBUT!AB40","v":"Faut se bouger davantage"},{"$f":"DEBUT!AC40","v":"Faut oser tirer"},{"$f":"DEBUT!AD40","v":"Pourquoi tes tirs ne rentrent pas ?"},{"$f":"DEBUT!AE40","v":"SI tu tires il faudra être plus précis"},{"$f":"DEBUT!AF40","v":"Pas de chance"}]
[null,"Contrats ->",null,null,null,null,null,null,null,null,null,null,null,null,null,null,null,null,null,null,null,null,"<-Contrats "]
[null,{"$f":"EQUIPES!B6","v":0},{"$f":"COUNTIF($C$6:$C$35,B42)","v":0},{"$f":"IF(AND($C$3=1,C42<$Y$38),$Y$40,IF(AND($C$3=1,C42>=$Y$38),$Y$42,IF(AND($C$3=2,C42<$Z$38),$Z$40,IF(AND($C$3=2,C42>=$Z$38),$Z$42,IF(AND($C$3=3,C42<$AA$38),$AA$40,IF(AND($C$3=3,C42>=$AA$38),$AA$42,IF(AND($C$3=4,C42<$AB$38),$AB$40,IF(AND($C$3=4,C42>=$AB$38),$AB$42,IF(AND($C$3=5,C42<$AC$38),$AC$40,IF(AND($C$3=5,C42>=$AC$38),$AC$42,IF(AND($C$3=6,C42<$AD$38),$AD$40,IF(AND($C$3=6,C42>=$AD$38),$AD$42,IF(AND($C$3=7,C42<$AE$38),$AE$40,IF(AND($C$3=7,C42>=$AE$38),$AE$42,IF(AND($C$3=8,C42<$AF$38),$AF$40,IF(AND($C$3=8,C42>=$AF$38),$AF$42))))))))))))))))","v":"C'est bien tu gères la distance"},{"$f":"COUNTIF($E$6:$E$35,B42)","v":0},{"$f":"IF(AND($E$3=1,E42<$Y$38),$Y$40,IF(AND($E$3=1,E42>=$Y$38),$Y$42,IF(AND($E$3=2,E42<$Z$38),$Z$40,IF(AND($E$3=2,E42>=$Z$38),$Z$42,IF(AND($E$3=3,E42<$AA$38),$AA$40,IF(AND($E$3=3,E42>=$AA$38),$AA$42,IF(AND($E$3=4,E42<$AB$38),$AB$40,IF(AND($E$3=4,E42>=$AB$38),$AB$42,IF(AND($E$3=5,E42<$AC$38),$AC$40,IF(AND($E$3=5,E42>=$AC$38),$AC$42,IF(AND($E$3=6,E42<$AD$38),$AD$40,IF(AND($E$3=6,E42>=$AD$38),$AD$42,IF(AND($E$3=7,E42<$AE$38),$AE$40,IF(AND($E$3=7,E42>=$AE$38),$AE$42,IF(AND($E$3=8,E42<$AF$38),$AF$40,IF(AND($E$3=8,E42>=$AF$38),$AF$42))))))))))))))))","v":"Bien tu lèves la tête"},{"$f":"COUNTIF($G$6:$G$35,B42)","v":0},{"$f":"IF(AND($G$3=1,G42<$Y$38),$Y$40,IF(AND($G$3=1,G42>=$Y$38),$Y$42,IF(AND($G$3=2,G42<$Z$38),$Z$40,IF(AND($G$3=2,G42>=$Z$38),$Z$42,IF(AND($G$3=3,G42<$AA$38),$AA$40,IF(AND($G$3=3,G42>=$AA$38),$AA$42,IF(AND($G$3=4,G42<$AB$38),$AB$40,IF(AND($G$3=4,G42>=$AB$38),$AB$42,IF(AND($G$3=5,G42<$AC$38),$AC$40,IF(AND($G$3=5,G42>=$AC$38),$AC$42,IF(AND($G$3=6,G42<$AD$38),$AD$40,IF(AND($G$3=6,G42>=$AD$38),$AD$42,IF(AND($G$3=7,G42<$AE$38),$AE$40,IF(AND($G$3=7,G42>=$AE$38),$AE$42,IF(AND($G$3=8,G42<$AF$38),$AF$40,IF(AND($G$3=8,G42>=$AF$38),$AF$42))))))))))))))))","v":"Tu touches le ballon"},null,{"$f":"IF(AND($I$3=1,I42<$Y$38),$Y$40,IF(AND($I$3=1,I42>=$Y$38),$Y$42,IF(AND($I$3=2,I42<$Z$38),$Z$40,IF(AND($I$3=2,I42>=$Z$38),$Z$42,IF(AND($I$3=3,I42<$AA$38),$AA$40,IF(AND($I$3=3,I42>=$AA$38),$AA$42,IF(AND($I$3=4,I42<$AB$38),$AB$40,IF(AND($I$3=4,I42>=$AB$38),$AB$42,IF(AND($I$3=5,I42<$AC$38),$AC$40,IF(AND($I$3=5,I42>=$AC$38),$AC$42,IF(AND($I$3=6,I42<$AD$38),$AD$40,IF(AND($I$3=6,I42>=$AD$38),$AD$42,IF(AND($I$3=7,I42<$AE$38),$AE$40,IF(AND($I$3=7,I42>=$AE$38),$AE$42,IF(AND($I$3=8,I42<$AF$38),$AF$40,IF(AND($I$3=8,I42>=$AF$38),$AF$42))))))))))))))))","v":{"$error":"#REF!"}},{"$f":"COUNTIF($K$6:$K$35,B42)","v":0},{"$f":"IF(AND($K$3=1,K42<$Y$38),$Y$40,IF(AND($K$3=1,K42>=$Y$38),$Y$42,IF(AND($K$3=2,K42<$Z$38),$Z$40,IF(AND($K$3=2,K42>=$Z$38),$Z$42,IF(AND($K$3=3,K42<$AA$38),$AA$40,IF(AND($K$3=3,K42>=$AA$38),$AA$42,IF(AND($K$3=4,K42<$AB$38),$AB$40,IF(AND($K$3=4,K42>=$AB$38),$AB$42,IF(AND($K$3=5,K42<$AC$38),$AC$40,IF(AND($K$3=5,K42>=$AC$38),$AC$42,IF(AND($K$3=6,K42<$AD$38),$AD$40,IF(AND($K$3=6,K42>=$AD$38),$AD$42,IF(AND($K$3=7,K42<$AE$38),$AE$40,IF(AND($K$3=7,K42>=$AE$38),$AE$42,IF(AND($K$3=8,K42<$AF$38),$AF$40,IF(AND($K$3=8,K42>=$AF$38),$AF$42))))))))))))))))","v":{"$error":"#REF!"}},{"$f":"COUNTIF($M$6:$M$35,B42)","v":0},{"$f":"IF(AND($M$3=1,M42<$Y$38),$Y$40,IF(AND($M$3=1,M42>=$Y$38),$Y$42,IF(AND($M$3=2,M42<$Z$38),$Z$40,IF(AND($M$3=2,M42>=$Z$38),$Z$42,IF(AND($M$3=3,M42<$AA$38),$AA$40,IF(AND($M$3=3,M42>=$AA$38),$AA$42,IF(AND($M$3=4,M42<$AB$38),$AB$40,IF(AND($M$3=4,M42>=$AB$38),$AB$42,IF(AND($M$3=5,M42<$AC$38),$AC$40,IF(AND($M$3=5,M42>=$AC$38),$AC$42,IF(AND($M$3=6,M42<$AD$38),$AD$40,IF(AND($M$3=6,M42>=$AD$38),$AD$42,IF(AND($M$3=7,M42<$AE$38),$AE$40,IF(AND($M$3=7,M42>=$AE$38),$AE$42,IF(AND($M$3=8,M42<$AF$38),$AF$40,IF(AND($M$3=8,M42>=$AF$38),$AF$42))))))))))))))))","v":"Faut oser tirer"},{"$f":"COUNTIF($O$6:$O$35,B42)","v":0},{"$f":"IF(AND($O$3=1,O42<$Y$38),$Y$40,IF(AND($O$3=1,O42>=$Y$38),$Y$42,IF(AND($O$3=2,O42<$Z$38),$Z$40,IF(AND($O$3=2,O42>=$Z$38),$Z$42,IF(AND($O$3=3,O42<$AA$38),$AA$40,IF(AND($O$3=3,O42>=$AA$38),$AA$42,IF(AND($O$3=4,O42<$AB$38),$AB$40,IF(AND($O$3=4,O42>=$AB$38),$AB$42,IF(AND($O$3=5,O42<$AC$38),$AC$40,IF(AND($O$3=5,O42>=$AC$38),$AC$42,IF(AND($O$3=6,O42<$AD$38),$AD$40,IF(AND($O$3=6,O42>=$AD$38),$AD$42,IF(AND($O$3=7,O42<$AE$38),$AE$40,IF(AND($O$3=7,O42>=$AE$38),$AE$42,IF(AND($O$3=8,O42<$AF$38),$AF$40,IF(AND($O$3=8,O42>=$AF$38),$AF$42))))))))))))))))","v":"Pourquoi tes tirs ne rentrent pas ?"},{"$f":"COUNTIF($Q$6:$Q$35,B42)","v":0},{"$f":"IF(AND($Q$3=1,Q42<$Y$38),$Y$40,IF(AND($Q$3=1,Q42>=$Y$38),$Y$42,IF(AND($Q$3=2,Q42<$Z$38),$Z$40,IF(AND($Q$3=2,Q42>=$Z$38),$Z$42,IF(AND($Q$3=3,Q42<$AA$38),$AA$40,IF(AND($Q$3=3,Q42>=$AA$38),$AA$42,IF(AND($Q$3=4,Q42<$AB$38),$AB$40,IF(AND($Q$3=4,Q42>=$AB$38),$AB$42,IF(AND($Q$3=5,Q42<$AC$38),$AC$40,IF(AND($Q$3=5,Q42>=$AC$38),$AC$42,IF(AND($Q$3=6,Q42<$AD$38),$AD$40,IF(AND($Q$3=6,Q42>=$AD$38),$AD$42,IF(AND($Q$3=7,Q42<$AE$38),$AE$40,IF(AND($Q$3=7,Q42>=$AE$38),$AE$42,IF(AND($Q$3=8,Q42<$AF$38),$AF$40,IF(AND($Q$3=8,Q42>=$AF$38),$AF$42))))))))))))))))","v":{"$error":"#REF!"}},{"$f":"COUNTIF($S$6:$S$35,B42)","v":0},{"$f":"IF(AND($S$3=1,S42<$Y$38),$Y$40,IF(AND($S$3=1,S42>=$Y$38),$Y$42,IF(AND($S$3=2,S42<$Z$38),$Z$40,IF(AND($S$3=2,S42>=$Z$38),$Z$42,IF(AND($S$3=3,S42<$AA$38),$AA$40,IF(AND($S$3=3,S42>=$AA$38),$AA$42,IF(AND($S$3=4,S42<$AB$38),$AB$40,IF(AND($S$3=4,S42>=$AB$38),$AB$42,IF(AND($S$3=5,S42<$AC$38),$AC$40,IF(AND($S$3=5,S42>=$AC$38),$AC$42,IF(AND($S$3=6,S42<$AD$38),$AD$40,IF(AND($S$3=6,S42>=$AD$38),$AD$42,IF(AND($S$3=7,S42<$AE$38),$AE$40,IF(AND($S$3=7,S42>=$AE$38),$AE$42,IF(AND($S$3=8,S42<$AF$38),$AF$40,IF(AND($S$3=8,S42>=$AF$38),$AF$42))))))))))))))))","v":"SI tu tires il faudra être plus précis"},{"$f":"S42/SUM(M42+O42+S42)*100","v":{"$error":"#DIV/0!"}},{"$f":"IF(AND($U$3=1,U42<$Y$38),$Y$40,IF(AND($U$3=1,U42>=$Y$38),$Y$42,IF(AND($U$3=2,U42<$Z$38),$Z$40,IF(AND($U$3=2,U42>=$Z$38),$Z$42,IF(AND($U$3=3,U42<$AA$38),$AA$40,IF(AND($U$3=3,U42>=$AA$38),$AA$42,IF(AND($U$3=4,U42<$AB$38),$AB$40,IF(AND($U$3=4,U42>=$AB$38),$AB$42,IF(AND($U$3=5,U42<$AC$38),$AC$40,IF(AND($U$3=5,U42>=$AC$38),$AC$42,IF(AND($U$3=6,U42<$AD$38),$AD$40,IF(AND($U$3=6,U42>=$AD$38),$AD$42,IF(AND($U$3=7,U42<$AE$38),$AE$40,IF(AND($U$3=7,U42>=$AE$38),$AE$42,IF(AND($U$3=8,U42<$AF$38),$AF$40,IF(AND($U$3=8,U42>=$AF$38),$AF$42))))))))))))))))","v":{"$error":"#DIV/0!"}},{"$f":"B42","v":0},null,{"$f":"DEBUT!Y42","v":"Doucement "},{"$f":"DEBUT!Z42","v":"A qui tu fais la passe?"},{"$f":"DEBUT!AA42","v":"T'es plutot actif"},{"$f":"DEBUT!AB42","v":"Bien harcelé"},{"$f":"DEBUT!AC42","v":"Bien essayé mais faudra travailler l'adresse"},{"$f":"DEBUT!AD42","v":"On va travailler la précision"},{"$f":"DEBUT!AE42","v":"Joli"},{"$f":"DEBUT!AF42","v":"Bien visé"}]
[null,"Contrats ->",null,null,null,null,null,null,null,null,null,null,null,null,null,null,null,null,null,null,null,null,"<-Contrats "]
[null,{"$f":"EQUIPES!B7","v":0},{"$f":"COUNTIF($C$6:$C$35,B44)","v":0},{"$f":"IF(AND($C$3=1,C44<$Y$38),$Y$40,IF(AND($C$3=1,C44>=$Y$38),$Y$42,IF(AND($C$3=2,C44<$Z$38),$Z$40,IF(AND($C$3=2,C44>=$Z$38),$Z$42,IF(AND($C$3=3,C44<$AA$38),$AA$40,IF(AND($C$3=3,C44>=$AA$38),$AA$42,IF(AND($C$3=4,C44<$AB$38),$AB$40,IF(AND($C$3=4,C44>=$AB$38),$AB$42,IF(AND($C$3=5,C44<$AC$38),$AC$40,IF(AND($C$3=5,C44>=$AC$38),$AC$42,IF(AND($C$3=6,C44<$AD$38),$AD$40,IF(AND($C$3=6,C44>=$AD$38),$AD$42,IF(AND($C$3=7,C44<$AE$38),$AE$40,IF(AND($C$3=7,C44>=$AE$38),$AE$42,IF(AND($C$3=8,C44<$AF$38),$AF$40,IF(AND($C$3=8,C44>=$AF$38),$AF$42))))))))))))))))","v":"C'est bien tu gères la distance"},{"$f":"COUNTIF($E$6:$E$35,B44)","v":0},{"$f":"IF(AND($E$3=1,E44<$Y$38),$Y$40,IF(AND($E$3=1,E44>=$Y$38),$Y$42,IF(AND($E$3=2,E44<$Z$38),$Z$40,IF(AND($E$3=2,E44>=$Z$38),$Z$42,IF(AND($E$3=3,E44<$AA$38),$AA$40,IF(AND($E$3=3,E44>=$AA$38),$AA$42,IF(AND($E$3=4,E44<$AB$38),$AB$40,IF(AND($E$3=4,E44>=$AB$38),$AB$42,IF(AND($E$3=5,E44<$AC$38),$AC$40,IF(AND($E$3=5,E44>=$AC$38),$AC$42,IF(AND($E$3=6,E44<$AD$38),$AD$40,IF(AND($E$3=6,E44>=$AD$38),$AD$42,IF(AND($E$3=7,E44<$AE$38),$AE$40,IF(AND($E$3=7,E44>=$AE$38),$AE$42,IF(AND($E$3=8,E44<$AF$38),$AF$40,IF(AND($E$3=8,E44>=$AF$38),$AF$42))))))))))))))))","v":"Bien tu lèves la tête"},{"$f":"COUNTIF($G$6:$G$35,B44)","v":0},{"$f":"IF(AND($G$3=1,G44<$Y$38),$Y$40,IF(AND($G$3=1,G44>=$Y$38),$Y$42,IF(AND($G$3=2,G44<$Z$38),$Z$40,IF(AND($G$3=2,G44>=$Z$38),$Z$42,IF(AND($G$3=3,G44<$AA$38),$AA$40,IF(AND($G$3=3,G44>=$AA$38),$AA$42,IF(AND($G$3=4,G44<$AB$38),$AB$40,IF(AND($G$3=4,G44>=$AB$38),$AB$42,IF(AND($G$3=5,G44<$AC$38),$AC$40,IF(AND($G$3=5,G44>=$AC$38),$AC$42,IF(AND($G$3=6,G44<$AD$38),$AD$40,IF(AND($G$3=6,G44>=$AD$38),$AD$42,IF(AND($G$3=7,G44<$AE$38),$AE$40,IF(AND($G$3=7,G44>=$AE$38),$AE$42,IF(AND($G$3=8,G44<$AF$38),$AF$40,IF(AND($G$3=8,G44>=$AF$38),$AF$42))))))))))))))))","v":"Tu touches le ballon"},null,{"$f":"IF(AND($I$3=1,I44<$Y$38),$Y$40,IF(AND($I$3=1,I44>=$Y$38),$Y$42,IF(AND($I$3=2,I44<$Z$38),$Z$40,IF(AND($I$3=2,I44>=$Z$38),$Z$42,IF(AND($I$3=3,I44<$AA$38),$AA$40,IF(AND($I$3=3,I44>=$AA$38),$AA$42,IF(AND($I$3=4,I44<$AB$38),$AB$40,IF(AND($I$3=4,I44>=$AB$38),$AB$42,IF(AND($I$3=5,I44<$AC$38),$AC$40,IF(AND($I$3=5,I44>=$AC$38),$AC$42,IF(AND($I$3=6,I44<$AD$38),$AD$40,IF(AND($I$3=6,I44>=$AD$38),$AD$42,IF(AND($I$3=7,I44<$AE$38),$AE$40,IF(AND($I$3=7,I44>=$AE$38),$AE$42,IF(AND($I$3=8,I44<$AF$38),$AF$40,IF(AND($I$3=8,I44>=$AF$38),$AF$42))))))))))))))))","v":{"$error":"#REF!"}},{"$f":"COUNTIF($K$6:$K$35,B44)","v":0},{"$f":"IF(AND($K$3=1,K44<$Y$38),$Y$40,IF(AND($K$3=1,K44>=$Y$38),$Y$42,IF(AND($K$3=2,K44<$Z$38),$Z$40,IF(AND($K$3=2,K44>=$Z$38),$Z$42,IF(AND($K$3=3,K44<$AA$38),$AA$40,IF(AND($K$3=3,K44>=$AA$38),$AA$42,IF(AND($K$3=4,K44<$AB$38),$AB$40,IF(AND($K$3=4,K44>=$AB$38),$AB$42,IF(AND($K$3=5,K44<$AC$38),$AC$40,IF(AND($K$3=5,K44>=$AC$38),$AC$42,IF(AND($K$3=6,K44<$AD$38),$AD$40,IF(AND($K$3=6,K44>=$AD$38),$AD$42,IF(AND($K$3=7,K44<$AE$38),$AE$40,IF(AND($K$3=7,K44>=$AE$38),$AE$42,IF(AND($K$3=8,K44<$AF$38),$AF$40,IF(AND($K$3=8,K44>=$AF$38),$AF$42))))))))))))))))","v":{"$error":"#REF!"}},{"$f":"COUNTIF($M$6:$M$35,B44)","v":0},{"$f":"IF(AND($M$3=1,M44<$Y$38),$Y$40,IF(AND($M$3=1,M44>=$Y$38),$Y$42,IF(AND($M$3=2,M44<$Z$38),$Z$40,IF(AND($M$3=2,M44>=$Z$38),$Z$42,IF(AND($M$3=3,M44<$AA$38),$AA$40,IF(AND($M$3=3,M44>=$AA$38),$AA$42,IF(AND($M$3=4,M44<$AB$38),$AB$40,IF(AND($M$3=4,M44>=$AB$38),$AB$42,IF(AND($M$3=5,M44<$AC$38),$AC$40,IF(AND($M$3=5,M44>=$AC$38),$AC$42,IF(AND($M$3=6,M44<$AD$38),$AD$40,IF(AND($M$3=6,M44>=$AD$38),$AD$42,IF(AND($M$3=7,M44<$AE$38),$AE$40,IF(AND($M$3=7,M44>=$AE$38),$AE$42,IF(AND($M$3=8,M44<$AF$38),$AF$40,IF(AND($M$3=8,M44>=$AF$38),$AF$42))))))))))))))))","v":"Faut oser tirer"},{"$f":"COUNTIF($O$6:$O$35,B44)","v":0},{"$f":"IF(AND($O$3=1,O44<$Y$38),$Y$40,IF(AND($O$3=1,O44>=$Y$38),$Y$42,IF(AND($O$3=2,O44<$Z$38),$Z$40,IF(AND($O$3=2,O44>=$Z$38),$Z$42,IF(AND($O$3=3,O44<$AA$38),$AA$40,IF(AND($O$3=3,O44>=$AA$38),$AA$42,IF(AND($O$3=4,O44<$AB$38),$AB$40,IF(AND($O$3=4,O44>=$AB$38),$AB$42,IF(AND($O$3=5,O44<$AC$38),$AC$40,IF(AND($O$3=5,O44>=$AC$38),$AC$42,IF(AND($O$3=6,O44<$AD$38),$AD$40,IF(AND($O$3=6,O44>=$AD$38),$AD$42,IF(AND($O$3=7,O44<$AE$38),$AE$40,IF(AND($O$3=7,O44>=$AE$38),$AE$42,IF(AND($O$3=8,O44<$AF$38),$AF$40,IF(AND($O$3=8,O44>=$AF$38),$AF$42))))))))))))))))","v":"Pourquoi tes tirs ne rentrent pas ?"},{"$f":"COUNTIF($Q$6:$Q$35,B44)","v":0},{"$f":"IF(AND($Q$3=1,Q44<$Y$38),$Y$40,IF(AND($Q$3=1,Q44>=$Y$38),$Y$42,IF(AND($Q$3=2,Q44<$Z$38),$Z$40,IF(AND($Q$3=2,Q44>=$Z$38),$Z$42,IF(AND($Q$3=3,Q44<$AA$38),$AA$40,IF(AND($Q$3=3,Q44>=$AA$38),$AA$42,IF(AND($Q$3=4,Q44<$AB$38),$AB$40,IF(AND($Q$3=4,Q44>=$AB$38),$AB$42,IF(AND($Q$3=5,Q44<$AC$38),$AC$40,IF(AND($Q$3=5,Q44>=$AC$38),$AC$42,IF(AND($Q$3=6,Q44<$AD$38),$AD$40,IF(AND($Q$3=6,Q44>=$AD$38),$AD$42,IF(AND($Q$3=7,Q44<$AE$38),$AE$40,IF(AND($Q$3=7,Q44>=$AE$38),$AE$42,IF(AND($Q$3=8,Q44<$AF$38),$AF$40,IF(AND($Q$3=8,Q44>=$AF$38),$AF$42))))))))))))))))","v":{"$error":"#REF!"}},{"$f":"COUNTIF($S$6:$S$35,B44)","v":0},{"$f":"IF(AND($S$3=1,S44<$Y$38),$Y$40,IF(AND($S$3=1,S44>=$Y$38),$Y$42,IF(AND($S$3=2,S44<$Z$38),$Z$40,IF(AND($S$3=2,S44>=$Z$38),$Z$42,IF(AND($S$3=3,S44<$AA$38),$AA$40,IF(AND($S$3=3,S44>=$AA$38),$AA$42,IF(AND($S$3=4,S44<$AB$38),$AB$40,IF(AND($S$3=4,S44>=$AB$38),$AB$42,IF(AND($S$3=5,S44<$AC$38),$AC$40,IF(AND($S$3=5,S44>=$AC$38),$AC$42,IF(AND($S$3=6,S44<$AD$38),$AD$40,IF(AND($S$3=6,S44>=$AD$38),$AD$42,IF(AND($S$3=7,S44<$AE$38),$AE$40,IF(AND($S$3=7,S44>=$AE$38),$AE$42,IF(AND($S$3=8,S44<$AF$38),$AF$40,IF(AND($S$3=8,S44>=$AF$38),$AF$42))))))))))))))))","v":"SI tu tires il faudra être plus précis"},{"$f":"S44/SUM(M44+O44+S44)*100","v":{"$error":"#DIV/0!"}},{"$f":"IF(AND($U$3=1,U44<$Y$38),$Y$40,IF(AND($U$3=1,U44>=$Y$38),$Y$42,IF(AND($U$3=2,U44<$Z$38),$Z$40,IF(AND($U$3=2,U44>=$Z$38),$Z$42,IF(AND($U$3=3,U44<$AA$38),$AA$40,IF(AND($U$3=3,U44>=$AA$38),$AA$42,IF(AND($U$3=4,U44<$AB$38),$AB$40,IF(AND($U$3=4,U44>=$AB$38),$AB$42,IF(AND($U$3=5,U44<$AC$38),$AC$40,IF(AND($U$3=5,U44>=$AC$38),$AC$42,IF(AND($U$3=6,U44<$AD$38),$AD$40,IF(AND($U$3=6,U44>=$AD$38),$AD$42,IF(AND($U$3=7,U44<$AE$38),$AE$40,IF(AND($U$3=7,U44>=$AE$38),$AE$42,IF(AND($U$3=8,U44<$AF$38),$AF$40,IF(AND($U$3=8,U44>=$AF$38),$AF$42))))))))))))))))","v":{"$error":"#DIV/0!"}},{"$f":"B44","v":0},"Aide aux formules",{"$f":"DEBUT!Y44","v":1},{"$f":"DEBUT!Z44","v":2},{"$f":"DEBUT!AA44","v":3},{"$f":"DEBUT!AB44","v":4},{"$f":"DEBUT!AC44","v":5},{"$f":"DEBUT!AD44","v":6},{"$f":"DEBUT!AE44","v":7},{"$f":"DEBUT!AF44","v":8},9,10]
[null,"Contrats ->",null,null,null,null,null,null,null,null,null,null,null,null,null,null,null,null,null,null,null,null,"<-Contrats ",null,{"$f":"DEBUT!Y45","v":0},{"$f":"DEBUT!Z45","v":0},{"$f":"DEBUT!AA45","v":0},{"$f":"DEBUT!AB45","v":0},{"$f":"DEBUT!AC45","v":0},{"$f":"DEBUT!AD45","v":0},{"$f":"DEBUT!AE45","v":0},{"$f":"DEBUT!AF45","v":0}]
[null,{"$f":"EQUIPES!B8","v":0},{"$f":"COUNTIF($C$6:$C$35,B46)","v":0},{"$f":"IF(AND($C$3=1,C46<$Y$38),$Y$40,IF(AND($C$3=1,C46>=$Y$38),$Y$42,IF(AND($C$3=2,C46<$Z$38),$Z$40,IF(AND($C$3=2,C46>=$Z$38),$Z$42,IF(AND($C$3=3,C46<$AA$38),$AA$40,IF(AND($C$3=3,C46>=$AA$38),$AA$42,IF(AND($C$3=4,C46<$AB$38),$AB$40,IF(AND($C$3=4,C46>=$AB$38),$AB$42,IF(AND($C$3=5,C46<$AC$38),$AC$40,IF(AND($C$3=5,C46>=$AC$38),$AC$42,IF(AND($C$3=6,C46<$AD$38),$AD$40,IF(AND($C$3=6,C46>=$AD$38),$AD$42,IF(AND($C$3=7,C46<$AE$38),$AE$40,IF(AND($C$3=7,C46>=$AE$38),$AE$42,IF(AND($C$3=8,C46<$AF$38),$AF$40,IF(AND($C$3=8,C46>=$AF$38),$AF$42))))))))))))))))","v":"C'est bien tu gères la distance"},{"$f":"COUNTIF($E$6:$E$35,B46)","v":0},{"$f":"IF(AND($E$3=1,E46<$Y$38),$Y$40,IF(AND($E$3=1,E46>=$Y$38),$Y$42,IF(AND($E$3=2,E46<$Z$38),$Z$40,IF(AND($E$3=2,E46>=$Z$38),$Z$42,IF(AND($E$3=3,E46<$AA$38),$AA$40,IF(AND($E$3=3,E46>=$AA$38),$AA$42,IF(AND($E$3=4,E46<$AB$38),$AB$40,IF(AND($E$3=4,E46>=$AB$38),$AB$42,IF(AND($E$3=5,E46<$AC$38),$AC$40,IF(AND($E$3=5,E46>=$AC$38),$AC$42,IF(AND($E$3=6,E46<$AD$38),$AD$40,IF(AND($E$3=6,E46>=$AD$38),$AD$42,IF(AND($E$3=7,E46<$AE$38),$AE$40,IF(AND($E$3=7,E46>=$AE$38),$AE$42,IF(AND($E$3=8,E46<$AF$38),$AF$40,IF(AND($E$3=8,E46>=$AF$38),$AF$42))))))))))))))))","v":"Bien tu lèves la tête"},{"$f":"COUNTIF($G$6:$G$35,B46)","v":0},{"$f":"IF(AND($G$3=1,G46<$Y$38),$Y$40,IF(AND($G$3=1,G46>=$Y$38),$Y$42,IF(AND($G$3=2,G46<$Z$38),$Z$40,IF(AND($G$3=2,G46>=$Z$38),$Z$42,IF(AND($G$3=3,G46<$AA$38),$AA$40,IF(AND($G$3=3,G46>=$AA$38),$AA$42,IF(AND($G$3=4,G46<$AB$38),$AB$40,IF(AND($G$3=4,G46>=$AB$38),$AB$42,IF(AND($G$3=5,G46<$AC$38),$AC$40,IF(AND($G$3=5,G46>=$AC$38),$AC$42,IF(AND($G$3=6,G46<$AD$38),$AD$40,IF(AND($G$3=6,G46>=$AD$38),$AD$42,IF(AND($G$3=7,G46<$AE$38),$AE$40,IF(AND($G$3=7,G46>=$AE$38),$AE$42,IF(AND($G$3=8,G46<$AF$38),$AF$40,IF(AND($G$3=8,G46>=$AF$38),$AF$42))))))))))))))))","v":"Tu touches le ballon"},null,{"$f":"IF(AND($I$3=1,I46<$Y$38),$Y$40,IF(AND($I$3=1,I46>=$Y$38),$Y$42,IF(AND($I$3=2,I46<$Z$38),$Z$40,IF(AND($I$3=2,I46>=$Z$38),$Z$42,IF(AND($I$3=3,I46<$AA$38),$AA$40,IF(AND($I$3=3,I46>=$AA$38),$AA$42,IF(AND($I$3=4,I46<$AB$38),$AB$40,IF(AND($I$3=4,I46>=$AB$38),$AB$42,IF(AND($I$3=5,I46<$AC$38),$AC$40,IF(AND($I$3=5,I46>=$AC$38),$AC$42,IF(AND($I$3=6,I46<$AD$38),$AD$40,IF(AND($I$3=6,I46>=$AD$38),$AD$42,IF(AND($I$3=7,I46<$AE$38),$AE$40,IF(AND($I$3=7,I46>=$AE$38),$AE$42,IF(AND($I$3=8,I46<$AF$38),$AF$40,IF(AND($I$3=8,I46>=$AF$38),$AF$42))))))))))))))))","v":{"$error":"#REF!"}},{"$f":"COUNTIF($K$6:$K$35,B46)","v":0},{"$f":"IF(AND($K$3=1,K46<$Y$38),$Y$40,IF(AND($K$3=1,K46>=$Y$38),$Y$42,IF(AND($K$3=2,K46<$Z$38),$Z$40,IF(AND($K$3=2,K46>=$Z$38),$Z$42,IF(AND($K$3=3,K46<$AA$38),$AA$40,IF(AND($K$3=3,K46>=$AA$38),$AA$42,IF(AND($K$3=4,K46<$AB$38),$AB$40,IF(AND($K$3=4,K46>=$AB$38),$AB$42,IF(AND($K$3=5,K46<$AC$38),$AC$40,IF(AND($K$3=5,K46>=$AC$38),$AC$42,IF(AND($K$3=6,K46<$AD$38),$AD$40,IF(AND($K$3=6,K46>=$AD$38),$AD$42,IF(AND($K$3=7,K46<$AE$38),$AE$40,IF(AND($K$3=7,K46>=$AE$38),$AE$42,IF(AND($K$3=8,K46<$AF$38),$AF$40,IF(AND($K$3=8,K46>=$AF$38),$AF$42))))))))))))))))","v":{"$error":"#REF!"}},{"$f":"COUNTIF($M$6:$M$35,B46)","v":0},{"$f":"IF(AND($M$3=1,M46<$Y$38),$Y$40,IF(AND($M$3=1,M46>=$Y$38),$Y$42,IF(AND($M$3=2,M46<$Z$38),$Z$40,IF(AND($M$3=2,M46>=$Z$38),$Z$42,IF(AND($M$3=3,M46<$AA$38),$AA$40,IF(AND($M$3=3,M46>=$AA$38),$AA$42,IF(AND($M$3=4,M46<$AB$38),$AB$40,IF(AND($M$3=4,M46>=$AB$38),$AB$42,IF(AND($M$3=5,M46<$AC$38),$AC$40,IF(AND($M$3=5,M46>=$AC$38),$AC$42,IF(AND($M$3=6,M46<$AD$38),$AD$40,IF(AND($M$3=6,M46>=$AD$38),$AD$42,IF(AND($M$3=7,M46<$AE$38),$AE$40,IF(AND($M$3=7,M46>=$AE$38),$AE$42,IF(AND($M$3=8,M46<$AF$38),$AF$40,IF(AND($M$3=8,M46>=$AF$38),$AF$42))))))))))))))))","v":"Faut oser tirer"},{"$f":"COUNTIF($O$6:$O$35,B46)","v":0},{"$f":"IF(AND($O$3=1,O46<$Y$38),$Y$40,IF(AND($O$3=1,O46>=$Y$38),$Y$42,IF(AND($O$3=2,O46<$Z$38),$Z$40,IF(AND($O$3=2,O46>=$Z$38),$Z$42,IF(AND($O$3=3,O46<$AA$38),$AA$40,IF(AND($O$3=3,O46>=$AA$38),$AA$42,IF(AND($O$3=4,O46<$AB$38),$AB$40,IF(AND($O$3=4,O46>=$AB$38),$AB$42,IF(AND($O$3=5,O46<$AC$38),$AC$40,IF(AND($O$3=5,O46>=$AC$38),$AC$42,IF(AND($O$3=6,O46<$AD$38),$AD$40,IF(AND($O$3=6,O46>=$AD$38),$AD$42,IF(AND($O$3=7,O46<$AE$38),$AE$40,IF(AND($O$3=7,O46>=$AE$38),$AE$42,IF(AND($O$3=8,O46<$AF$38),$AF$40,IF(AND($O$3=8,O46>=$AF$38),$AF$42))))))))))))))))","v":"Pourquoi tes tirs ne rentrent pas ?"},{"$f":"COUNTIF($Q$6:$Q$35,B46)","v":0},{"$f":"IF(AND($Q$3=1,Q46<$Y$38),$Y$40,IF(AND($Q$3=1,Q46>=$Y$38),$Y$42,IF(AND($Q$3=2,Q46<$Z$38),$Z$40,IF(AND($Q$3=2,Q46>=$Z$38),$Z$42,IF(AND($Q$3=3,Q46<$AA$38),$AA$40,IF(AND($Q$3=3,Q46>=$AA$38),$AA$42,IF(AND($Q$3=4,Q46<$AB$38),$AB$40,IF(AND($Q$3=4,Q46>=$AB$38),$AB$42,IF(AND($Q$3=5,Q46<$AC$38),$AC$40,IF(AND($Q$3=5,Q46>=$AC$38),$AC$42,IF(AND($Q$3=6,Q46<$AD$38),$AD$40,IF(AND($Q$3=6,Q46>=$AD$38),$AD$42,IF(AND($Q$3=7,Q46<$AE$38),$AE$40,IF(AND($Q$3=7,Q46>=$AE$38),$AE$42,IF(AND($Q$3=8,Q46<$AF$38),$AF$40,IF(AND($Q$3=8,Q46>=$AF$38),$AF$42))))))))))))))))","v":{"$error":"#REF!"}},{"$f":"COUNTIF($S$6:$S$35,B46)","v":0},{"$f":"IF(AND($S$3=1,S46<$Y$38),$Y$40,IF(AND($S$3=1,S46>=$Y$38),$Y$42,IF(AND($S$3=2,S46<$Z$38),$Z$40,IF(AND($S$3=2,S46>=$Z$38),$Z$42,IF(AND($S$3=3,S46<$AA$38),$AA$40,IF(AND($S$3=3,S46>=$AA$38),$AA$42,IF(AND($S$3=4,S46<$AB$38),$AB$40,IF(AND($S$3=4,S46>=$AB$38),$AB$42,IF(AND($S$3=5,S46<$AC$38),$AC$40,IF(AND($S$3=5,S46>=$AC$38),$AC$42,IF(AND($S$3=6,S46<$AD$38),$AD$40,IF(AND($S$3=6,S46>=$AD$38),$AD$42,IF(AND($S$3=7,S46<$AE$38),$AE$40,IF(AND($S$3=7,S46>=$AE$38),$AE$42,IF(AND($S$3=8,S46<$AF$38),$AF$40,IF(AND($S$3=8,S46>=$AF$38),$AF$42))))))))))))))))","v":"SI tu tires il faudra être plus précis"},{"$f":"S46/SUM(M46+O46+S46)*100","v":{"$error":"#DIV/0!"}},{"$f":"IF(AND($U$3=1,U46<$Y$38),$Y$40,IF(AND($U$3=1,U46>=$Y$38),$Y$42,IF(AND($U$3=2,U46<$Z$38),$Z$40,IF(AND($U$3=2,U46>=$Z$38),$Z$42,IF(AND($U$3=3,U46<$AA$38),$AA$40,IF(AND($U$3=3,U46>=$AA$38),$AA$42,IF(AND($U$3=4,U46<$AB$38),$AB$40,IF(AND($U$3=4,U46>=$AB$38),$AB$42,IF(AND($U$3=5,U46<$AC$38),$AC$40,IF(AND($U$3=5,U46>=$AC$38),$AC$42,IF(AND($U$3=6,U46<$AD$38),$AD$40,IF(AND($U$3=6,U46>=$AD$38),$AD$42,IF(AND($U$3=7,U46<$AE$38),$AE$40,IF(AND($U$3=7,U46>=$AE$38),$AE$42,IF(AND($U$3=8,U46<$AF$38),$AF$40,IF(AND($U$3=8,U46>=$AF$38),$AF$42))))))))))))))))","v":{"$error":"#DIV/0!"}},{"$f":"B46","v":0},null,{"$f":"DEBUT!Y46","v":3},{"$f":"DEBUT!Z46","v":5},{"$f":"DEBUT!AA46","v":15},{"$f":"DEBUT!AB46","v":5},{"$f":"DEBUT!AC46","v":5},{"$f":"DEBUT!AD46","v":6},{"$f":"DEBUT!AE46","v":5},{"$f":"DEBUT!AF46","v":0.25}]
[null,"Contrats ->",null,null,null,null,null,null,null,null,null,null,null,null,null,null,null,null,null,null,null,null,"<-Contrats ","Contrats collectifs"]
[null,{"$f":"EQUIPES!B9","v":0},{"$f":"COUNTIF($C$6:$C$35,B48)","v":0},{"$f":"IF(AND($C$3=1,C48<$Y$38),$Y$40,IF(AND($C$3=1,C48>=$Y$38),$Y$42,IF(AND($C$3=2,C48<$Z$38),$Z$40,IF(AND($C$3=2,C48>=$Z$38),$Z$42,IF(AND($C$3=3,C48<$AA$38),$AA$40,IF(AND($C$3=3,C48>=$AA$38),$AA$42,IF(AND($C$3=4,C48<$AB$38),$AB$40,IF(AND($C$3=4,C48>=$AB$38),$AB$42,IF(AND($C$3=5,C48<$AC$38),$AC$40,IF(AND($C$3=5,C48>=$AC$38),$AC$42,IF(AND($C$3=6,C48<$AD$38),$AD$40,IF(AND($C$3=6,C48>=$AD$38),$AD$42,IF(AND($C$3=7,C48<$AE$38),$AE$40,IF(AND($C$3=7,C48>=$AE$38),$AE$42,IF(AND($C$3=8,C48<$AF$38),$AF$40,IF(AND($C$3=8,C48>=$AF$38),$AF$42))))))))))))))))","v":"C'est bien tu gères la distance"},{"$f":"COUNTIF($E$6:$E$35,B48)","v":0},{"$f":"IF(AND($E$3=1,E48<$Y$38),$Y$40,IF(AND($E$3=1,E48>=$Y$38),$Y$42,IF(AND($E$3=2,E48<$Z$38),$Z$40,IF(AND($E$3=2,E48>=$Z$38),$Z$42,IF(AND($E$3=3,E48<$AA$38),$AA$40,IF(AND($E$3=3,E48>=$AA$38),$AA$42,IF(AND($E$3=4,E48<$AB$38),$AB$40,IF(AND($E$3=4,E48>=$AB$38),$AB$42,IF(AND($E$3=5,E48<$AC$38),$AC$40,IF(AND($E$3=5,E48>=$AC$38),$AC$42,IF(AND($E$3=6,E48<$AD$38),$AD$40,IF(AND($E$3=6,E48>=$AD$38),$AD$42,IF(AND($E$3=7,E48<$AE$38),$AE$40,IF(AND($E$3=7,E48>=$AE$38),$AE$42,IF(AND($E$3=8,E48<$AF$38),$AF$40,IF(AND($E$3=8,E48>=$AF$38),$AF$42))))))))))))))))","v":"Bien tu lèves la tête"},{"$f":"COUNTIF($G$6:$G$35,B48)","v":0},{"$f":"IF(AND($G$3=1,G48<$Y$38),$Y$40,IF(AND($G$3=1,G48>=$Y$38),$Y$42,IF(AND($G$3=2,G48<$Z$38),$Z$40,IF(AND($G$3=2,G48>=$Z$38),$Z$42,IF(AND($G$3=3,G48<$AA$38),$AA$40,IF(AND($G$3=3,G48>=$AA$38),$AA$42,IF(AND($G$3=4,G48<$AB$38),$AB$40,IF(AND($G$3=4,G48>=$AB$38),$AB$42,IF(AND($G$3=5,G48<$AC$38),$AC$40,IF(AND($G$3=5,G48>=$AC$38),$AC$42,IF(AND($G$3=6,G48<$AD$38),$AD$40,IF(AND($G$3=6,G48>=$AD$38),$AD$42,IF(AND($G$3=7,G48<$AE$38),$AE$40,IF(AND($G$3=7,G48>=$AE$38),$AE$42,IF(AND($G$3=8,G48<$AF$38),$AF$40,IF(AND($G$3=8,G48>=$AF$38),$AF$42))))))))))))))))","v":"Tu touches le ballon"},null,{"$f":"IF(AND($I$3=1,I48<$Y$38),$Y$40,IF(AND($I$3=1,I48>=$Y$38),$Y$42,IF(AND($I$3=2,I48<$Z$38),$Z$40,IF(AND($I$3=2,I48>=$Z$38),$Z$42,IF(AND($I$3=3,I48<$AA$38),$AA$40,IF(AND($I$3=3,I48>=$AA$38),$AA$42,IF(AND($I$3=4,I48<$AB$38),$AB$40,IF(AND($I$3=4,I48>=$AB$38),$AB$42,IF(AND($I$3=5,I48<$AC$38),$AC$40,IF(AND($I$3=5,I48>=$AC$38),$AC$42,IF(AND($I$3=6,I48<$AD$38),$AD$40,IF(AND($I$3=6,I48>=$AD$38),$AD$42,IF(AND($I$3=7,I48<$AE$38),$AE$40,IF(AND($I$3=7,I48>=$AE$38),$AE$42,IF(AND($I$3=8,I48<$AF$38),$AF$40,IF(AND($I$3=8,I48>=$AF$38),$AF$42))))))))))))))))","v":{"$error":"#REF!"}},{"$f":"COUNTIF($K$6:$K$35,B48)","v":0},{"$f":"IF(AND($K$3=1,K48<$Y$38),$Y$40,IF(AND($K$3=1,K48>=$Y$38),$Y$42,IF(AND($K$3=2,K48<$Z$38),$Z$40,IF(AND($K$3=2,K48>=$Z$38),$Z$42,IF(AND($K$3=3,K48<$AA$38),$AA$40,IF(AND($K$3=3,K48>=$AA$38),$AA$42,IF(AND($K$3=4,K48<$AB$38),$AB$40,IF(AND($K$3=4,K48>=$AB$38),$AB$42,IF(AND($K$3=5,K48<$AC$38),$AC$40,IF(AND($K$3=5,K48>=$AC$38),$AC$42,IF(AND($K$3=6,K48<$AD$38),$AD$40,IF(AND($K$3=6,K48>=$AD$38),$AD$42,IF(AND($K$3=7,K48<$AE$38),$AE$40,IF(AND($K$3=7,K48>=$AE$38),$AE$42,IF(AND($K$3=8,K48<$AF$38),$AF$40,IF(AND($K$3=8,K48>=$AF$38),$AF$42))))))))))))))))","v":{"$error":"#REF!"}},{"$f":"COUNTIF($M$6:$M$35,B48)","v":0},{"$f":"IF(AND($M$3=1,M48<$Y$38),$Y$40,IF(AND($M$3=1,M48>=$Y$38),$Y$42,IF(AND($M$3=2,M48<$Z$38),$Z$40,IF(AND($M$3=2,M48>=$Z$38),$Z$42,IF(AND($M$3=3,M48<$AA$38),$AA$40,IF(AND($M$3=3,M48>=$AA$38),$AA$42,IF(AND($M$3=4,M48<$AB$38),$AB$40,IF(AND($M$3=4,M48>=$AB$38),$AB$42,IF(AND($M$3=5,M48<$AC$38),$AC$40,IF(AND($M$3=5,M48>=$AC$38),$AC$42,IF(AND($M$3=6,M48<$AD$38),$AD$40,IF(AND($M$3=6,M48>=$AD$38),$AD$42,IF(AND($M$3=7,M48<$AE$38),$AE$40,IF(AND($M$3=7,M48>=$AE$38),$AE$42,IF(AND($M$3=8,M48<$AF$38),$AF$40,IF(AND($M$3=8,M48>=$AF$38),$AF$42))))))))))))))))","v":"Faut oser tirer"},{"$f":"COUNTIF($O$6:$O$35,B48)","v":0},{"$f":"IF(AND($O$3=1,O48<$Y$38),$Y$40,IF(AND($O$3=1,O48>=$Y$38),$Y$42,IF(AND($O$3=2,O48<$Z$38),$Z$40,IF(AND($O$3=2,O48>=$Z$38),$Z$42,IF(AND($O$3=3,O48<$AA$38),$AA$40,IF(AND($O$3=3,O48>=$AA$38),$AA$42,IF(AND($O$3=4,O48<$AB$38),$AB$40,IF(AND($O$3=4,O48>=$AB$38),$AB$42,IF(AND($O$3=5,O48<$AC$38),$AC$40,IF(AND($O$3=5,O48>=$AC$38),$AC$42,IF(AND($O$3=6,O48<$AD$38),$AD$40,IF(AND($O$3=6,O48>=$AD$38),$AD$42,IF(AND($O$3=7,O48<$AE$38),$AE$40,IF(AND($O$3=7,O48>=$AE$38),$AE$42,IF(AND($O$3=8,O48<$AF$38),$AF$40,IF(AND($O$3=8,O48>=$AF$38),$AF$42))))))))))))))))","v":"Pourquoi tes tirs ne rentrent pas ?"},{"$f":"COUNTIF($Q$6:$Q$35,B48)","v":0},{"$f":"IF(AND($Q$3=1,Q48<$Y$38),$Y$40,IF(AND($Q$3=1,Q48>=$Y$38),$Y$42,IF(AND($Q$3=2,Q48<$Z$38),$Z$40,IF(AND($Q$3=2,Q48>=$Z$38),$Z$42,IF(AND($Q$3=3,Q48<$AA$38),$AA$40,IF(AND($Q$3=3,Q48>=$AA$38),$AA$42,IF(AND($Q$3=4,Q48<$AB$38),$AB$40,IF(AND($Q$3=4,Q48>=$AB$38),$AB$42,IF(AND($Q$3=5,Q48<$AC$38),$AC$40,IF(AND($Q$3=5,Q48>=$AC$38),$AC$42,IF(AND($Q$3=6,Q48<$AD$38),$AD$40,IF(AND($Q$3=6,Q48>=$AD$38),$AD$42,IF(AND($Q$3=7,Q48<$AE$38),$AE$40,IF(AND($Q$3=7,Q48>=$AE$38),$AE$42,IF(AND($Q$3=8,Q48<$AF$38),$AF$40,IF(AND($Q$3=8,Q48>=$AF$38),$AF$42))))))))))))))))","v":{"$error":"#REF!"}},{"$f":"COUNTIF($S$6:$S$35,B48)","v":0},{"$f":"IF(AND($S$3=1,S48<$Y$38),$Y$40,IF(AND($S$3=1,S48>=$Y$38),$Y$42,IF(AND($S$3=2,S48<$Z$38),$Z$40,IF(AND($S$3=2,S48>=$Z$38),$Z$42,IF(AND($S$3=3,S48<$AA$38),$AA$40,IF(AND($S$3=3,S48>=$AA$38),$AA$42,IF(AND($S$3=4,S48<$AB$38),$AB$40,IF(AND($S$3=4,S48>=$AB$38),$AB$42,IF(AND($S$3=5,S48<$AC$38),$AC$40,IF(AND($S$3=5,S48>=$AC$38),$AC$42,IF(AND($S$3=6,S48<$AD$38),$AD$40,IF(AND($S$3=6,S48>=$AD$38),$AD$42,IF(AND($S$3=7,S48<$AE$38),$AE$40,IF(AND($S$3=7,S48>=$AE$38),$AE$42,IF(AND($S$3=8,S48<$AF$38),$AF$40,IF(AND($S$3=8,S48>=$AF$38),$AF$42))))))))))))))))","v":"SI tu tires il faudra être plus précis"},{"$f":"S48/SUM(M48+O48+S48)*100","v":{"$error":"#DIV/0!"}},{"$f":"IF(AND($U$3=1,U48<$Y$38),$Y$40,IF(AND($U$3=1,U48>=$Y$38),$Y$42,IF(AND($U$3=2,U48<$Z$38),$Z$40,IF(AND($U$3=2,U48>=$Z$38),$Z$42,IF(AND($U$3=3,U48<$AA$38),$AA$40,IF(AND($U$3=3,U48>=$AA$38),$AA$42,IF(AND($U$3=4,U48<$AB$38),$AB$40,IF(AND($U$3=4,U48>=$AB$38),$AB$42,IF(AND($U$3=5,U48<$AC$38),$AC$40,IF(AND($U$3=5,U48>=$AC$38),$AC$42,IF(AND($U$3=6,U48<$AD$38),$AD$40,IF(AND($U$3=6,U48>=$AD$38),$AD$42,IF(AND($U$3=7,U48<$AE$38),$AE$40,IF(AND($U$3=7,U48>=$AE$38),$AE$42,IF(AND($U$3=8,U48<$AF$38),$AF$40,IF(AND($U$3=8,U48>=$AF$38),$AF$42))))))))))))))))","v":{"$error":"#DIV/0!"}},{"$f":"B48","v":0},null,{"$f":"DEBUT!Y48","v":"Vous êtes bien organisé"},{"$f":"DEBUT!Z48","v":"C'est bien vous faites des passes"},{"$f":"DEBUT!AA48","v":"Vous êtes où?"},{"$f":"DEBUT!AB48","v":"Faut se bouger davantage"},{"$f":"DEBUT!AC48","v":"Faut oser tirer"},{"$f":"DEBUT!AD48","v":"Pourquoi vos tirs ne rentrent pas ? "},{"$f":"DEBUT!AE48","v":"SI vous tirez il faudra être plus précis"},{"$f":"DEBUT!AF48","v":"Pas de chance"}]
[null,"Contrats ->",null,null,null,null,null,null,null,null,null,null,null,null,null,null,null,null,null,null,null,null,"<-Contrats "]
[null,{"$f":"EQUIPES!B10","v":0},{"$f":"COUNTIF($C$6:$C$35,B50)","v":0},{"$f":"IF(AND($C$3=1,C50<$Y$38),$Y$40,IF(AND($C$3=1,C50>=$Y$38),$Y$42,IF(AND($C$3=2,C50<$Z$38),$Z$40,IF(AND($C$3=2,C50>=$Z$38),$Z$42,IF(AND($C$3=3,C50<$AA$38),$AA$40,IF(AND($C$3=3,C50>=$AA$38),$AA$42,IF(AND($C$3=4,C50<$AB$38),$AB$40,IF(AND($C$3=4,C50>=$AB$38),$AB$42,IF(AND($C$3=5,C50<$AC$38),$AC$40,IF(AND($C$3=5,C50>=$AC$38),$AC$42,IF(AND($C$3=6,C50<$AD$38),$AD$40,IF(AND($C$3=6,C50>=$AD$38),$AD$42,IF(AND($C$3=7,C50<$AE$38),$AE$40,IF(AND($C$3=7,C50>=$AE$38),$AE$42,IF(AND($C$3=8,C50<$AF$38),$AF$40,IF(AND($C$3=8,C50>=$AF$38),$AF$42))))))))))))))))","v":"C'est bien tu gères la distance"},{"$f":"COUNTIF($E$6:$E$35,B50)","v":0},{"$f":"IF(AND($E$3=1,E50<$Y$38),$Y$40,IF(AND($E$3=1,E50>=$Y$38),$Y$42,IF(AND($E$3=2,E50<$Z$38),$Z$40,IF(AND($E$3=2,E50>=$Z$38),$Z$42,IF(AND($E$3=3,E50<$AA$38),$AA$40,IF(AND($E$3=3,E50>=$AA$38),$AA$42,IF(AND($E$3=4,E50<$AB$38),$AB$40,IF(AND($E$3=4,E50>=$AB$38),$AB$42,IF(AND($E$3=5,E50<$AC$38),$AC$40,IF(AND($E$3=5,E50>=$AC$38),$AC$42,IF(AND($E$3=6,E50<$AD$38),$AD$40,IF(AND($E$3=6,E50>=$AD$38),$AD$42,IF(AND($E$3=7,E50<$AE$38),$AE$40,IF(AND($E$3=7,E50>=$AE$38),$AE$42,IF(AND($E$3=8,E50<$AF$38),$AF$40,IF(AND($E$3=8,E50>=$AF$38),$AF$42))))))))))))))))","v":"Bien tu lèves la tête"},{"$f":"COUNTIF($G$6:$G$35,B50)","v":0},{"$f":"IF(AND($G$3=1,G50<$Y$38),$Y$40,IF(AND($G$3=1,G50>=$Y$38),$Y$42,IF(AND($G$3=2,G50<$Z$38),$Z$40,IF(AND($G$3=2,G50>=$Z$38),$Z$42,IF(AND($G$3=3,G50<$AA$38),$AA$40,IF(AND($G$3=3,G50>=$AA$38),$AA$42,IF(AND($G$3=4,G50<$AB$38),$AB$40,IF(AND($G$3=4,G50>=$AB$38),$AB$42,IF(AND($G$3=5,G50<$AC$38),$AC$40,IF(AND($G$3=5,G50>=$AC$38),$AC$42,IF(AND($G$3=6,G50<$AD$38),$AD$40,IF(AND($G$3=6,G50>=$AD$38),$AD$42,IF(AND($G$3=7,G50<$AE$38),$AE$40,IF(AND($G$3=7,G50>=$AE$38),$AE$42,IF(AND($G$3=8,G50<$AF$38),$AF$40,IF(AND($G$3=8,G50>=$AF$38),$AF$42))))))))))))))))","v":"Tu touches le ballon"},null,{"$f":"IF(AND($I$3=1,I50<$Y$38),$Y$40,IF(AND($I$3=1,I50>=$Y$38),$Y$42,IF(AND($I$3=2,I50<$Z$38),$Z$40,IF(AND($I$3=2,I50>=$Z$38),$Z$42,IF(AND($I$3=3,I50<$AA$38),$AA$40,IF(AND($I$3=3,I50>=$AA$38),$AA$42,IF(AND($I$3=4,I50<$AB$38),$AB$40,IF(AND($I$3=4,I50>=$AB$38),$AB$42,IF(AND($I$3=5,I50<$AC$38),$AC$40,IF(AND($I$3=5,I50>=$AC$38),$AC$42,IF(AND($I$3=6,I50<$AD$38),$AD$40,IF(AND($I$3=6,I50>=$AD$38),$AD$42,IF(AND($I$3=7,I50<$AE$38),$AE$40,IF(AND($I$3=7,I50>=$AE$38),$AE$42,IF(AND($I$3=8,I50<$AF$38),$AF$40,IF(AND($I$3=8,I50>=$AF$38),$AF$42))))))))))))))))","v":{"$error":"#REF!"}},{"$f":"COUNTIF($K$6:$K$35,B50)","v":0},{"$f":"IF(AND($K$3=1,K50<$Y$38),$Y$40,IF(AND($K$3=1,K50>=$Y$38),$Y$42,IF(AND($K$3=2,K50<$Z$38),$Z$40,IF(AND($K$3=2,K50>=$Z$38),$Z$42,IF(AND($K$3=3,K50<$AA$38),$AA$40,IF(AND($K$3=3,K50>=$AA$38),$AA$42,IF(AND($K$3=4,K50<$AB$38),$AB$40,IF(AND($K$3=4,K50>=$AB$38),$AB$42,IF(AND($K$3=5,K50<$AC$38),$AC$40,IF(AND($K$3=5,K50>=$AC$38),$AC$42,IF(AND($K$3=6,K50<$AD$38),$AD$40,IF(AND($K$3=6,K50>=$AD$38),$AD$42,IF(AND($K$3=7,K50<$AE$38),$AE$40,IF(AND($K$3=7,K50>=$AE$38),$AE$42,IF(AND($K$3=8,K50<$AF$38),$AF$40,IF(AND($K$3=8,K50>=$AF$38),$AF$42))))))))))))))))","v":{"$error":"#REF!"}},{"$f":"COUNTIF($M$6:$M$35,B50)","v":0},{"$f":"IF(AND($M$3=1,M50<$Y$38),$Y$40,IF(AND($M$3=1,M50>=$Y$38),$Y$42,IF(AND($M$3=2,M50<$Z$38),$Z$40,IF(AND($M$3=2,M50>=$Z$38),$Z$42,IF(AND($M$3=3,M50<$AA$38),$AA$40,IF(AND($M$3=3,M50>=$AA$38),$AA$42,IF(AND($M$3=4,M50<$AB$38),$AB$40,IF(AND($M$3=4,M50>=$AB$38),$AB$42,IF(AND($M$3=5,M50<$AC$38),$AC$40,IF(AND($M$3=5,M50>=$AC$38),$AC$42,IF(AND($M$3=6,M50<$AD$38),$AD$40,IF(AND($M$3=6,M50>=$AD$38),$AD$42,IF(AND($M$3=7,M50<$AE$38),$AE$40,IF(AND($M$3=7,M50>=$AE$38),$AE$42,IF(AND($M$3=8,M50<$AF$38),$AF$40,IF(AND($M$3=8,M50>=$AF$38),$AF$42))))))))))))))))","v":"Faut oser tirer"},{"$f":"COUNTIF($O$6:$O$35,B50)","v":0},{"$f":"IF(AND($O$3=1,O50<$Y$38),$Y$40,IF(AND($O$3=1,O50>=$Y$38),$Y$42,IF(AND($O$3=2,O50<$Z$38),$Z$40,IF(AND($O$3=2,O50>=$Z$38),$Z$42,IF(AND($O$3=3,O50<$AA$38),$AA$40,IF(AND($O$3=3,O50>=$AA$38),$AA$42,IF(AND($O$3=4,O50<$AB$38),$AB$40,IF(AND($O$3=4,O50>=$AB$38),$AB$42,IF(AND($O$3=5,O50<$AC$38),$AC$40,IF(AND($O$3=5,O50>=$AC$38),$AC$42,IF(AND($O$3=6,O50<$AD$38),$AD$40,IF(AND($O$3=6,O50>=$AD$38),$AD$42,IF(AND($O$3=7,O50<$AE$38),$AE$40,IF(AND($O$3=7,O50>=$AE$38),$AE$42,IF(AND($O$3=8,O50<$AF$38),$AF$40,IF(AND($O$3=8,O50>=$AF$38),$AF$42))))))))))))))))","v":"Pourquoi tes tirs ne rentrent pas ?"},{"$f":"COUNTIF($Q$6:$Q$35,B50)","v":0},{"$f":"IF(AND($Q$3=1,Q50<$Y$38),$Y$40,IF(AND($Q$3=1,Q50>=$Y$38),$Y$42,IF(AND($Q$3=2,Q50<$Z$38),$Z$40,IF(AND($Q$3=2,Q50>=$Z$38),$Z$42,IF(AND($Q$3=3,Q50<$AA$38),$AA$40,IF(AND($Q$3=3,Q50>=$AA$38),$AA$42,IF(AND($Q$3=4,Q50<$AB$38),$AB$40,IF(AND($Q$3=4,Q50>=$AB$38),$AB$42,IF(AND($Q$3=5,Q50<$AC$38),$AC$40,IF(AND($Q$3=5,Q50>=$AC$38),$AC$42,IF(AND($Q$3=6,Q50<$AD$38),$AD$40,IF(AND($Q$3=6,Q50>=$AD$38),$AD$42,IF(AND($Q$3=7,Q50<$AE$38),$AE$40,IF(AND($Q$3=7,Q50>=$AE$38),$AE$42,IF(AND($Q$3=8,Q50<$AF$38),$AF$40,IF(AND($Q$3=8,Q50>=$AF$38),$AF$42))))))))))))))))","v":{"$error":"#REF!"}},{"$f":"COUNTIF($S$6:$S$35,B50)","v":0},{"$f":"IF(AND($S$3=1,S50<$Y$38),$Y$40,IF(AND($S$3=1,S50>=$Y$38),$Y$42,IF(AND($S$3=2,S50<$Z$38),$Z$40,IF(AND($S$3=2,S50>=$Z$38),$Z$42,IF(AND($S$3=3,S50<$AA$38),$AA$40,IF(AND($S$3=3,S50>=$AA$38),$AA$42,IF(AND($S$3=4,S50<$AB$38),$AB$40,IF(AND($S$3=4,S50>=$AB$38),$AB$42,IF(AND($S$3=5,S50<$AC$38),$AC$40,IF(AND($S$3=5,S50>=$AC$38),$AC$42,IF(AND($S$3=6,S50<$AD$38),$AD$40,IF(AND($S$3=6,S50>=$AD$38),$AD$42,IF(AND($S$3=7,S50<$AE$38),$AE$40,IF(AND($S$3=7,S50>=$AE$38),$AE$42,IF(AND($S$3=8,S50<$AF$38),$AF$40,IF(AND($S$3=8,S50>=$AF$38),$AF$42))))))))))))))))","v":"SI tu tires il faudra être plus précis"},{"$f":"S50/SUM(M50+O50+S50)*100","v":{"$error":"#DIV/0!"}},{"$f":"IF(AND($U$3=1,U50<$Y$38),$Y$40,IF(AND($U$3=1,U50>=$Y$38),$Y$42,IF(AND($U$3=2,U50<$Z$38),$Z$40,IF(AND($U$3=2,U50>=$Z$38),$Z$42,IF(AND($U$3=3,U50<$AA$38),$AA$40,IF(AND($U$3=3,U50>=$AA$38),$AA$42,IF(AND($U$3=4,U50<$AB$38),$AB$40,IF(AND($U$3=4,U50>=$AB$38),$AB$42,IF(AND($U$3=5,U50<$AC$38),$AC$40,IF(AND($U$3=5,U50>=$AC$38),$AC$42,IF(AND($U$3=6,U50<$AD$38),$AD$40,IF(AND($U$3=6,U50>=$AD$38),$AD$42,IF(AND($U$3=7,U50<$AE$38),$AE$40,IF(AND($U$3=7,U50>=$AE$38),$AE$42,IF(AND($U$3=8,U50<$AF$38),$AF$40,IF(AND($U$3=8,U50>=$AF$38),$AF$42))))))))))))))))","v":{"$error":"#DIV/0!"}},{"$f":"B50","v":0},null,{"$f":"DEBUT!Y50","v":"Trop de fautes collectives"},{"$f":"DEBUT!Z50","v":"Trop de ballons perdus"},{"$f":"DEBUT!AA50","v":"Bonne activité collective"},{"$f":"DEBUT!AB50","v":"Bien harcelé"},{"$f":"DEBUT!AC50","v":"Bien essayé mais faudra travailler l'adresse"},{"$f":"DEBUT!AD50","v":"On va travailler la précision"},{"$f":"DEBUT!AE50","v":"Joli"},{"$f":"DEBUT!AF50","v":"Bien visé"}]
[null,"Contrats ->",null,null,null,null,null,null,null,null,null,null,null,null,null,null,null,null,null,null,null,null,"<-Contrats "]
[null,{"$f":"EQUIPES!B11","v":"Emmanuel"},{"$f":"COUNTIF($C$6:$C$35,B52)","v":0},{"$f":"IF(AND($C$3=1,C52<$Y$38),$Y$40,IF(AND($C$3=1,C52>=$Y$38),$Y$42,IF(AND($C$3=2,C52<$Z$38),$Z$40,IF(AND($C$3=2,C52>=$Z$38),$Z$42,IF(AND($C$3=3,C52<$AA$38),$AA$40,IF(AND($C$3=3,C52>=$AA$38),$AA$42,IF(AND($C$3=4,C52<$AB$38),$AB$40,IF(AND($C$3=4,C52>=$AB$38),$AB$42,IF(AND($C$3=5,C52<$AC$38),$AC$40,IF(AND($C$3=5,C52>=$AC$38),$AC$42,IF(AND($C$3=6,C52<$AD$38),$AD$40,IF(AND($C$3=6,C52>=$AD$38),$AD$42,IF(AND($C$3=7,C52<$AE$38),$AE$40,IF(AND($C$3=7,C52>=$AE$38),$AE$42,IF(AND($C$3=8,C52<$AF$38),$AF$40,IF(AND($C$3=8,C52>=$AF$38),$AF$42))))))))))))))))","v":"C'est bien tu gères la distance"},{"$f":"COUNTIF($E$6:$E$35,B52)","v":0},{"$f":"IF(AND($E$3=1,E52<$Y$38),$Y$40,IF(AND($E$3=1,E52>=$Y$38),$Y$42,IF(AND($E$3=2,E52<$Z$38),$Z$40,IF(AND($E$3=2,E52>=$Z$38),$Z$42,IF(AND($E$3=3,E52<$AA$38),$AA$40,IF(AND($E$3=3,E52>=$AA$38),$AA$42,IF(AND($E$3=4,E52<$AB$38),$AB$40,IF(AND($E$3=4,E52>=$AB$38),$AB$42,IF(AND($E$3=5,E52<$AC$38),$AC$40,IF(AND($E$3=5,E52>=$AC$38),$AC$42,IF(AND($E$3=6,E52<$AD$38),$AD$40,IF(AND($E$3=6,E52>=$AD$38),$AD$42,IF(AND($E$3=7,E52<$AE$38),$AE$40,IF(AND($E$3=7,E52>=$AE$38),$AE$42,IF(AND($E$3=8,E52<$AF$38),$AF$40,IF(AND($E$3=8,E52>=$AF$38),$AF$42))))))))))))))))","v":"Bien tu lèves la tête"},{"$f":"COUNTIF($G$6:$G$35,B52)","v":0},{"$f":"IF(AND($G$3=1,G52<$Y$38),$Y$40,IF(AND($G$3=1,G52>=$Y$38),$Y$42,IF(AND($G$3=2,G52<$Z$38),$Z$40,IF(AND($G$3=2,G52>=$Z$38),$Z$42,IF(AND($G$3=3,G52<$AA$38),$AA$40,IF(AND($G$3=3,G52>=$AA$38),$AA$42,IF(AND($G$3=4,G52<$AB$38),$AB$40,IF(AND($G$3=4,G52>=$AB$38),$AB$42,IF(AND($G$3=5,G52<$AC$38),$AC$40,IF(AND($G$3=5,G52>=$AC$38),$AC$42,IF(AND($G$3=6,G52<$AD$38),$AD$40,IF(AND($G$3=6,G52>=$AD$38),$AD$42,IF(AND($G$3=7,G52<$AE$38),$AE$40,IF(AND($G$3=7,G52>=$AE$38),$AE$42,IF(AND($G$3=8,G52<$AF$38),$AF$40,IF(AND($G$3=8,G52>=$AF$38),$AF$42))))))))))))))))","v":"Tu touches le ballon"},null,{"$f":"IF(AND($I$3=1,I52<$Y$38),$Y$40,IF(AND($I$3=1,I52>=$Y$38),$Y$42,IF(AND($I$3=2,I52<$Z$38),$Z$40,IF(AND($I$3=2,I52>=$Z$38),$Z$42,IF(AND($I$3=3,I52<$AA$38),$AA$40,IF(AND($I$3=3,I52>=$AA$38),$AA$42,IF(AND($I$3=4,I52<$AB$38),$AB$40,IF(AND($I$3=4,I52>=$AB$38),$AB$42,IF(AND($I$3=5,I52<$AC$38),$AC$40,IF(AND($I$3=5,I52>=$AC$38),$AC$42,IF(AND($I$3=6,I52<$AD$38),$AD$40,IF(AND($I$3=6,I52>=$AD$38),$AD$42,IF(AND($I$3=7,I52<$AE$38),$AE$40,IF(AND($I$3=7,I52>=$AE$38),$AE$42,IF(AND($I$3=8,I52<$AF$38),$AF$40,IF(AND($I$3=8,I52>=$AF$38),$AF$42))))))))))))))))","v":{"$error":"#REF!"}},{"$f":"COUNTIF($K$6:$K$35,B52)","v":0},{"$f":"IF(AND($K$3=1,K52<$Y$38),$Y$40,IF(AND($K$3=1,K52>=$Y$38),$Y$42,IF(AND($K$3=2,K52<$Z$38),$Z$40,IF(AND($K$3=2,K52>=$Z$38),$Z$42,IF(AND($K$3=3,K52<$AA$38),$AA$40,IF(AND($K$3=3,K52>=$AA$38),$AA$42,IF(AND($K$3=4,K52<$AB$38),$AB$40,IF(AND($K$3=4,K52>=$AB$38),$AB$42,IF(AND($K$3=5,K52<$AC$38),$AC$40,IF(AND($K$3=5,K52>=$AC$38),$AC$42,IF(AND($K$3=6,K52<$AD$38),$AD$40,IF(AND($K$3=6,K52>=$AD$38),$AD$42,IF(AND($K$3=7,K52<$AE$38),$AE$40,IF(AND($K$3=7,K52>=$AE$38),$AE$42,IF(AND($K$3=8,K52<$AF$38),$AF$40,IF(AND($K$3=8,K52>=$AF$38),$AF$42))))))))))))))))","v":{"$error":"#REF!"}},{"$f":"COUNTIF($M$6:$M$35,B52)","v":0},{"$f":"IF(AND($M$3=1,M52<$Y$38),$Y$40,IF(AND($M$3=1,M52>=$Y$38),$Y$42,IF(AND($M$3=2,M52<$Z$38),$Z$40,IF(AND($M$3=2,M52>=$Z$38),$Z$42,IF(AND($M$3=3,M52<$AA$38),$AA$40,IF(AND($M$3=3,M52>=$AA$38),$AA$42,IF(AND($M$3=4,M52<$AB$38),$AB$40,IF(AND($M$3=4,M52>=$AB$38),$AB$42,IF(AND($M$3=5,M52<$AC$38),$AC$40,IF(AND($M$3=5,M52>=$AC$38),$AC$42,IF(AND($M$3=6,M52<$AD$38),$AD$40,IF(AND($M$3=6,M52>=$AD$38),$AD$42,IF(AND($M$3=7,M52<$AE$38),$AE$40,IF(AND($M$3=7,M52>=$AE$38),$AE$42,IF(AND($M$3=8,M52<$AF$38),$AF$40,IF(AND($M$3=8,M52>=$AF$38),$AF$42))))))))))))))))","v":"Faut oser tirer"},{"$f":"COUNTIF($O$6:$O$35,B52)","v":0},{"$f":"IF(AND($O$3=1,O52<$Y$38),$Y$40,IF(AND($O$3=1,O52>=$Y$38),$Y$42,IF(AND($O$3=2,O52<$Z$38),$Z$40,IF(AND($O$3=2,O52>=$Z$38),$Z$42,IF(AND($O$3=3,O52<$AA$38),$AA$40,IF(AND($O$3=3,O52>=$AA$38),$AA$42,IF(AND($O$3=4,O52<$AB$38),$AB$40,IF(AND($O$3=4,O52>=$AB$38),$AB$42,IF(AND($O$3=5,O52<$AC$38),$AC$40,IF(AND($O$3=5,O52>=$AC$38),$AC$42,IF(AND($O$3=6,O52<$AD$38),$AD$40,IF(AND($O$3=6,O52>=$AD$38),$AD$42,IF(AND($O$3=7,O52<$AE$38),$AE$40,IF(AND($O$3=7,O52>=$AE$38),$AE$42,IF(AND($O$3=8,O52<$AF$38),$AF$40,IF(AND($O$3=8,O52>=$AF$38),$AF$42))))))))))))))))","v":"Pourquoi tes tirs ne rentrent pas ?"},{"$f":"COUNTIF($Q$6:$Q$35,B52)","v":0},{"$f":"IF(AND($Q$3=1,Q52<$Y$38),$Y$40,IF(AND($Q$3=1,Q52>=$Y$38),$Y$42,IF(AND($Q$3=2,Q52<$Z$38),$Z$40,IF(AND($Q$3=2,Q52>=$Z$38),$Z$42,IF(AND($Q$3=3,Q52<$AA$38),$AA$40,IF(AND($Q$3=3,Q52>=$AA$38),$AA$42,IF(AND($Q$3=4,Q52<$AB$38),$AB$40,IF(AND($Q$3=4,Q52>=$AB$38),$AB$42,IF(AND($Q$3=5,Q52<$AC$38),$AC$40,IF(AND($Q$3=5,Q52>=$AC$38),$AC$42,IF(AND($Q$3=6,Q52<$AD$38),$AD$40,IF(AND($Q$3=6,Q52>=$AD$38),$AD$42,IF(AND($Q$3=7,Q52<$AE$38),$AE$40,IF(AND($Q$3=7,Q52>=$AE$38),$AE$42,IF(AND($Q$3=8,Q52<$AF$38),$AF$40,IF(AND($Q$3=8,Q52>=$AF$38),$AF$42))))))))))))))))","v":{"$error":"#REF!"}},{"$f":"COUNTIF($S$6:$S$35,B52)","v":0},{"$f":"IF(AND($S$3=1,S52<$Y$38),$Y$40,IF(AND($S$3=1,S52>=$Y$38),$Y$42,IF(AND($S$3=2,S52<$Z$38),$Z$40,IF(AND($S$3=2,S52>=$Z$38),$Z$42,IF(AND($S$3=3,S52<$AA$38),$AA$40,IF(AND($S$3=3,S52>=$AA$38),$AA$42,IF(AND($S$3=4,S52<$AB$38),$AB$40,IF(AND($S$3=4,S52>=$AB$38),$AB$42,IF(AND($S$3=5,S52<$AC$38),$AC$40,IF(AND($S$3=5,S52>=$AC$38),$AC$42,IF(AND($S$3=6,S52<$AD$38),$AD$40,IF(AND($S$3=6,S52>=$AD$38),$AD$42,IF(AND($S$3=7,S52<$AE$38),$AE$40,IF(AND($S$3=7,S52>=$AE$38),$AE$42,IF(AND($S$3=8,S52<$AF$38),$AF$40,IF(AND($S$3=8,S52>=$AF$38),$AF$42))))))))))))))))","v":"SI tu tires il faudra être plus précis"},{"$f":"S52/SUM(M52+O52+S52)*100","v":{"$error":"#DIV/0!"}},{"$f":"IF(AND($U$3=1,U52<$Y$38),$Y$40,IF(AND($U$3=1,U52>=$Y$38),$Y$42,IF(AND($U$3=2,U52<$Z$38),$Z$40,IF(AND($U$3=2,U52>=$Z$38),$Z$42,IF(AND($U$3=3,U52<$AA$38),$AA$40,IF(AND($U$3=3,U52>=$AA$38),$AA$42,IF(AND($U$3=4,U52<$AB$38),$AB$40,IF(AND($U$3=4,U52>=$AB$38),$AB$42,IF(AND($U$3=5,U52<$AC$38),$AC$40,IF(AND($U$3=5,U52>=$AC$38),$AC$42,IF(AND($U$3=6,U52<$AD$38),$AD$40,IF(AND($U$3=6,U52>=$AD$38),$AD$42,IF(AND($U$3=7,U52<$AE$38),$AE$40,IF(AND($U$3=7,U52>=$AE$38),$AE$42,IF(AND($U$3=8,U52<$AF$38),$AF$40,IF(AND($U$3=8,U52>=$AF$38),$AF$42))))))))))))))))","v":{"$error":"#DIV/0!"}},{"$f":"B52","v":"Emmanuel"}]
[null,"Contrats ->",null,null,null,null,null,null,null,null,0,null,null,null,null,null,null,null,null,null,null,null,"<-Contrats "]
[]
[null,{"$f":"B36","v":"ORANGE"},{"$f":"C36","v":0},"Vous êtes bien organisé",0,"C'est bien vous faites des passes",0,"Vous êtes où?",0,{"$error":"#REF!"},0,{"$error":"#REF!"},0,"Faut oser tirer",0,"Pourquoi vos tirs ne rentrent pas ? ",0,{"$error":"#REF!"},0,"SI vous tirez il faudra être plus précis",{"$error":"#DIV/0!"},"Pas de chance"]
[null,"Contrats ->"]
[]
[null,"EQUIPE","FAUTES\n/POSSESSION",null,"PERTE DE BALLE\n/POSSESSION",null,null,null,null,null,"RECUPERATION\n/POSSESSION",null,null,null,"TIR\n/POSSESSION",null,"CONTRE ATTAQUE\n/POSSESSION",null,"PANIER\n/POSSESSION",null,"TIR REUSSI\n/TIR TENTE",null,null,null,"FAUTES/POSSESSION","PERTE DE BALLE /POSSESSION","RECUPERATION /POSSESSION","CONTRE ATTAQUE /POSSESSION","ATTEINTE ZONE AVANT /POSSESSION","TIR REUSSI / TIR TENTE","TIR /POSSESSION","PANIER /POSSESSION"]
[null,{"$f":"B55","v":"ORANGE"},{"$f":"C55/G5","v":{"$error":"#DIV/0!"}},{"$f":"IF(C59>Y60,Y64,Y62)","v":{"$error":"#DIV/0!"}},{"$f":"#REF!/G5","v":{"$error":"#REF!"}},{"$f":"IF(E59>Z60,Z64,Z62)","v":{"$error":"#REF!"}},null,null,null,null,{"$f":"K55/K35","v":{"$error":"#DIV/0!"}},{"$f":"IF(K59>AA60,AA64,AA62)","v":{"$error":"#DIV/0!"}},null,null,{"$f":"O55/G5","v":{"$error":"#DIV/0!"}},{"$f":"IF(O59>AE60,AE64,AE62)","v":{"$error":"#DIV/0!"}},null,null,{"$f":"S55/G5","v":{"$error":"#DIV/0!"}},{"$f":"IF(S59>AF60,AF64,AF62)","v":{"$error":"#DIV/0!"}},{"$f":"S55/(M55+O55+S55)","v":{"$error":"#DIV/0!"}},{"$f":"IF(U59>AD60,AD64,AD62)","v":{"$error":"#DIV/0!"}}]
[null,"Contrats ->",null,null,null,null,null,null,null,null,null,null,null,null,null,null,null,null,null,null,null,null,null,null,0.05,0.1,0.2,0.5,null,0.3,0.5,0.3]
[null,"PROFILS DE JEU ET SITUATIONS A TRAVAILLER"]
[null,null,"MON POINT FORT",null,"MON POINT FAIBLE",null,"JE VEUX TRAVAILLER …",null,null,null,"SITUATIONS A TRAVAILLER n°",null,"Nom de la situation A TRAVAILLER",null,null,null,null,null,"PROFIL DE JEU DE NOTRE EQUIPE",null,"Nom de la SITUATION A TRAVAILLER",null,null,null,"Bonne maitrise","c'est bien vous demandez le ballon","Allez on s'organise un peu","Dès récupération du ballon il faut s'organiser ensemble","Trop de ballons perdus","Manque d'adresse","Chaque action devrait aboutir à un bon tir","Il faut shooter plus"]
[null,{"$f":"B38","v":"Alexis F."},"TIR",null,"DEFENSE INDIVIDUELLE",null,"PASSE",null,null,null,{"$f":"VLOOKUP(C63,#REF!,4,TRUE)","v":{"$error":"#REF!"}},null,{"$f":"VLOOKUP(G63,DEBUT!$R$3:$V$12,2,FALSE)","v":{"$error":"#N/A"}},null,null,null,null,null,"Contre attaque",null,{"$f":"VLOOKUP(S63,DEBUT!R13:V26,2,FALSE)","v":{"$error":"#N/A"}}]
[null,{"$f":"B40","v":0},"PASSE",null,"DEFENSE INDIVIDUELLE",null,"TIR",null,null,null,{"$f":"VLOOKUP(C64,#REF!,4,TRUE)","v":{"$error":"#REF!"}},null,{"$f":"VLOOKUP(G64,DEBUT!$R$3:$V$12,2,FALSE)","v":{"$error":"#N/A"}},null,null,null,null,null,null,null,null,null,null,null,"Faut se calmer","Trop de ballon perdu : faut lever la t^te","ça défend bien","ça va vite chez vous","Maintenant il faut réussir à tirer","Oh mais c'est Golden State","C'est bien mais faut travailler l'adresse","Efficacité"]
[null,{"$f":"B42","v":0},null,null,"DEFENSE INDIVIDUELLE",null,"TIR",null,null,null,{"$f":"VLOOKUP(C65,#REF!,4,TRUE)","v":{"$error":"#REF!"}},null,{"$f":"VLOOKUP(G65,DEBUT!$R$3:$V$12,2,FALSE)","v":{"$error":"#N/A"}}]
[null,{"$f":"B44","v":0},null,null,"DEFENSE INDIVIDUELLE",null,"TIR",null,null,null,{"$f":"VLOOKUP(C66,#REF!,4,TRUE)","v":{"$error":"#REF!"}},null,{"$f":"VLOOKUP(G66,DEBUT!$R$3:$V$12,2,FALSE)","v":{"$error":"#N/A"}}]
[null,{"$f":"B46","v":0},null,null,"DEFENSE INDIVIDUELLE",null,"TIR",null,null,null,{"$f":"VLOOKUP(C67,#REF!,4,TRUE)","v":{"$error":"#REF!"}},null,{"$f":"VLOOKUP(G67,DEBUT!$R$3:$V$12,2,FALSE)","v":{"$error":"#N/A"}}]
[null,{"$f":"B48","v":0},null,null,"DEFENSE INDIVIDUELLE",null,"TIR",null,null,null,{"$f":"VLOOKUP(C68,#REF!,4,TRUE)","v":{"$error":"#REF!"}},null,{"$f":"VLOOKUP(G68,DEBUT!$R$3:$V$12,2,FALSE)","v":{"$error":"#N/A"}}]
[null,{"$f":"B50","v":0},null,null,"DEFENSE INDIVIDUELLE",null,"TIR",null,null,null,{"$f":"VLOOKUP(C69,#REF!,4,TRUE)","v":{"$error":"#REF!"}},null,{"$f":"VLOOKUP(G69,DEBUT!$R$3:$V$12,2,FALSE)","v":{"$error":"#N/A"}}]
[null,{"$f":"B52","v":"Emmanuel"},null,null,"DEFENSE INDIVIDUELLE",null,"TIR",null,null,null,{"$f":"VLOOKUP(C70,#REF!,4,TRUE)","v":{"$error":"#REF!"}},null,{"$f":"VLOOKUP(G70,DEBUT!$R$3:$V$12,2,FALSE)","v":{"$error":"#N/A"}}]
[]
[null,null,null,"Le profil de jeu peut être choisi par l'élève à partir de l'analyse de ses stats ou alors à partir d'une formule du type : si TIR = 0 alors travailler SA1"]

{"sheet":"OBS4","index":5,"n_rows":72,"n_cols":34,"rows_kept":72,"cut":false,"hidden":false,"merged":[[66,2,66,3],[66,4,66,5],[66,6,66,7],[66,10,66,11],[66,12,66,14],[69,2,69,3],[69,4,69,5],[69,6,69,7],[69,10,69,11],[69,12,69,14],[67,2,67,3],[67,4,67,5],[67,6,67,7],[67,10,67,11],[67,12,67,14],[68,2,68,3],[68,4,68,5],[68,6,68,7],[68,10,68,11],[68,12,68,14],[63,30,64,30],[63,2,63,3],[63,4,63,5],[63,6,63,7],[63,10,63,11],[63,12,63,14],[63,24,64,24],[65,2,65,3],[65,4,65,5],[65,6,65,7],[65,10,65,11],[65,12,65,14],[64,4,64,5],[64,6,64,7],[64,10,64,11],[64,12,64,14],[63,25,64,25],[63,26,64,26],[63,27,64,27],[63,28,64,28],[63,29,64,29],[61,29,62,29],[61,30,62,30],[61,31,62,31],[62,2,62,3],[62,4,62,5],[62,6,62,7],[62,10,62,11],[62,12,62,14],[62,18,69,19],[62,20,69,21],[61,20,61,21],[61,24,62,24],[61,25,62,25],[61,26,62,26],[61,27,62,27],[61,28,62,28],[61,2,61,3],[61,4,61,5],[61,6,61,7],[61,10,61,11],[61,12,61,14],[61,18,61,19],[63,31,64,31],[64,2,64,3],[59,27,60,27],[59,28,60,28],[59,29,60,29],[59,30,60,30],[59,31,60,31],[60,1,60,21],[58,17,59,17],[58,19,59,19],[58,21,59,21],[59,24,60,24],[59,25,60,25],[59,26,60,26],[57,29,58,29],[57,30,58,30],[57,31,58,31],[58,3,59,3],[58,5,59,5],[58,7,59,7],[58,9,59,9],[58,11,59,11],[58,13,59,13],[58,15,59,15],[57,20,57,21],[57,24,58,24],[57,25,58,25],[57,26,58,26],[57,27,58,27],[57,28,58,28],[54,21,55,21],[57,2,57,3],[57,4,57,5],[57,6,57,7],[57,8,57,9],[57,10,57,11],[57,12,57,13],[57,14,57,15],[57,16,57,17],[57,18,57,19],[54,3,55,3],[54,5,55,5],[54,7,55,7],[54,9,55,9],[54,11,55,11],[54,13,55,13],[54,15,55,15],[54,17,55,17],[54,19,55,19],[47,19,48,19],[47,21,48,21],[47,24,48,24],[49,21,50,21],[51,3,52,3],[51,5,52,5],[51,7,52,7],[51,9,52,9],[51,11,52,11],[51,13,52,13],[51,15,52,15],[51,17,52,17],[51,19,52,19],[51,21,52,21],[49,3,50,3],[49,5,50,5],[49,7,50,7],[49,9,50,9],[49,11,50,11],[49,13,50,13],[49,15,50,15],[49,17,50,17],[49,19,50,19],[45,29,46,29],[45,30,46,30],[45,31,46,31],[47,3,48,3],[47,5,48,5],[47,7,48,7],[47,9,48,9],[47,11,48,11],[45,17,46,17],[45,19,46,19],[45,21,46,21],[45,24,46,24],[45,25,46,25],[45,26,46,26],[47,31,48,31],[47,25,48,25],[47,26,48,26],[47,27,48,27],[47,28,48,28],[47,29,48,29],[47,30,48,30],[47,13,48,13],[47,15,48,15],[47,17,48,17],[45,3,46,3],[45,5,46,5],[45,7,46,7],[45,9,46,9],[45,11,46,11],[45,13,46,13],[45,15,46,15],[45,27,46,27],[45,28,46,28],[41,30,42,30],[41,31,42,31],[43,3,44,3],[43,5,44,5],[43,7,44,7],[43,9,44,9],[43,11,44,11],[43,13,44,13],[43,15,44,15],[41,21,42,21],[41,24,42,24],[41,25,42,25],[41,26,42,26],[41,27,42,27],[41,28,42,28],[43,17,44,17],[43,19,44,19],[43,21,44,21],[37,24,38,24],[39,31,40,31],[41,3,42,3],[41,5,42,5],[41,7,42,7],[41,9,42,9],[41,11,42,11],[41,13,42,13],[41,15,42,15],[41,17,42,17],[41,19,42,19],[39,25,40,25],[39,26,40,26],[39,27,40,27],[39,28,40,28],[39,29,40,29],[39,30,40,30],[39,13,40,13],[39,15,40,15],[39,17,40,17],[39,19,40,19],[39,21,40,21],[39,24,40,24],[41,29,42,29],[35,3,36,3],[39,3,40,3],[39,5,40,5],[39,7,40,7],[39,9,40,9],[39,11,40,11],[37,17,38,17],[37,19,38,19],[37,21,38,21],[33,20,33,21],[35,29,36,29],[35,30,36,30],[35,31,36,31],[37,3,38,3],[37,5,38,5],[37,7,38,7],[37,9,38,9],[37,11,38,11],[37,13,38,13],[37,15,38,15],[35,21,36,21],[35,24,36,24],[35,25,36,25],[35,26,36,26],[35,27,36,27],[35,28,36,28],[37,27,38,27],[37,28,38,28],[37,29,38,29],[37,30,38,30],[37,31,38,31],[37,25,38,25],[37,26,38,26],[34,8,34,9],[34,10,34,11],[34,12,34,13],[34,14,34,15],[34,16,34,17],[34,18,34,19],[35,5,36,5],[35,7,36,7],[35,9,36,9],[35,11,36,11],[35,13,36,13],[35,15,36,15],[35,17,36,17],[35,19,36,19],[33,2,33,3],[33,4,33,5],[33,6,33,7],[33,12,33,13],[33,14,33,15],[33,18,33,19],[34,20,34,21],[31,20,31,21],[32,2,32,3],[32,4,32,5],[32,6,32,7],[32,12,32,13],[32,14,32,15],[32,18,32,19],[32,20,32,21],[31,2,31,3],[31,4,31,5],[31,6,31,7],[31,12,31,13],[31,14,31,15],[31,18,31,19],[34,2,34,3],[34,4,34,5],[34,6,34,7],[29,20,29,21],[30,2,30,3],[30,4,30,5],[30,6,30,7],[30,12,30,13],[30,14,30,15],[30,18,30,19],[30,20,30,21],[29,2,29,3],[29,4,29,5],[29,6,29,7],[29,12,29,13],[29,14,29,15],[29,18,29,19],[27,20,27,21],[28,2,28,3],[28,4,28,5],[28,6,28,7],[28,12,28,13],[28,14,28,15],[28,18,28,19],[28,20,28,21],[27,2,27,3],[27,4,27,5],[27,6,27,7],[27,12,27,13],[27,14,27,15],[27,18,27,19],[25,20,25,21],[26,2,26,3],[26,4,26,5],[26,6,26,7],[26,12,26,13],[26,14,26,15],[26,18,26,19],[26,20,26,21],[25,2,25,3],[25,4,25,5],[25,6,25,7],[25,12,25,13],[25,14,25,15],[25,18,25,19],[23,20,23,21],[24,2,24,3],[24,4,24,5],[24,6,24,7],[24,12,24,13],[24,14,24,15],[24,18,24,19],[24,20,24,21],[23,2,23,3],[23,4,23,5],[23,6,23,7],[23,12,23,13],[23,14,23,15],[23,18,23,19],[21,20,21,21],[22,2,22,3],[22,4,22,5],[22,6,22,7],[22,12,22,13],[22,14,22,15],[22,18,22,19],[22,20,22,21],[21,2,21,3],[21,4,21,5],[21,6,21,7],[21,12,21,13],[21,14,21,15],[21,18,21,19],[19,20,19,21],[20,2,20,3],[20,4,20,5],[20,6,20,7],[20,12,20,13],[20,14,20,15],[20,18,20,19],[20,20,20,21],[19,2,19,3],[19,4,19,5],[19,6,19,7],[19,12,19,13],[19,14,19,15],[19,18,19,19],[17,20,17,21],[18,2,18,3],[18,4,18,5],[18,6,18,7],[18,12,18,13],[18,14,18,15],[18,18,18,19],[18,20,18,21],[17,2,17,3],[17,4,17,5],[17,6,17,7],[17,12,17,13],[17,14,17,15],[17,18,17,19],[15,20,15,21],[16,2,16,3],[16,4,16,5],[16,6,16,7],[16,12,16,13],[16,14,16,15],[16,18,16,19],[16,20,16,21],[15,2,15,3],[15,4,15,5],[15,6,15,7],[15,12,15,13],[15,14,15,15],[15,18,15,19],[13,20,13,21],[14,2,14,3],[14,4,14,5],[14,6,14,7],[14,12,14,13],[14,14,14,15],[14,18,14,19],[14,20,14,21],[13,2,13,3],[13,4,13,5],[13,6,13,7],[13,12,13,13],[13,14,13,15],[13,18,13,19],[11,20,11,21],[12,2,12,3],[12,4,12,5],[12,6,12,7],[12,12,12,13],[12,14,12,15],[12,18,12,19],[12,20,12,21],[11,2,11,3],[11,4,11,5],[11,6,11,7],[11,12,11,13],[11,14,11,15],[11,18,11,19],[9,20,9,21],[10,2,10,3],[10,4,10,5],[10,6,10,7],[10,12,10,13],[10,14,10,15],[10,18,10,19],[10,20,10,21],[9,2,9,3],[9,4,9,5],[9,6,9,7],[9,12,9,13],[9,14,9,15],[9,18,9,19],[7,20,7,21],[8,2,8,3],[8,4,8,5],[8,6,8,7],[8,12,8,13],[8,14,8,15],[8,18,8,19],[8,20,8,21],[7,2,7,3],[7,4,7,5],[7,6,7,7],[7,12,7,13],[7,14,7,15],[7,18,7,19],[5,20,5,21],[6,2,6,3],[6,4,6,5],[6,6,6,7],[6,12,6,13],[6,14,6,15],[6,18,6,19],[6,20,6,21],[5,2,5,3],[5,4,5,5],[5,6,5,7],[5,12,5,13],[5,14,5,15],[5,18,5,19],[3,16,4,17],[3,18,4,19],[3,20,4,21],[4,6,4,7],[4,8,4,9],[4,10,4,11],[1,3,1,4],[1,14,1,15],[3,2,4,3],[3,4,4,5],[3,6,3,11],[3,12,4,13],[3,14,4,15]]}
[null,"Classe"]
[null,{"$f":"EQUIPES!B2","v":"1TU"},null,{"$f":"EQUIPES!H3","v":"VERT"},null,"score",null,"-",null,null,null,null,null,"score","BLEU"]
[null,null,{"$f":"HLOOKUP(C4,$Y$36:$AF$44,9,FALSE)","v":1},{"$f":"HLOOKUP(D4,$Y$36:$AF$44,9,FALSE)","v":{"$error":"#N/A"}},{"$f":"HLOOKUP(E4,$Y$36:$AF$44,9,FALSE)","v":2},{"$f":"(HLOOKUP(F4,DEBUT!#REF!,9,FALSE))","v":{"$error":"#REF!"}},{"$f":"(HLOOKUP(G4,$Y$36:$AF$44,9,FALSE))","v":3},{"$f":"HLOOKUP(H4,$Y$36:$AF$44,9,FALSE)","v":{"$error":"#N/A"}},{"$f":"(HLOOKUP(I4,DEBUT!#REF!,9,FALSE))","v":{"$error":"#REF!"}},{"$f":"(HLOOKUP(J4,DEBUT!#REF!,9,FALSE))","v":{"$error":"#REF!"}},{"$f":"(HLOOKUP(K4,DEBUT!#REF!,9,FALSE))","v":{"$error":"#REF!"}},{"$f":"(HLOOKUP(L4,DEBUT!#REF!,9,FALSE))","v":{"$error":"#REF!"}},{"$f":"(HLOOKUP(M4,$Y$36:$AF$44,9,FALSE))","v":5},{"$f":"HLOOKUP(N4,$Y$36:$AF$44,9,FALSE)","v":{"$error":"#N/A"}},{"$f":"(HLOOKUP(O4,$Y$36:$AF$44,9,FALSE))","v":6},{"$f":"HLOOKUP(P4,$Y$36:$AF$44,9,FALSE)","v":{"$error":"#N/A"}},{"$f":"(HLOOKUP(Q4,DEBUT!#REF!,9,FALSE))","v":{"$error":"#REF!"}},{"$f":"(HLOOKUP(R4,DEBUT!#REF!,9,FALSE))","v":{"$error":"#REF!"}},{"$f":"(HLOOKUP(S4,$Y$36:$AF$44,9,FALSE))","v":7},{"$f":"HLOOKUP(T4,$Y$36:$AF$44,9,FALSE)","v":{"$error":"#N/A"}},{"$f":"(HLOOKUP(U4,$Y$36:$AF$44,9,FALSE))","v":8},{"$f":"HLOOKUP(V4,$Y$36:$AF$44,9,FALSE)","v":{"$error":"#N/A"}}]
[null,null,{"$f":"'OBS1'!C4","v":"FAUTE"},null,{"$f":"'OBS1'!E4","v":"BALLON PERDU"},null,{"$f":"'OBS1'!G4","v":"POSSESSION"},null,null,null,null,null,{"$f":"'OBS1'!M4","v":"TIRS"},null,{"$f":"'OBS1'!O4","v":"BONS TIRS"},null,"PANIERS",null,{"$f":"'OBS1'!S4","v":"PANIERS"},null,{"$f":"'OBS1'!U4","v":"% REUSSITE"}]
[null,null,null,null,null,null,0]
[null,1,"Gwen"]
[null,2]
[null,3]
[null,4]
[null,5]
[null,6]
[null,7]
[null,8]
[null,9]
[null,10]
[null,11]
[null,12]
[null,13]
[null,14]
[null,15]
[null,16]
[null,17]
[null,18]
[null,19]
[null,20]
[null,21]
[null,22]
[null,23]
[null,24]
[null,25]
[null,26]
[null,27]
[null,28]
[null,29]
[null,30]
[null,{"$f":"D2","v":"VERT"},{"$f":"(SUMPRODUCT(N(ISTEXT(C6:C35))))","v":1},{"$f":"IF(AND($C$3=1,C36<$Y$46),$Y$48,IF(AND($C$3=1,C36>=$Y$46),$Y$50,IF(AND($C$3=2,C36<$Z$46),$Z$48,IF(AND($C$3=2,C36>=$Z$46),$Z$50,IF(AND($C$3=3,C36<$AA$46),$AA$48,IF(AND($C$3=3,C36>=$AA$46),$AA$50,IF(AND($C$3=4,C36<$AB$46),$AB$48,IF(AND($C$3=4,C36>=$AB$46),$AB$50,IF(AND($C$3=5,C36<$AC$46),$AC$48,IF(AND($C$3=5,C36>=$AC$46),$AC$50,IF(AND($C$3=6,C36<$AD$46),$AD$48,IF(AND($C$3=6,C36>=$AD$46),$AD$50,IF(AND($C$3=7,C36<$AE$46),$AE$48,IF(AND($C$3=7,C36>=$AE$46),$AE$50,IF(AND($C$3=8,C36<$AF$46),$AF$48,IF(AND($C$3=8,C36>=$AF$46),$AF$50))))))))))))))))","v":"Vous êtes bien organisé"},{"$f":"(SUMPRODUCT(N(ISTEXT(E6:E35))))","v":0},{"$f":"IF(AND($E$3=1,C36<$Y$46),$Y$48,IF(AND($E$3=1,C36>=$Y$46),$Y$50,IF(AND($E$3=2,C36<$Z$46),$Z$48,IF(AND($E$3=2,C36>=$Z$46),$Z$50,IF(AND($E$3=3,C36<$AA$46),$AA$48,IF(AND($E$3=3,C36>=$AA$46),$AA$50,IF(AND($E$3=4,C36<$AB$46),$AB$48,IF(AND($E$3=4,C36>=$AB$46),$AB$50,IF(AND($E$3=5,C36<$AC$46),$AC$48,IF(AND($E$3=5,C36>=$AC$46),$AC$50,IF(AND($E$3=6,C36<$AD$46),$AD$48,IF(AND($E$3=6,C36>=$AD$46),$AD$50,IF(AND($E$3=7,C36<$AE$46),$AE$48,IF(AND($E$3=7,C36>=$AE$46),$AE$50,IF(AND($E$3=8,C36<$AF$46),$AF$48,IF(AND($E$3=8,C36>=$AF$46),$AF$50))))))))))))))))","v":"C'est bien vous faites des passes"},{"$f":"(SUMPRODUCT(N(ISTEXT(G6:G35))))","v":0},{"$f":"IF(AND($G$3=1,C36<$Y$46),$Y$48,IF(AND($G$3=1,C36>=$Y$46),$Y$50,IF(AND($G$3=2,C36<$Z$46),$Z$48,IF(AND($G$3=2,C36>=$Z$46),$Z$50,IF(AND($G$3=3,C36<$AA$46),$AA$48,IF(AND($G$3=3,C36>=$AA$46),$AA$50,IF(AND($G$3=4,C36<$AB$46),$AB$48,IF(AND($G$3=4,C36>=$AB$46),$AB$50,IF(AND($G$3=5,C36<$AC$46),$AC$48,IF(AND($G$3=5,C36>=$AC$46),$AC$50,IF(AND($G$3=6,C36<$AD$46),$AD$48,IF(AND($G$3=6,C36>=$AD$46),$AD$50,IF(AND($G$3=7,C36<$AE$46),$AE$48,IF(AND($G$3=7,C36>=$AE$46),$AE$50,IF(AND($G$3=8,C36<$AF$46),$AF$48,IF(AND($G$3=8,C36>=$AF$46),$AF$50))))))))))))))))","v":"Vous êtes où?"},{"$f":"(SUMPRODUCT(N(ISTEXT(I6:I35))))","v":0},{"$f":"IF(AND($I$3=1,C36<$Y$46),$Y$48,IF(AND($I$3=1,C36>=$Y$46),$Y$50,IF(AND($I$3=2,C36<$Z$46),$Z$48,IF(AND($I$3=2,C36>=$Z$46),$Z$50,IF(AND($I$3=3,C36<$AA$46),$AA$48,IF(AND($I$3=3,C36>=$AA$46),$AA$50,IF(AND($I$3=4,C36<$AB$46),$AB$48,IF(AND($I$3=4,C36>=$AB$46),$AB$50,IF(AND($I$3=5,C36<$AC$46),$AC$48,IF(AND($I$3=5,C36>=$AC$46),$AC$50,IF(AND($I$3=6,C36<$AD$46),$AD$48,IF(AND($I$3=6,C36>=$AD$46),$AD$50,IF(AND($I$3=7,C36<$AE$46),$AE$48,IF(AND($I$3=7,C36>=$AE$46),$AE$50,IF(AND($I$3=8,C36<$AF$46),$AF$48,IF(AND($I$3=8,C36>=$AF$46),$AF$50))))))))))))))))","v":{"$error":"#REF!"}},{"$f":"(SUMPRODUCT(N(ISTEXT(K6:K35))))","v":0},{"$f":"IF(AND($K$3=1,C36<$Y$46),$Y$48,IF(AND($K$3=1,C36>=$Y$46),$Y$50,IF(AND($K$3=2,C36<$Z$46),$Z$48,IF(AND($K$3=2,C36>=$Z$46),$Z$50,IF(AND($K$3=3,C36<$AA$46),$AA$48,IF(AND($K$3=3,C36>=$AA$46),$AA$50,IF(AND($K$3=4,C36<$AB$46),$AB$48,IF(AND($K$3=4,C36>=$AB$46),$AB$50,IF(AND($K$3=5,C36<$AC$46),$AC$48,IF(AND($K$3=5,C36>=$AC$46),$AC$50,IF(AND($K$3=6,C36<$AD$46),$AD$48,IF(AND($K$3=6,C36>=$AD$46),$AD$50,IF(AND($K$3=7,C36<$AE$46),$AE$48,IF(AND($K$3=7,C36>=$AE$46),$AE$50,IF(AND($K$3=8,C36<$AF$46),$AF$48,IF(AND($K$3=8,C36>=$AF$46),$AF$50))))))))))))))))","v":{"$error":"#REF!"}},{"$f":"(SUMPRODUCT(N(ISTEXT(M6:M35))))","v":0},{"$f":"IF(AND($M$3=1,C36<$Y$46),$Y$48,IF(AND($M$3=1,C36>=$Y$46),$Y$50,IF(AND($M$3=2,C36<$Z$46),$Z$48,IF(AND($M$3=2,C36>=$Z$46),$Z$50,IF(AND($M$3=3,C36<$AA$46),$AA$48,IF(AND($M$3=3,C36>=$AA$46),$AA$50,IF(AND($M$3=4,C36<$AB$46),$AB$48,IF(AND($M$3=4,C36>=$AB$46),$AB$50,IF(AND($M$3=5,C36<$AC$46),$AC$48,IF(AND($M$3=5,C36>=$AC$46),$AC$50,IF(AND($M$3=6,C36<$AD$46),$AD$48,IF(AND($M$3=6,C36>=$AD$46),$AD$50,IF(AND($M$3=7,C36<$AE$46),$AE$48,IF(AND($M$3=7,C36>=$AE$46),$AE$50,IF(AND($M$3=8,C36<$AF$46),$AF$48,IF(AND($M$3=8,C36>=$AF$46),$AF$50))))))))))))))))","v":"Faut oser tirer"},{"$f":"(SUMPRODUCT(N(ISTEXT(O6:O35))))","v":0},{"$f":"IF(AND($O$3=1,C36<$Y$46),$Y$48,IF(AND($O$3=1,C36>=$Y$46),$Y$50,IF(AND($O$3=2,C36<$Z$46),$Z$48,IF(AND($O$3=2,C36>=$Z$46),$Z$50,IF(AND($O$3=3,C36<$AA$46),$AA$48,IF(AND($O$3=3,C36>=$AA$46),$AA$50,IF(AND($O$3=4,C36<$AB$46),$AB$48,IF(AND($O$3=4,C36>=$AB$46),$AB$50,IF(AND($O$3=5,C36<$AC$46),$AC$48,IF(AND($O$3=5,C36>=$AC$46),$AC$50,IF(AND($O$3=6,C36<$AD$46),$AD$48,IF(AND($O$3=6,C36>=$AD$46),$AD$50,IF(AND($O$3=7,C36<$AE$46),$AE$48,IF(AND($O$3=7,C36>=$AE$46),$AE$50,IF(AND($O$3=8,C36<$AF$46),$AF$48,IF(AND($O$3=8,C36>=$AF$46),$AF$50))))))))))))))))","v":"Pourquoi vos tirs ne rentrent pas ? "},{"$f":"(SUMPRODUCT(N(ISTEXT(Q6:Q35))))","v":0},{"$f":"IF(AND($Q$3=1,C36<$Y$46),$Y$48,IF(AND($Q$3=1,C36>=$Y$46),$Y$50,IF(AND($Q$3=2,C36<$Z$46),$Z$48,IF(AND($Q$3=2,C36>=$Z$46),$Z$50,IF(AND($Q$3=3,C36<$AA$46),$AA$48,IF(AND($Q$3=3,C36>=$AA$46),$AA$50,IF(AND($Q$3=4,C36<$AB$46),$AB$48,IF(AND($Q$3=4,C36>=$AB$46),$AB$50,IF(AND($Q$3=5,C36<$AC$46),$AC$48,IF(AND($Q$3=5,C36>=$AC$46),$AC$50,IF(AND($Q$3=6,C36<$AD$46),$AD$48,IF(AND($Q$3=6,C36>=$AD$46),$AD$50,IF(AND($Q$3=7,C36<$AE$46),$AE$48,IF(AND($Q$3=7,C36>=$AE$46),$AE$50,IF(AND($Q$3=8,C36<$AF$46),$AF$48,IF(AND($Q$3=8,C36>=$AF$46),$AF$50))))))))))))))))","v":{"$error":"#REF!"}},{"$f":"(SUMPRODUCT(N(ISTEXT(S6:S35))))","v":0},{"$f":"IF(AND($S$3=1,C36<$Y$46),$Y$48,IF(AND($S$3=1,C36>=$Y$46),$Y$50,IF(AND($S$3=2,C36<$Z$46),$Z$48,IF(AND($S$3=2,C36>=$Z$46),$Z$50,IF(AND($S$3=3,C36<$AA$46),$AA$48,IF(AND($S$3=3,C36>=$AA$46),$AA$50,IF(AND($S$3=4,C36<$AB$46),$AB$48,IF(AND($S$3=4,C36>=$AB$46),$AB$50,IF(AND($S$3=5,C36<$AC$46),$AC$48,IF(AND($S$3=5,C36>=$AC$46),$AC$50,IF(AND($S$3=6,C36<$AD$46),$AD$48,IF(AND($S$3=6,C36>=$AD$46),$AD$50,IF(AND($S$3=7,C36<$AE$46),$AE$48,IF(AND($S$3=7,C36>=$AE$46),$AE$50,IF(AND($S$3=8,C36<$AF$46),$AF$48,IF(AND($S$3=8,C36>=$AF$46),$AF$50))))))))))))))))","v":"SI vous tirez il faudra être plus précis"},{"$f":"S36/SUM(M36+O36+S36)*100","v":{"$error":"#DIV/0!"}},{"$f":"IF(AND($U$3=1,C36<$Y$46),$Y$48,IF(AND($U$3=1,C36>=$Y$46),$Y$50,IF(AND($U$3=2,C36<$Z$46),$Z$48,IF(AND($U$3=2,C36>=$Z$46),$Z$50,IF(AND($U$3=3,C36<$AA$46),$AA$48,IF(AND($U$3=3,C36>=$AA$46),$AA$50,IF(AND($U$3=4,C36<$AB$46),$AB$48,IF(AND($U$3=4,C36>=$AB$46),$AB$50,IF(AND($U$3=5,C36<$AC$46),$AC$48,IF(AND($U$3=5,C36>=$AC$46),$AC$50,IF(AND($U$3=6,C36<$AD$46),$AD$48,IF(AND($U$3=6,C36>=$AD$46),$AD$50,IF(AND($U$3=7,C36<$AE$46),$AE$48,IF(AND($U$3=7,C36>=$AE$46),$AE$50,IF(AND($U$3=8,C36<$AF$46),$AF$48,IF(AND($U$3=8,C36>=$AF$46),$AF$50))))))))))))))))","v":"Bien visé"},{"$f":"B36","v":"VERT"},null,{"$f":"DEBUT!Y36","v":"FAUTE"},{"$f":"DEBUT!Z36","v":"BALLON PERDU"},{"$f":"DEBUT!AA36","v":"POSSESSION"},{"$f":"DEBUT!AB36","v":"RECUPERATION B"},{"$f":"DEBUT!AC36","v":"TIRS"},{"$f":"DEBUT!AD36","v":"BONS TIRS"},{"$f":"DEBUT!AE36","v":"PANIERS"},{"$f":"DEBUT!AF36","v":"% REUSSITE"}]
[null,"Contrats ->",null,null,null,null,null,null,null,null,null,null,null,null,null,null,null,null,null,null,null,null,"<-Contrats "]
[null,{"$f":"EQUIPES!B4","v":"Alexis F."},{"$f":"COUNTIF($C$6:$C$35,B38)","v":0},{"$f":"IF(AND($C$3=1,C38<$Y$38),$Y$40,IF(AND($C$3=1,C38>=$Y$38),$Y$42,IF(AND($C$3=2,C38<$Z$38),$Z$40,IF(AND($C$3=2,C38>=$Z$38),$Z$42,IF(AND($C$3=3,C38<$AA$38),$AA$40,IF(AND($C$3=3,C38>=$AA$38),$AA$42,IF(AND($C$3=4,C38<$AB$38),$AB$40,IF(AND($C$3=4,C38>=$AB$38),$AB$42,IF(AND($C$3=5,C38<$AC$38),$AC$40,IF(AND($C$3=5,C38>=$AC$38),$AC$42,IF(AND($C$3=6,C38<$AD$38),$AD$40,IF(AND($C$3=6,C38>=$AD$38),$AD$42,IF(AND($C$3=7,C38<$AE$38),$AE$40,IF(AND($C$3=7,C38>=$AE$38),$AE$42,IF(AND($C$3=8,C38<$AF$38),$AF$40,IF(AND($C$3=8,C38>=$AF$38),$AF$42))))))))))))))))","v":"C'est bien tu gères la distance"},{"$f":"COUNTIF($E$6:$E$35,B38)","v":0},{"$f":"IF(AND($E$3=1,E38<$Y$38),$Y$40,IF(AND($E$3=1,E38>=$Y$38),$Y$42,IF(AND($E$3=2,E38<$Z$38),$Z$40,IF(AND($E$3=2,E38>=$Z$38),$Z$42,IF(AND($E$3=3,E38<$AA$38),$AA$40,IF(AND($E$3=3,E38>=$AA$38),$AA$42,IF(AND($E$3=4,E38<$AB$38),$AB$40,IF(AND($E$3=4,E38>=$AB$38),$AB$42,IF(AND($E$3=5,E38<$AC$38),$AC$40,IF(AND($E$3=5,E38>=$AC$38),$AC$42,IF(AND($E$3=6,E38<$AD$38),$AD$40,IF(AND($E$3=6,E38>=$AD$38),$AD$42,IF(AND($E$3=7,E38<$AE$38),$AE$40,IF(AND($E$3=7,E38>=$AE$38),$AE$42,IF(AND($E$3=8,E38<$AF$38),$AF$40,IF(AND($E$3=8,E38>=$AF$38),$AF$42))))))))))))))))","v":"Bien tu lèves la tête"},{"$f":"COUNTIF($G$6:$G$35,B38)","v":0},{"$f":"IF(AND($G$3=1,G38<$Y$38),$Y$40,IF(AND($G$3=1,G38>=$Y$38),$Y$42,IF(AND($G$3=2,G38<$Z$38),$Z$40,IF(AND($G$3=2,G38>=$Z$38),$Z$42,IF(AND($G$3=3,G38<$AA$38),$AA$40,IF(AND($G$3=3,G38>=$AA$38),$AA$42,IF(AND($G$3=4,G38<$AB$38),$AB$40,IF(AND($G$3=4,G38>=$AB$38),$AB$42,IF(AND($G$3=5,G38<$AC$38),$AC$40,IF(AND($G$3=5,G38>=$AC$38),$AC$42,IF(AND($G$3=6,G38<$AD$38),$AD$40,IF(AND($G$3=6,G38>=$AD$38),$AD$42,IF(AND($G$3=7,G38<$AE$38),$AE$40,IF(AND($G$3=7,G38>=$AE$38),$AE$42,IF(AND($G$3=8,G38<$AF$38),$AF$40,IF(AND($G$3=8,G38>=$AF$38),$AF$42))))))))))))))))","v":"Tu touches le ballon"},{"$f":"COUNTIF($I$6:$I$35,B38)","v":0},{"$f":"IF(AND($I$3=1,I38<$Y$38),$Y$40,IF(AND($I$3=1,I38>=$Y$38),$Y$42,IF(AND($I$3=2,I38<$Z$38),$Z$40,IF(AND($I$3=2,I38>=$Z$38),$Z$42,IF(AND($I$3=3,I38<$AA$38),$AA$40,IF(AND($I$3=3,I38>=$AA$38),$AA$42,IF(AND($I$3=4,I38<$AB$38),$AB$40,IF(AND($I$3=4,I38>=$AB$38),$AB$42,IF(AND($I$3=5,I38<$AC$38),$AC$40,IF(AND($I$3=5,I38>=$AC$38),$AC$42,IF(AND($I$3=6,I38<$AD$38),$AD$40,IF(AND($I$3=6,I38>=$AD$38),$AD$42,IF(AND($I$3=7,I38<$AE$38),$AE$40,IF(AND($I$3=7,I38>=$AE$38),$AE$42,IF(AND($I$3=8,I38<$AF$38),$AF$40,IF(AND($I$3=8,I38>=$AF$38),$AF$42))))))))))))))))","v":{"$error":"#REF!"}},{"$f":"COUNTIF($K$6:$K$35,B38)","v":0},{"$f":"IF(AND($K$3=1,K38<$Y$38),$Y$40,IF(AND($K$3=1,K38>=$Y$38),$Y$42,IF(AND($K$3=2,K38<$Z$38),$Z$40,IF(AND($K$3=2,K38>=$Z$38),$Z$42,IF(AND($K$3=3,K38<$AA$38),$AA$40,IF(AND($K$3=3,K38>=$AA$38),$AA$42,IF(AND($K$3=4,K38<$AB$38),$AB$40,IF(AND($K$3=4,K38>=$AB$38),$AB$42,IF(AND($K$3=5,K38<$AC$38),$AC$40,IF(AND($K$3=5,K38>=$AC$38),$AC$42,IF(AND($K$3=6,K38<$AD$38),$AD$40,IF(AND($K$3=6,K38>=$AD$38),$AD$42,IF(AND($K$3=7,K38<$AE$38),$AE$40,IF(AND($K$3=7,K38>=$AE$38),$AE$42,IF(AND($K$3=8,K38<$AF$38),$AF$40,IF(AND($K$3=8,K38>=$AF$38),$AF$42))))))))))))))))","v":{"$error":"#REF!"}},{"$f":"COUNTIF($M$6:$M$35,B38)","v":0},{"$f":"IF(AND($M$3=1,M38<$Y$38),$Y$40,IF(AND($M$3=1,M38>=$Y$38),$Y$42,IF(AND($M$3=2,M38<$Z$38),$Z$40,IF(AND($M$3=2,M38>=$Z$38),$Z$42,IF(AND($M$3=3,M38<$AA$38),$AA$40,IF(AND($M$3=3,M38>=$AA$38),$AA$42,IF(AND($M$3=4,M38<$AB$38),$AB$40,IF(AND($M$3=4,M38>=$AB$38),$AB$42,IF(AND($M$3=5,M38<$AC$38),$AC$40,IF(AND($M$3=5,M38>=$AC$38),$AC$42,IF(AND($M$3=6,M38<$AD$38),$AD$40,IF(AND($M$3=6,M38>=$AD$38),$AD$42,IF(AND($M$3=7,M38<$AE$38),$AE$40,IF(AND($M$3=7,M38>=$AE$38),$AE$42,IF(AND($M$3=8,M38<$AF$38),$AF$40,IF(AND($M$3=8,M38>=$AF$38),$AF$42))))))))))))))))","v":"Faut oser tirer"},{"$f":"COUNTIF($O$6:$O$35,B38)","v":0},{"$f":"IF(AND($O$3=1,O38<$Y$38),$Y$40,IF(AND($O$3=1,O38>=$Y$38),$Y$42,IF(AND($O$3=2,O38<$Z$38),$Z$40,IF(AND($O$3=2,O38>=$Z$38),$Z$42,IF(AND($O$3=3,O38<$AA$38),$AA$40,IF(AND($O$3=3,O38>=$AA$38),$AA$42,IF(AND($O$3=4,O38<$AB$38),$AB$40,IF(AND($O$3=4,O38>=$AB$38),$AB$42,IF(AND($O$3=5,O38<$AC$38),$AC$40,IF(AND($O$3=5,O38>=$AC$38),$AC$42,IF(AND($O$3=6,O38<$AD$38),$AD$40,IF(AND($O$3=6,O38>=$AD$38),$AD$42,IF(AND($O$3=7,O38<$AE$38),$AE$40,IF(AND($O$3=7,O38>=$AE$38),$AE$42,IF(AND($O$3=8,O38<$AF$38),$AF$40,IF(AND($O$3=8,O38>=$AF$38),$AF$42))))))))))))))))","v":"Pourquoi tes tirs ne rentrent pas ?"},{"$f":"COUNTIF($Q$6:$Q$35,B38)","v":0},{"$f":"IF(AND($Q$3=1,Q38<$Y$38),$Y$40,IF(AND($Q$3=1,Q38>=$Y$38),$Y$42,IF(AND($Q$3=2,Q38<$Z$38),$Z$40,IF(AND($Q$3=2,Q38>=$Z$38),$Z$42,IF(AND($Q$3=3,Q38<$AA$38),$AA$40,IF(AND($Q$3=3,Q38>=$AA$38),$AA$42,IF(AND($Q$3=4,Q38<$AB$38),$AB$40,IF(AND($Q$3=4,Q38>=$AB$38),$AB$42,IF(AND($Q$3=5,Q38<$AC$38),$AC$40,IF(AND($Q$3=5,Q38>=$AC$38),$AC$42,IF(AND($Q$3=6,Q38<$AD$38),$AD$40,IF(AND($Q$3=6,Q38>=$AD$38),$AD$42,IF(AND($Q$3=7,Q38<$AE$38),$AE$40,IF(AND($Q$3=7,Q38>=$AE$38),$AE$42,IF(AND($Q$3=8,Q38<$AF$38),$AF$40,IF(AND($Q$3=8,Q38>=$AF$38),$AF$42))))))))))))))))","v":{"$error":"#REF!"}},{"$f":"COUNTIF($S$6:$S$35,B38)","v":0},{"$f":"IF(AND($S$3=1,S38<$Y$38),$Y$40,IF(AND($S$3=1,S38>=$Y$38),$Y$42,IF(AND($S$3=2,S38<$Z$38),$Z$40,IF(AND($S$3=2,S38>=$Z$38),$Z$42,IF(AND($S$3=3,S38<$AA$38),$AA$40,IF(AND($S$3=3,S38>=$AA$38),$AA$42,IF(AND($S$3=4,S38<$AB$38),$AB$40,IF(AND($S$3=4,S38>=$AB$38),$AB$42,IF(AND($S$3=5,S38<$AC$38),$AC$40,IF(AND($S$3=5,S38>=$AC$38),$AC$42,IF(AND($S$3=6,S38<$AD$38),$AD$40,IF(AND($S$3=6,S38>=$AD$38),$AD$42,IF(AND($S$3=7,S38<$AE$38),$AE$40,IF(AND($S$3=7,S38>=$AE$38),$AE$42,IF(AND($S$3=8,S38<$AF$38),$AF$40,IF(AND($S$3=8,S38>=$AF$38),$AF$42))))))))))))))))","v":"SI tu tires il faudra être plus précis"},{"$f":"S38/SUM(M38+O38+S38)*100","v":{"$error":"#DIV/0!"}},{"$f":"IF(AND($U$3=1,U38<$Y$38),$Y$40,IF(AND($U$3=1,U38>=$Y$38),$Y$42,IF(AND($U$3=2,U38<$Z$38),$Z$40,IF(AND($U$3=2,U38>=$Z$38),$Z$42,IF(AND($U$3=3,U38<$AA$38),$AA$40,IF(AND($U$3=3,U38>=$AA$38),$AA$42,IF(AND($U$3=4,U38<$AB$38),$AB$40,IF(AND($U$3=4,U38>=$AB$38),$AB$42,IF(AND($U$3=5,U38<$AC$38),$AC$40,IF(AND($U$3=5,U38>=$AC$38),$AC$42,IF(AND($U$3=6,U38<$AD$38),$AD$40,IF(AND($U$3=6,U38>=$AD$38),$AD$42,IF(AND($U$3=7,U38<$AE$38),$AE$40,IF(AND($U$3=7,U38>=$AE$38),$AE$42,IF(AND($U$3=8,U38<$AF$38),$AF$40,IF(AND($U$3=8,U38>=$AF$38),$AF$42))))))))))))))))","v":{"$error":"#DIV/0!"}},{"$f":"B38","v":"Alexis F."},null,{"$f":"DEBUT!Y38","v":2},{"$f":"DEBUT!Z38","v":2},{"$f":"DEBUT!AA38","v":2},{"$f":"DEBUT!AB38","v":2},{"$f":"DEBUT!AC38","v":2},{"$f":"DEBUT!AD38","v":2},{"$f":"DEBUT!AE38","v":2},{"$f":"DEBUT!AF38","v":0.2}]
[null,"Contrats ->",null,null,null,null,null,null,null,null,null,null,null,null,null,null,null,null,null,null,null,null,"<-Contrats ","Contrats ind"]
[null,{"$f":"EQUIPES!B5","v":0},{"$f":"COUNTIF($C$6:$C$35,B40)","v":0},{"$f":"IF(AND($C$3=1,C40<$Y$38),$Y$40,IF(AND($C$3=1,C40>=$Y$38),$Y$42,IF(AND($C$3=2,C40<$Z$38),$Z$40,IF(AND($C$3=2,C40>=$Z$38),$Z$42,IF(AND($C$3=3,C40<$AA$38),$AA$40,IF(AND($C$3=3,C40>=$AA$38),$AA$42,IF(AND($C$3=4,C40<$AB$38),$AB$40,IF(AND($C$3=4,C40>=$AB$38),$AB$42,IF(AND($C$3=5,C40<$AC$38),$AC$40,IF(AND($C$3=5,C40>=$AC$38),$AC$42,IF(AND($C$3=6,C40<$AD$38),$AD$40,IF(AND($C$3=6,C40>=$AD$38),$AD$42,IF(AND($C$3=7,C40<$AE$38),$AE$40,IF(AND($C$3=7,C40>=$AE$38),$AE$42,IF(AND($C$3=8,C40<$AF$38),$AF$40,IF(AND($C$3=8,C40>=$AF$38),$AF$42))))))))))))))))","v":"C'est bien tu gères la distance"},{"$f":"COUNTIF($E$6:$E$35,B40)","v":0},{"$f":"IF(AND($E$3=1,E40<$Y$38),$Y$40,IF(AND($E$3=1,E40>=$Y$38),$Y$42,IF(AND($E$3=2,E40<$Z$38),$Z$40,IF(AND($E$3=2,E40>=$Z$38),$Z$42,IF(AND($E$3=3,E40<$AA$38),$AA$40,IF(AND($E$3=3,E40>=$AA$38),$AA$42,IF(AND($E$3=4,E40<$AB$38),$AB$40,IF(AND($E$3=4,E40>=$AB$38),$AB$42,IF(AND($E$3=5,E40<$AC$38),$AC$40,IF(AND($E$3=5,E40>=$AC$38),$AC$42,IF(AND($E$3=6,E40<$AD$38),$AD$40,IF(AND($E$3=6,E40>=$AD$38),$AD$42,IF(AND($E$3=7,E40<$AE$38),$AE$40,IF(AND($E$3=7,E40>=$AE$38),$AE$42,IF(AND($E$3=8,E40<$AF$38),$AF$40,IF(AND($E$3=8,E40>=$AF$38),$AF$42))))))))))))))))","v":"Bien tu lèves la tête"},{"$f":"COUNTIF($G$6:$G$35,B40)","v":0},{"$f":"IF(AND($G$3=1,G40<$Y$38),$Y$40,IF(AND($G$3=1,G40>=$Y$38),$Y$42,IF(AND($G$3=2,G40<$Z$38),$Z$40,IF(AND($G$3=2,G40>=$Z$38),$Z$42,IF(AND($G$3=3,G40<$AA$38),$AA$40,IF(AND($G$3=3,G40>=$AA$38),$AA$42,IF(AND($G$3=4,G40<$AB$38),$AB$40,IF(AND($G$3=4,G40>=$AB$38),$AB$42,IF(AND($G$3=5,G40<$AC$38),$AC$40,IF(AND($G$3=5,G40>=$AC$38),$AC$42,IF(AND($G$3=6,G40<$AD$38),$AD$40,IF(AND($G$3=6,G40>=$AD$38),$AD$42,IF(AND($G$3=7,G40<$AE$38),$AE$40,IF(AND($G$3=7,G40>=$AE$38),$AE$42,IF(AND($G$3=8,G40<$AF$38),$AF$40,IF(AND($G$3=8,G40>=$AF$38),$AF$42))))))))))))))))","v":"Tu touches le ballon"},null,{"$f":"IF(AND($I$3=1,I40<$Y$38),$Y$40,IF(AND($I$3=1,I40>=$Y$38),$Y$42,IF(AND($I$3=2,I40<$Z$38),$Z$40,IF(AND($I$3=2,I40>=$Z$38),$Z$42,IF(AND($I$3=3,I40<$AA$38),$AA$40,IF(AND($I$3=3,I40>=$AA$38),$AA$42,IF(AND($I$3=4,I40<$AB$38),$AB$40,IF(AND($I$3=4,I40>=$AB$38),$AB$42,IF(AND($I$3=5,I40<$AC$38),$AC$40,IF(AND($I$3=5,I40>=$AC$38),$AC$42,IF(AND($I$3=6,I40<$AD$38),$AD$40,IF(AND($I$3=6,I40>=$AD$38),$AD$42,IF(AND($I$3=7,I40<$AE$38),$AE$40,IF(AND($I$3=7,I40>=$AE$38),$AE$42,IF(AND($I$3=8,I40<$AF$38),$AF$40,IF(AND($I$3=8,I40>=$AF$38),$AF$42))))))))))))))))","v":{"$error":"#REF!"}},{"$f":"COUNTIF($K$6:$K$35,B40)","v":0},{"$f":"IF(AND($K$3=1,K40<$Y$38),$Y$40,IF(AND($K$3=1,K40>=$Y$38),$Y$42,IF(AND($K$3=2,K40<$Z$38),$Z$40,IF(AND($K$3=2,K40>=$Z$38),$Z$42,IF(AND($K$3=3,K40<$AA$38),$AA$40,IF(AND($K$3=3,K40>=$AA$38),$AA$42,IF(AND($K$3=4,K40<$AB$38),$AB$40,IF(AND($K$3=4,K40>=$AB$38),$AB$42,IF(AND($K$3=5,K40<$AC$38),$AC$40,IF(AND($K$3=5,K40>=$AC$38),$AC$42,IF(AND($K$3=6,K40<$AD$38),$AD$40,IF(AND($K$3=6,K40>=$AD$38),$AD$42,IF(AND($K$3=7,K40<$AE$38),$AE$40,IF(AND($K$3=7,K40>=$AE$38),$AE$42,IF(AND($K$3=8,K40<$AF$38),$AF$40,IF(AND($K$3=8,K40>=$AF$38),$AF$42))))))))))))))))","v":{"$error":"#REF!"}},{"$f":"COUNTIF($M$6:$M$35,B40)","v":0},{"$f":"IF(AND($M$3=1,M40<$Y$38),$Y$40,IF(AND($M$3=1,M40>=$Y$38),$Y$42,IF(AND($M$3=2,M40<$Z$38),$Z$40,IF(AND($M$3=2,M40>=$Z$38),$Z$42,IF(AND($M$3=3,M40<$AA$38),$AA$40,IF(AND($M$3=3,M40>=$AA$38),$AA$42,IF(AND($M$3=4,M40<$AB$38),$AB$40,IF(AND($M$3=4,M40>=$AB$38),$AB$42,IF(AND($M$3=5,M40<$AC$38),$AC$40,IF(AND($M$3=5,M40>=$AC$38),$AC$42,IF(AND($M$3=6,M40<$AD$38),$AD$40,IF(AND($M$3=6,M40>=$AD$38),$AD$42,IF(AND($M$3=7,M40<$AE$38),$AE$40,IF(AND($M$3=7,M40>=$AE$38),$AE$42,IF(AND($M$3=8,M40<$AF$38),$AF$40,IF(AND($M$3=8,M40>=$AF$38),$AF$42))))))))))))))))","v":"Faut oser tirer"},{"$f":"COUNTIF($O$6:$O$35,B40)","v":0},{"$f":"IF(AND($O$3=1,O40<$Y$38),$Y$40,IF(AND($O$3=1,O40>=$Y$38),$Y$42,IF(AND($O$3=2,O40<$Z$38),$Z$40,IF(AND($O$3=2,O40>=$Z$38),$Z$42,IF(AND($O$3=3,O40<$AA$38),$AA$40,IF(AND($O$3=3,O40>=$AA$38),$AA$42,IF(AND($O$3=4,O40<$AB$38),$AB$40,IF(AND($O$3=4,O40>=$AB$38),$AB$42,IF(AND($O$3=5,O40<$AC$38),$AC$40,IF(AND($O$3=5,O40>=$AC$38),$AC$42,IF(AND($O$3=6,O40<$AD$38),$AD$40,IF(AND($O$3=6,O40>=$AD$38),$AD$42,IF(AND($O$3=7,O40<$AE$38),$AE$40,IF(AND($O$3=7,O40>=$AE$38),$AE$42,IF(AND($O$3=8,O40<$AF$38),$AF$40,IF(AND($O$3=8,O40>=$AF$38),$AF$42))))))))))))))))","v":"Pourquoi tes tirs ne rentrent pas ?"},{"$f":"COUNTIF($Q$6:$Q$35,B40)","v":0},{"$f":"IF(AND($Q$3=1,Q40<$Y$38),$Y$40,IF(AND($Q$3=1,Q40>=$Y$38),$Y$42,IF(AND($Q$3=2,Q40<$Z$38),$Z$40,IF(AND($Q$3=2,Q40>=$Z$38),$Z$42,IF(AND($Q$3=3,Q40<$AA$38),$AA$40,IF(AND($Q$3=3,Q40>=$AA$38),$AA$42,IF(AND($Q$3=4,Q40<$AB$38),$AB$40,IF(AND($Q$3=4,Q40>=$AB$38),$AB$42,IF(AND($Q$3=5,Q40<$AC$38),$AC$40,IF(AND($Q$3=5,Q40>=$AC$38),$AC$42,IF(AND($Q$3=6,Q40<$AD$38),$AD$40,IF(AND($Q$3=6,Q40>=$AD$38),$AD$42,IF(AND($Q$3=7,Q40<$AE$38),$AE$40,IF(AND($Q$3=7,Q40>=$AE$38),$AE$42,IF(AND($Q$3=8,Q40<$AF$38),$AF$40,IF(AND($Q$3=8,Q40>=$AF$38),$AF$42))))))))))))))))","v":{"$error":"#REF!"}},{"$f":"COUNTIF($S$6:$S$35,B40)","v":0},{"$f":"IF(AND($S$3=1,S40<$Y$38),$Y$40,IF(AND($S$3=1,S40>=$Y$38),$Y$42,IF(AND($S$3=2,S40<$Z$38),$Z$40,IF(AND($S$3=2,S40>=$Z$38),$Z$42,IF(AND($S$3=3,S40<$AA$38),$AA$40,IF(AND($S$3=3,S40>=$AA$38),$AA$42,IF(AND($S$3=4,S40<$AB$38),$AB$40,IF(AND($S$3=4,S40>=$AB$38),$AB$42,IF(AND($S$3=5,S40<$AC$38),$AC$40,IF(AND($S$3=5,S40>=$AC$38),$AC$42,IF(AND($S$3=6,S40<$AD$38),$AD$40,IF(AND($S$3=6,S40>=$AD$38),$AD$42,IF(AND($S$3=7,S40<$AE$38),$AE$40,IF(AND($S$3=7,S40>=$AE$38),$AE$42,IF(AND($S$3=8,S40<$AF$38),$AF$40,IF(AND($S$3=8,S40>=$AF$38),$AF$42))))))))))))))))","v":"SI tu tires il faudra être plus précis"},{"$f":"S40/SUM(M40+O40+S40)*100","v":{"$error":"#DIV/0!"}},{"$f":"IF(AND($U$3=1,U40<$Y$38),$Y$40,IF(AND($U$3=1,U40>=$Y$38),$Y$42,IF(AND($U$3=2,U40<$Z$38),$Z$40,IF(AND($U$3=2,U40>=$Z$38),$Z$42,IF(AND($U$3=3,U40<$AA$38),$AA$40,IF(AND($U$3=3,U40>=$AA$38),$AA$42,IF(AND($U$3=4,U40<$AB$38),$AB$40,IF(AND($U$3=4,U40>=$AB$38),$AB$42,IF(AND($U$3=5,U40<$AC$38),$AC$40,IF(AND($U$3=5,U40>=$AC$38),$AC$42,IF(AND($U$3=6,U40<$AD$38),$AD$40,IF(AND($U$3=6,U40>=$AD$38),$AD$42,IF(AND($U$3=7,U40<$AE$38),$AE$40,IF(AND($U$3=7,U40>=$AE$38),$AE$42,IF(AND($U$3=8,U40<$AF$38),$AF$40,IF(AND($U$3=8,U40>=$AF$38),$AF$42))))))))))))))))","v":{"$error":"#DIV/0!"}},{"$f":"B40","v":0},0,{"$f":"DEBUT!Y40","v":"C'est bien tu gères la distance"},{"$f":"DEBUT!Z40","v":"Bien tu lèves la tête"},{"$f":"DEBUT!AA40","v":"Tu touches le ballon"},{"$f":"DEBUT!AB40","v":"Faut se bouger davantage"},{"$f":"DEBUT!AC40","v":"Faut oser tirer"},{"$f":"DEBUT!AD40","v":"Pourquoi tes tirs ne rentrent pas ?"},{"$f":"DEBUT!AE40","v":"SI tu tires il faudra être plus précis"},{"$f":"DEBUT!AF40","v":"Pas de chance"}]
[null,"Contrats ->",null,null,null,null,null,null,null,null,null,null,null,null,null,null,null,null,null,null,null,null,"<-Contrats "]
[null,{"$f":"EQUIPES!B6","v":0},{"$f":"COUNTIF($C$6:$C$35,B42)","v":0},{"$f":"IF(AND($C$3=1,C42<$Y$38),$Y$40,IF(AND($C$3=1,C42>=$Y$38),$Y$42,IF(AND($C$3=2,C42<$Z$38),$Z$40,IF(AND($C$3=2,C42>=$Z$38),$Z$42,IF(AND($C$3=3,C42<$AA$38),$AA$40,IF(AND($C$3=3,C42>=$AA$38),$AA$42,IF(AND($C$3=4,C42<$AB$38),$AB$40,IF(AND($C$3=4,C42>=$AB$38),$AB$42,IF(AND($C$3=5,C42<$AC$38),$AC$40,IF(AND($C$3=5,C42>=$AC$38),$AC$42,IF(AND($C$3=6,C42<$AD$38),$AD$40,IF(AND($C$3=6,C42>=$AD$38),$AD$42,IF(AND($C$3=7,C42<$AE$38),$AE$40,IF(AND($C$3=7,C42>=$AE$38),$AE$42,IF(AND($C$3=8,C42<$AF$38),$AF$40,IF(AND($C$3=8,C42>=$AF$38),$AF$42))))))))))))))))","v":"C'est bien tu gères la distance"},{"$f":"COUNTIF($E$6:$E$35,B42)","v":0},{"$f":"IF(AND($E$3=1,E42<$Y$38),$Y$40,IF(AND($E$3=1,E42>=$Y$38),$Y$42,IF(AND($E$3=2,E42<$Z$38),$Z$40,IF(AND($E$3=2,E42>=$Z$38),$Z$42,IF(AND($E$3=3,E42<$AA$38),$AA$40,IF(AND($E$3=3,E42>=$AA$38),$AA$42,IF(AND($E$3=4,E42<$AB$38),$AB$40,IF(AND($E$3=4,E42>=$AB$38),$AB$42,IF(AND($E$3=5,E42<$AC$38),$AC$40,IF(AND($E$3=5,E42>=$AC$38),$AC$42,IF(AND($E$3=6,E42<$AD$38),$AD$40,IF(AND($E$3=6,E42>=$AD$38),$AD$42,IF(AND($E$3=7,E42<$AE$38),$AE$40,IF(AND($E$3=7,E42>=$AE$38),$AE$42,IF(AND($E$3=8,E42<$AF$38),$AF$40,IF(AND($E$3=8,E42>=$AF$38),$AF$42))))))))))))))))","v":"Bien tu lèves la tête"},{"$f":"COUNTIF($G$6:$G$35,B42)","v":0},{"$f":"IF(AND($G$3=1,G42<$Y$38),$Y$40,IF(AND($G$3=1,G42>=$Y$38),$Y$42,IF(AND($G$3=2,G42<$Z$38),$Z$40,IF(AND($G$3=2,G42>=$Z$38),$Z$42,IF(AND($G$3=3,G42<$AA$38),$AA$40,IF(AND($G$3=3,G42>=$AA$38),$AA$42,IF(AND($G$3=4,G42<$AB$38),$AB$40,IF(AND($G$3=4,G42>=$AB$38),$AB$42,IF(AND($G$3=5,G42<$AC$38),$AC$40,IF(AND($G$3=5,G42>=$AC$38),$AC$42,IF(AND($G$3=6,G42<$AD$38),$AD$40,IF(AND($G$3=6,G42>=$AD$38),$AD$42,IF(AND($G$3=7,G42<$AE$38),$AE$40,IF(AND($G$3=7,G42>=$AE$38),$AE$42,IF(AND($G$3=8,G42<$AF$38),$AF$40,IF(AND($G$3=8,G42>=$AF$38),$AF$42))))))))))))))))","v":"Tu touches le ballon"},null,{"$f":"IF(AND($I$3=1,I42<$Y$38),$Y$40,IF(AND($I$3=1,I42>=$Y$38),$Y$42,IF(AND($I$3=2,I42<$Z$38),$Z$40,IF(AND($I$3=2,I42>=$Z$38),$Z$42,IF(AND($I$3=3,I42<$AA$38),$AA$40,IF(AND($I$3=3,I42>=$AA$38),$AA$42,IF(AND($I$3=4,I42<$AB$38),$AB$40,IF(AND($I$3=4,I42>=$AB$38),$AB$42,IF(AND($I$3=5,I42<$AC$38),$AC$40,IF(AND($I$3=5,I42>=$AC$38),$AC$42,IF(AND($I$3=6,I42<$AD$38),$AD$40,IF(AND($I$3=6,I42>=$AD$38),$AD$42,IF(AND($I$3=7,I42<$AE$38),$AE$40,IF(AND($I$3=7,I42>=$AE$38),$AE$42,IF(AND($I$3=8,I42<$AF$38),$AF$40,IF(AND($I$3=8,I42>=$AF$38),$AF$42))))))))))))))))","v":{"$error":"#REF!"}},{"$f":"COUNTIF($K$6:$K$35,B42)","v":0},{"$f":"IF(AND($K$3=1,K42<$Y$38),$Y$40,IF(AND($K$3=1,K42>=$Y$38),$Y$42,IF(AND($K$3=2,K42<$Z$38),$Z$40,IF(AND($K$3=2,K42>=$Z$38),$Z$42,IF(AND($K$3=3,K42<$AA$38),$AA$40,IF(AND($K$3=3,K42>=$AA$38),$AA$42,IF(AND($K$3=4,K42<$AB$38),$AB$40,IF(AND($K$3=4,K42>=$AB$38),$AB$42,IF(AND($K$3=5,K42<$AC$38),$AC$40,IF(AND($K$3=5,K42>=$AC$38),$AC$42,IF(AND($K$3=6,K42<$AD$38),$AD$40,IF(AND($K$3=6,K42>=$AD$38),$AD$42,IF(AND($K$3=7,K42<$AE$38),$AE$40,IF(AND($K$3=7,K42>=$AE$38),$AE$42,IF(AND($K$3=8,K42<$AF$38),$AF$40,IF(AND($K$3=8,K42>=$AF$38),$AF$42))))))))))))))))","v":{"$error":"#REF!"}},{"$f":"COUNTIF($M$6:$M$35,B42)","v":0},{"$f":"IF(AND($M$3=1,M42<$Y$38),$Y$40,IF(AND($M$3=1,M42>=$Y$38),$Y$42,IF(AND($M$3=2,M42<$Z$38),$Z$40,IF(AND($M$3=2,M42>=$Z$38),$Z$42,IF(AND($M$3=3,M42<$AA$38),$AA$40,IF(AND($M$3=3,M42>=$AA$38),$AA$42,IF(AND($M$3=4,M42<$AB$38),$AB$40,IF(AND($M$3=4,M42>=$AB$38),$AB$42,IF(AND($M$3=5,M42<$AC$38),$AC$40,IF(AND($M$3=5,M42>=$AC$38),$AC$42,IF(AND($M$3=6,M42<$AD$38),$AD$40,IF(AND($M$3=6,M42>=$AD$38),$AD$42,IF(AND($M$3=7,M42<$AE$38),$AE$40,IF(AND($M$3=7,M42>=$AE$38),$AE$42,IF(AND($M$3=8,M42<$AF$38),$AF$40,IF(AND($M$3=8,M42>=$AF$38),$AF$42))))))))))))))))","v":"Faut oser tirer"},{"$f":"COUNTIF($O$6:$O$35,B42)","v":0},{"$f":"IF(AND($O$3=1,O42<$Y$38),$Y$40,IF(AND($O$3=1,O42>=$Y$38),$Y$42,IF(AND($O$3=2,O42<$Z$38),$Z$40,IF(AND($O$3=2,O42>=$Z$38),$Z$42,IF(AND($O$3=3,O42<$AA$38),$AA$40,IF(AND($O$3=3,O42>=$AA$38),$AA$42,IF(AND($O$3=4,O42<$AB$38),$AB$40,IF(AND($O$3=4,O42>=$AB$38),$AB$42,IF(AND($O$3=5,O42<$AC$38),$AC$40,IF(AND($O$3=5,O42>=$AC$38),$AC$42,IF(AND($O$3=6,O42<$AD$38),$AD$40,IF(AND($O$3=6,O42>=$AD$38),$AD$42,IF(AND($O$3=7,O42<$AE$38),$AE$40,IF(AND($O$3=7,O42>=$AE$38),$AE$42,IF(AND($O$3=8,O42<$AF$38),$AF$40,IF(AND($O$3=8,O42>=$AF$38),$AF$42))))))))))))))))","v":"Pourquoi tes tirs ne rentrent pas ?"},{"$f":"COUNTIF($Q$6:$Q$35,B42)","v":0},{"$f":"IF(AND($Q$3=1,Q42<$Y$38),$Y$40,IF(AND($Q$3=1,Q42>=$Y$38),$Y$42,IF(AND($Q$3=2,Q42<$Z$38),$Z$40,IF(AND($Q$3=2,Q42>=$Z$38),$Z$42,IF(AND($Q$3=3,Q42<$AA$38),$AA$40,IF(AND($Q$3=3,Q42>=$AA$38),$AA$42,IF(AND($Q$3=4,Q42<$AB$38),$AB$40,IF(AND($Q$3=4,Q42>=$AB$38),$AB$42,IF(AND($Q$3=5,Q42<$AC$38),$AC$40,IF(AND($Q$3=5,Q42>=$AC$38),$AC$42,IF(AND($Q$3=6,Q42<$AD$38),$AD$40,IF(AND($Q$3=6,Q42>=$AD$38),$AD$42,IF(AND($Q$3=7,Q42<$AE$38),$AE$40,IF(AND($Q$3=7,Q42>=$AE$38),$AE$42,IF(AND($Q$3=8,Q42<$AF$38),$AF$40,IF(AND($Q$3=8,Q42>=$AF$38),$AF$42))))))))))))))))","v":{"$error":"#REF!"}},{"$f":"COUNTIF($S$6:$S$35,B42)","v":0},{"$f":"IF(AND($S$3=1,S42<$Y$38),$Y$40,IF(AND($S$3=1,S42>=$Y$38),$Y$42,IF(AND($S$3=2,S42<$Z$38),$Z$40,IF(AND($S$3=2,S42>=$Z$38),$Z$42,IF(AND($S$3=3,S42<$AA$38),$AA$40,IF(AND($S$3=3,S42>=$AA$38),$AA$42,IF(AND($S$3=4,S42<$AB$38),$AB$40,IF(AND($S$3=4,S42>=$AB$38),$AB$42,IF(AND($S$3=5,S42<$AC$38),$AC$40,IF(AND($S$3=5,S42>=$AC$38),$AC$42,IF(AND($S$3=6,S42<$AD$38),$AD$40,IF(AND($S$3=6,S42>=$AD$38),$AD$42,IF(AND($S$3=7,S42<$AE$38),$AE$40,IF(AND($S$3=7,S42>=$AE$38),$AE$42,IF(AND($S$3=8,S42<$AF$38),$AF$40,IF(AND($S$3=8,S42>=$AF$38),$AF$42))))))))))))))))","v":"SI tu tires il faudra être plus précis"},{"$f":"S42/SUM(M42+O42+S42)*100","v":{"$error":"#DIV/0!"}},{"$f":"IF(AND($U$3=1,U42<$Y$38),$Y$40,IF(AND($U$3=1,U42>=$Y$38),$Y$42,IF(AND($U$3=2,U42<$Z$38),$Z$40,IF(AND($U$3=2,U42>=$Z$38),$Z$42,IF(AND($U$3=3,U42<$AA$38),$AA$40,IF(AND($U$3=3,U42>=$AA$38),$AA$42,IF(AND($U$3=4,U42<$AB$38),$AB$40,IF(AND($U$3=4,U42>=$AB$38),$AB$42,IF(AND($U$3=5,U42<$AC$38),$AC$40,IF(AND($U$3=5,U42>=$AC$38),$AC$42,IF(AND($U$3=6,U42<$AD$38),$AD$40,IF(AND($U$3=6,U42>=$AD$38),$AD$42,IF(AND($U$3=7,U42<$AE$38),$AE$40,IF(AND($U$3=7,U42>=$AE$38),$AE$42,IF(AND($U$3=8,U42<$AF$38),$AF$40,IF(AND($U$3=8,U42>=$AF$38),$AF$42))))))))))))))))","v":{"$error":"#DIV/0!"}},{"$f":"B42","v":0},null,{"$f":"DEBUT!Y42","v":"Doucement "},{"$f":"DEBUT!Z42","v":"A qui tu fais la passe?"},{"$f":"DEBUT!AA42","v":"T'es plutot actif"},{"$f":"DEBUT!AB42","v":"Bien harcelé"},{"$f":"DEBUT!AC42","v":"Bien essayé mais faudra travailler l'adresse"},{"$f":"DEBUT!AD42","v":"On va travailler la précision"},{"$f":"DEBUT!AE42","v":"Joli"},{"$f":"DEBUT!AF42","v":"Bien visé"}]
[null,"Contrats ->",null,null,null,null,null,null,null,null,null,null,null,null,null,null,null,null,null,null,null,null,"<-Contrats "]
[null,{"$f":"EQUIPES!B7","v":0},{"$f":"COUNTIF($C$6:$C$35,B44)","v":0},{"$f":"IF(AND($C$3=1,C44<$Y$38),$Y$40,IF(AND($C$3=1,C44>=$Y$38),$Y$42,IF(AND($C$3=2,C44<$Z$38),$Z$40,IF(AND($C$3=2,C44>=$Z$38),$Z$42,IF(AND($C$3=3,C44<$AA$38),$AA$40,IF(AND($C$3=3,C44>=$AA$38),$AA$42,IF(AND($C$3=4,C44<$AB$38),$AB$40,IF(AND($C$3=4,C44>=$AB$38),$AB$42,IF(AND($C$3=5,C44<$AC$38),$AC$40,IF(AND($C$3=5,C44>=$AC$38),$AC$42,IF(AND($C$3=6,C44<$AD$38),$AD$40,IF(AND($C$3=6,C44>=$AD$38),$AD$42,IF(AND($C$3=7,C44<$AE$38),$AE$40,IF(AND($C$3=7,C44>=$AE$38),$AE$42,IF(AND($C$3=8,C44<$AF$38),$AF$40,IF(AND($C$3=8,C44>=$AF$38),$AF$42))))))))))))))))","v":"C'est bien tu gères la distance"},{"$f":"COUNTIF($E$6:$E$35,B44)","v":0},{"$f":"IF(AND($E$3=1,E44<$Y$38),$Y$40,IF(AND($E$3=1,E44>=$Y$38),$Y$42,IF(AND($E$3=2,E44<$Z$38),$Z$40,IF(AND($E$3=2,E44>=$Z$38),$Z$42,IF(AND($E$3=3,E44<$AA$38),$AA$40,IF(AND($E$3=3,E44>=$AA$38),$AA$42,IF(AND($E$3=4,E44<$AB$38),$AB$40,IF(AND($E$3=4,E44>=$AB$38),$AB$42,IF(AND($E$3=5,E44<$AC$38),$AC$40,IF(AND($E$3=5,E44>=$AC$38),$AC$42,IF(AND($E$3=6,E44<$AD$38),$AD$40,IF(AND($E$3=6,E44>=$AD$38),$AD$42,IF(AND($E$3=7,E44<$AE$38),$AE$40,IF(AND($E$3=7,E44>=$AE$38),$AE$42,IF(AND($E$3=8,E44<$AF$38),$AF$40,IF(AND($E$3=8,E44>=$AF$38),$AF$42))))))))))))))))","v":"Bien tu lèves la tête"},{"$f":"COUNTIF($G$6:$G$35,B44)","v":0},{"$f":"IF(AND($G$3=1,G44<$Y$38),$Y$40,IF(AND($G$3=1,G44>=$Y$38),$Y$42,IF(AND($G$3=2,G44<$Z$38),$Z$40,IF(AND($G$3=2,G44>=$Z$38),$Z$42,IF(AND($G$3=3,G44<$AA$38),$AA$40,IF(AND($G$3=3,G44>=$AA$38),$AA$42,IF(AND($G$3=4,G44<$AB$38),$AB$40,IF(AND($G$3=4,G44>=$AB$38),$AB$42,IF(AND($G$3=5,G44<$AC$38),$AC$40,IF(AND($G$3=5,G44>=$AC$38),$AC$42,IF(AND($G$3=6,G44<$AD$38),$AD$40,IF(AND($G$3=6,G44>=$AD$38),$AD$42,IF(AND($G$3=7,G44<$AE$38),$AE$40,IF(AND($G$3=7,G44>=$AE$38),$AE$42,IF(AND($G$3=8,G44<$AF$38),$AF$40,IF(AND($G$3=8,G44>=$AF$38),$AF$42))))))))))))))))","v":"Tu touches le ballon"},null,{"$f":"IF(AND($I$3=1,I44<$Y$38),$Y$40,IF(AND($I$3=1,I44>=$Y$38),$Y$42,IF(AND($I$3=2,I44<$Z$38),$Z$40,IF(AND($I$3=2,I44>=$Z$38),$Z$42,IF(AND($I$3=3,I44<$AA$38),$AA$40,IF(AND($I$3=3,I44>=$AA$38),$AA$42,IF(AND($I$3=4,I44<$AB$38),$AB$40,IF(AND($I$3=4,I44>=$AB$38),$AB$42,IF(AND($I$3=5,I44<$AC$38),$AC$40,IF(AND($I$3=5,I44>=$AC$38),$AC$42,IF(AND($I$3=6,I44<$AD$38),$AD$40,IF(AND($I$3=6,I44>=$AD$38),$AD$42,IF(AND($I$3=7,I44<$AE$38),$AE$40,IF(AND($I$3=7,I44>=$AE$38),$AE$42,IF(AND($I$3=8,I44<$AF$38),$AF$40,IF(AND($I$3=8,I44>=$AF$38),$AF$42))))))))))))))))","v":{"$error":"#REF!"}},{"$f":"COUNTIF($K$6:$K$35,B44)","v":0},{"$f":"IF(AND($K$3=1,K44<$Y$38),$Y$40,IF(AND($K$3=1,K44>=$Y$38),$Y$42,IF(AND($K$3=2,K44<$Z$38),$Z$40,IF(AND($K$3=2,K44>=$Z$38),$Z$42,IF(AND($K$3=3,K44<$AA$38),$AA$40,IF(AND($K$3=3,K44>=$AA$38),$AA$42,IF(AND($K$3=4,K44<$AB$38),$AB$40,IF(AND($K$3=4,K44>=$AB$38),$AB$42,IF(AND($K$3=5,K44<$AC$38),$AC$40,IF(AND($K$3=5,K44>=$AC$38),$AC$42,IF(AND($K$3=6,K44<$AD$38),$AD$40,IF(AND($K$3=6,K44>=$AD$38),$AD$42,IF(AND($K$3=7,K44<$AE$38),$AE$40,IF(AND($K$3=7,K44>=$AE$38),$AE$42,IF(AND($K$3=8,K44<$AF$38),$AF$40,IF(AND($K$3=8,K44>=$AF$38),$AF$42))))))))))))))))","v":{"$error":"#REF!"}},{"$f":"COUNTIF($M$6:$M$35,B44)","v":0},{"$f":"IF(AND($M$3=1,M44<$Y$38),$Y$40,IF(AND($M$3=1,M44>=$Y$38),$Y$42,IF(AND($M$3=2,M44<$Z$38),$Z$40,IF(AND($M$3=2,M44>=$Z$38),$Z$42,IF(AND($M$3=3,M44<$AA$38),$AA$40,IF(AND($M$3=3,M44>=$AA$38),$AA$42,IF(AND($M$3=4,M44<$AB$38),$AB$40,IF(AND($M$3=4,M44>=$AB$38),$AB$42,IF(AND($M$3=5,M44<$AC$38),$AC$40,IF(AND($M$3=5,M44>=$AC$38),$AC$42,IF(AND($M$3=6,M44<$AD$38),$AD$40,IF(AND($M$3=6,M44>=$AD$38),$AD$42,IF(AND($M$3=7,M44<$AE$38),$AE$40,IF(AND($M$3=7,M44>=$AE$38),$AE$42,IF(AND($M$3=8,M44<$AF$38),$AF$40,IF(AND($M$3=8,M44>=$AF$38),$AF$42))))))))))))))))","v":"Faut oser tirer"},{"$f":"COUNTIF($O$6:$O$35,B44)","v":0},{"$f":"IF(AND($O$3=1,O44<$Y$38),$Y$40,IF(AND($O$3=1,O44>=$Y$38),$Y$42,IF(AND($O$3=2,O44<$Z$38),$Z$40,IF(AND($O$3=2,O44>=$Z$38),$Z$42,IF(AND($O$3=3,O44<$AA$38),$AA$40,IF(AND($O$3=3,O44>=$AA$38),$AA$42,IF(AND($O$3=4,O44<$AB$38),$AB$40,IF(AND($O$3=4,O44>=$AB$38),$AB$42,IF(AND($O$3=5,O44<$AC$38),$AC$40,IF(AND($O$3=5,O44>=$AC$38),$AC$42,IF(AND($O$3=6,O44<$AD$38),$AD$40,IF(AND($O$3=6,O44>=$AD$38),$AD$42,IF(AND($O$3=7,O44<$AE$38),$AE$40,IF(AND($O$3=7,O44>=$AE$38),$AE$42,IF(AND($O$3=8,O44<$AF$38),$AF$40,IF(AND($O$3=8,O44>=$AF$38),$AF$42))))))))))))))))","v":"Pourquoi tes tirs ne rentrent pas ?"},{"$f":"COUNTIF($Q$6:$Q$35,B44)","v":0},{"$f":"IF(AND($Q$3=1,Q44<$Y$38),$Y$40,IF(AND($Q$3=1,Q44>=$Y$38),$Y$42,IF(AND($Q$3=2,Q44<$Z$38),$Z$40,IF(AND($Q$3=2,Q44>=$Z$38),$Z$42,IF(AND($Q$3=3,Q44<$AA$38),$AA$40,IF(AND($Q$3=3,Q44>=$AA$38),$AA$42,IF(AND($Q$3=4,Q44<$AB$38),$AB$40,IF(AND($Q$3=4,Q44>=$AB$38),$AB$42,IF(AND($Q$3=5,Q44<$AC$38),$AC$40,IF(AND($Q$3=5,Q44>=$AC$38),$AC$42,IF(AND($Q$3=6,Q44<$AD$38),$AD$40,IF(AND($Q$3=6,Q44>=$AD$38),$AD$42,IF(AND($Q$3=7,Q44<$AE$38),$AE$40,IF(AND($Q$3=7,Q44>=$AE$38),$AE$42,IF(AND($Q$3=8,Q44<$AF$38),$AF$40,IF(AND($Q$3=8,Q44>=$AF$38),$AF$42))))))))))))))))","v":{"$error":"#REF!"}},{"$f":"COUNTIF($S$6:$S$35,B44)","v":0},{"$f":"IF(AND($S$3=1,S44<$Y$38),$Y$40,IF(AND($S$3=1,S44>=$Y$38),$Y$42,IF(AND($S$3=2,S44<$Z$38),$Z$40,IF(AND($S$3=2,S44>=$Z$38),$Z$42,IF(AND($S$3=3,S44<$AA$38),$AA$40,IF(AND($S$3=3,S44>=$AA$38),$AA$42,IF(AND($S$3=4,S44<$AB$38),$AB$40,IF(AND($S$3=4,S44>=$AB$38),$AB$42,IF(AND($S$3=5,S44<$AC$38),$AC$40,IF(AND($S$3=5,S44>=$AC$38),$AC$42,IF(AND($S$3=6,S44<$AD$38),$AD$40,IF(AND($S$3=6,S44>=$AD$38),$AD$42,IF(AND($S$3=7,S44<$AE$38),$AE$40,IF(AND($S$3=7,S44>=$AE$38),$AE$42,IF(AND($S$3=8,S44<$AF$38),$AF$40,IF(AND($S$3=8,S44>=$AF$38),$AF$42))))))))))))))))","v":"SI tu tires il faudra être plus précis"},{"$f":"S44/SUM(M44+O44+S44)*100","v":{"$error":"#DIV/0!"}},{"$f":"IF(AND($U$3=1,U44<$Y$38),$Y$40,IF(AND($U$3=1,U44>=$Y$38),$Y$42,IF(AND($U$3=2,U44<$Z$38),$Z$40,IF(AND($U$3=2,U44>=$Z$38),$Z$42,IF(AND($U$3=3,U44<$AA$38),$AA$40,IF(AND($U$3=3,U44>=$AA$38),$AA$42,IF(AND($U$3=4,U44<$AB$38),$AB$40,IF(AND($U$3=4,U44>=$AB$38),$AB$42,IF(AND($U$3=5,U44<$AC$38),$AC$40,IF(AND($U$3=5,U44>=$AC$38),$AC$42,IF(AND($U$3=6,U44<$AD$38),$AD$40,IF(AND($U$3=6,U44>=$AD$38),$AD$42,IF(AND($U$3=7,U44<$AE$38),$AE$40,IF(AND($U$3=7,U44>=$AE$38),$AE$42,IF(AND($U$3=8,U44<$AF$38),$AF$40,IF(AND($U$3=8,U44>=$AF$38),$AF$42))))))))))))))))","v":{"$error":"#DIV/0!"}},{"$f":"B44","v":0},"Aide aux formules",{"$f":"DEBUT!Y44","v":1},{"$f":"DEBUT!Z44","v":2},{"$f":"DEBUT!AA44","v":3},{"$f":"DEBUT!AB44","v":4},{"$f":"DEBUT!AC44","v":5},{"$f":"DEBUT!AD44","v":6},{"$f":"DEBUT!AE44","v":7},{"$f":"DEBUT!AF44","v":8},9,10]
[null,"Contrats ->",null,null,null,null,null,null,null,null,null,null,null,null,null,null,null,null,null,null,null,null,"<-Contrats ",null,{"$f":"DEBUT!Y45","v":0},{"$f":"DEBUT!Z45","v":0},{"$f":"DEBUT!AA45","v":0},{"$f":"DEBUT!AB45","v":0},{"$f":"DEBUT!AC45","v":0},{"$f":"DEBUT!AD45","v":0},{"$f":"DEBUT!AE45","v":0},{"$f":"DEBUT!AF45","v":0}]
[null,{"$f":"EQUIPES!B8","v":0},{"$f":"COUNTIF($C$6:$C$35,B46)","v":0},{"$f":"IF(AND($C$3=1,C46<$Y$38),$Y$40,IF(AND($C$3=1,C46>=$Y$38),$Y$42,IF(AND($C$3=2,C46<$Z$38),$Z$40,IF(AND($C$3=2,C46>=$Z$38),$Z$42,IF(AND($C$3=3,C46<$AA$38),$AA$40,IF(AND($C$3=3,C46>=$AA$38),$AA$42,IF(AND($C$3=4,C46<$AB$38),$AB$40,IF(AND($C$3=4,C46>=$AB$38),$AB$42,IF(AND($C$3=5,C46<$AC$38),$AC$40,IF(AND($C$3=5,C46>=$AC$38),$AC$42,IF(AND($C$3=6,C46<$AD$38),$AD$40,IF(AND($C$3=6,C46>=$AD$38),$AD$42,IF(AND($C$3=7,C46<$AE$38),$AE$40,IF(AND($C$3=7,C46>=$AE$38),$AE$42,IF(AND($C$3=8,C46<$AF$38),$AF$40,IF(AND($C$3=8,C46>=$AF$38),$AF$42))))))))))))))))","v":"C'est bien tu gères la distance"},{"$f":"COUNTIF($E$6:$E$35,B46)","v":0},{"$f":"IF(AND($E$3=1,E46<$Y$38),$Y$40,IF(AND($E$3=1,E46>=$Y$38),$Y$42,IF(AND($E$3=2,E46<$Z$38),$Z$40,IF(AND($E$3=2,E46>=$Z$38),$Z$42,IF(AND($E$3=3,E46<$AA$38),$AA$40,IF(AND($E$3=3,E46>=$AA$38),$AA$42,IF(AND($E$3=4,E46<$AB$38),$AB$40,IF(AND($E$3=4,E46>=$AB$38),$AB$42,IF(AND($E$3=5,E46<$AC$38),$AC$40,IF(AND($E$3=5,E46>=$AC$38),$AC$42,IF(AND($E$3=6,E46<$AD$38),$AD$40,IF(AND($E$3=6,E46>=$AD$38),$AD$42,IF(AND($E$3=7,E46<$AE$38),$AE$40,IF(AND($E$3=7,E46>=$AE$38),$AE$42,IF(AND($E$3=8,E46<$AF$38),$AF$40,IF(AND($E$3=8,E46>=$AF$38),$AF$42))))))))))))))))","v":"Bien tu lèves la tête"},{"$f":"COUNTIF($G$6:$G$35,B46)","v":0},{"$f":"IF(AND($G$3=1,G46<$Y$38),$Y$40,IF(AND($G$3=1,G46>=$Y$38),$Y$42,IF(AND($G$3=2,G46<$Z$38),$Z$40,IF(AND($G$3=2,G46>=$Z$38),$Z$42,IF(AND($G$3=3,G46<$AA$38),$AA$40,IF(AND($G$3=3,G46>=$AA$38),$AA$42,IF(AND($G$3=4,G46<$AB$38),$AB$40,IF(AND($G$3=4,G46>=$AB$38),$AB$42,IF(AND($G$3=5,G46<$AC$38),$AC$40,IF(AND($G$3=5,G46>=$AC$38),$AC$42,IF(AND($G$3=6,G46<$AD$38),$AD$40,IF(AND($G$3=6,G46>=$AD$38),$AD$42,IF(AND($G$3=7,G46<$AE$38),$AE$40,IF(AND($G$3=7,G46>=$AE$38),$AE$42,IF(AND($G$3=8,G46<$AF$38),$AF$40,IF(AND($G$3=8,G46>=$AF$38),$AF$42))))))))))))))))","v":"Tu touches le ballon"},null,{"$f":"IF(AND($I$3=1,I46<$Y$38),$Y$40,IF(AND($I$3=1,I46>=$Y$38),$Y$42,IF(AND($I$3=2,I46<$Z$38),$Z$40,IF(AND($I$3=2,I46>=$Z$38),$Z$42,IF(AND($I$3=3,I46<$AA$38),$AA$40,IF(AND($I$3=3,I46>=$AA$38),$AA$42,IF(AND($I$3=4,I46<$AB$38),$AB$40,IF(AND($I$3=4,I46>=$AB$38),$AB$42,IF(AND($I$3=5,I46<$AC$38),$AC$40,IF(AND($I$3=5,I46>=$AC$38),$AC$42,IF(AND($I$3=6,I46<$AD$38),$AD$40,IF(AND($I$3=6,I46>=$AD$38),$AD$42,IF(AND($I$3=7,I46<$AE$38),$AE$40,IF(AND($I$3=7,I46>=$AE$38),$AE$42,IF(AND($I$3=8,I46<$AF$38),$AF$40,IF(AND($I$3=8,I46>=$AF$38),$AF$42))))))))))))))))","v":{"$error":"#REF!"}},{"$f":"COUNTIF($K$6:$K$35,B46)","v":0},{"$f":"IF(AND($K$3=1,K46<$Y$38),$Y$40,IF(AND($K$3=1,K46>=$Y$38),$Y$42,IF(AND($K$3=2,K46<$Z$38),$Z$40,IF(AND($K$3=2,K46>=$Z$38),$Z$42,IF(AND($K$3=3,K46<$AA$38),$AA$40,IF(AND($K$3=3,K46>=$AA$38),$AA$42,IF(AND($K$3=4,K46<$AB$38),$AB$40,IF(AND($K$3=4,K46>=$AB$38),$AB$42,IF(AND($K$3=5,K46<$AC$38),$AC$40,IF(AND($K$3=5,K46>=$AC$38),$AC$42,IF(AND($K$3=6,K46<$AD$38),$AD$40,IF(AND($K$3=6,K46>=$AD$38),$AD$42,IF(AND($K$3=7,K46<$AE$38),$AE$40,IF(AND($K$3=7,K46>=$AE$38),$AE$42,IF(AND($K$3=8,K46<$AF$38),$AF$40,IF(AND($K$3=8,K46>=$AF$38),$AF$42))))))))))))))))","v":{"$error":"#REF!"}},{"$f":"COUNTIF($M$6:$M$35,B46)","v":0},{"$f":"IF(AND($M$3=1,M46<$Y$38),$Y$40,IF(AND($M$3=1,M46>=$Y$38),$Y$42,IF(AND($M$3=2,M46<$Z$38),$Z$40,IF(AND($M$3=2,M46>=$Z$38),$Z$42,IF(AND($M$3=3,M46<$AA$38),$AA$40,IF(AND($M$3=3,M46>=$AA$38),$AA$42,IF(AND($M$3=4,M46<$AB$38),$AB$40,IF(AND($M$3=4,M46>=$AB$38),$AB$42,IF(AND($M$3=5,M46<$AC$38),$AC$40,IF(AND($M$3=5,M46>=$AC$38),$AC$42,IF(AND($M$3=6,M46<$AD$38),$AD$40,IF(AND($M$3=6,M46>=$AD$38),$AD$42,IF(AND($M$3=7,M46<$AE$38),$AE$40,IF(AND($M$3=7,M46>=$AE$38),$AE$42,IF(AND($M$3=8,M46<$AF$38),$AF$40,IF(AND($M$3=8,M46>=$AF$38),$AF$42))))))))))))))))","v":"Faut oser tirer"},{"$f":"COUNTIF($O$6:$O$35,B46)","v":0},{"$f":"IF(AND($O$3=1,O46<$Y$38),$Y$40,IF(AND($O$3=1,O46>=$Y$38),$Y$42,IF(AND($O$3=2,O46<$Z$38),$Z$40,IF(AND($O$3=2,O46>=$Z$38),$Z$42,IF(AND($O$3=3,O46<$AA$38),$AA$40,IF(AND($O$3=3,O46>=$AA$38),$AA$42,IF(AND($O$3=4,O46<$AB$38),$AB$40,IF(AND($O$3=4,O46>=$AB$38),$AB$42,IF(AND($O$3=5,O46<$AC$38),$AC$40,IF(AND($O$3=5,O46>=$AC$38),$AC$42,IF(AND($O$3=6,O46<$AD$38),$AD$40,IF(AND($O$3=6,O46>=$AD$38),$AD$42,IF(AND($O$3=7,O46<$AE$38),$AE$40,IF(AND($O$3=7,O46>=$AE$38),$AE$42,IF(AND($O$3=8,O46<$AF$38),$AF$40,IF(AND($O$3=8,O46>=$AF$38),$AF$42))))))))))))))))","v":"Pourquoi tes tirs ne rentrent pas ?"},{"$f":"COUNTIF($Q$6:$Q$35,B46)","v":0},{"$f":"IF(AND($Q$3=1,Q46<$Y$38),$Y$40,IF(AND($Q$3=1,Q46>=$Y$38),$Y$42,IF(AND($Q$3=2,Q46<$Z$38),$Z$40,IF(AND($Q$3=2,Q46>=$Z$38),$Z$42,IF(AND($Q$3=3,Q46<$AA$38),$AA$40,IF(AND($Q$3=3,Q46>=$AA$38),$AA$42,IF(AND($Q$3=4,Q46<$AB$38),$AB$40,IF(AND($Q$3=4,Q46>=$AB$38),$AB$42,IF(AND($Q$3=5,Q46<$AC$38),$AC$40,IF(AND($Q$3=5,Q46>=$AC$38),$AC$42,IF(AND($Q$3=6,Q46<$AD$38),$AD$40,IF(AND($Q$3=6,Q46>=$AD$38),$AD$42,IF(AND($Q$3=7,Q46<$AE$38),$AE$40,IF(AND($Q$3=7,Q46>=$AE$38),$AE$42,IF(AND($Q$3=8,Q46<$AF$38),$AF$40,IF(AND($Q$3=8,Q46>=$AF$38),$AF$42))))))))))))))))","v":{"$error":"#REF!"}},{"$f":"COUNTIF($S$6:$S$35,B46)","v":0},{"$f":"IF(AND($S$3=1,S46<$Y$38),$Y$40,IF(AND($S$3=1,S46>=$Y$38),$Y$42,IF(AND($S$3=2,S46<$Z$38),$Z$40,IF(AND($S$3=2,S46>=$Z$38),$Z$42,IF(AND($S$3=3,S46<$AA$38),$AA$40,IF(AND($S$3=3,S46>=$AA$38),$AA$42,IF(AND($S$3=4,S46<$AB$38),$AB$40,IF(AND($S$3=4,S46>=$AB$38),$AB$42,IF(AND($S$3=5,S46<$AC$38),$AC$40,IF(AND($S$3=5,S46>=$AC$38),$AC$42,IF(AND($S$3=6,S46<$AD$38),$AD$40,IF(AND($S$3=6,S46>=$AD$38),$AD$42,IF(AND($S$3=7,S46<$AE$38),$AE$40,IF(AND($S$3=7,S46>=$AE$38),$AE$42,IF(AND($S$3=8,S46<$AF$38),$AF$40,IF(AND($S$3=8,S46>=$AF$38),$AF$42))))))))))))))))","v":"SI tu tires il faudra être plus précis"},{"$f":"S46/SUM(M46+O46+S46)*100","v":{"$error":"#DIV/0!"}},{"$f":"IF(AND($U$3=1,U46<$Y$38),$Y$40,IF(AND($U$3=1,U46>=$Y$38),$Y$42,IF(AND($U$3=2,U46<$Z$38),$Z$40,IF(AND($U$3=2,U46>=$Z$38),$Z$42,IF(AND($U$3=3,U46<$AA$38),$AA$40,IF(AND($U$3=3,U46>=$AA$38),$AA$42,IF(AND($U$3=4,U46<$AB$38),$AB$40,IF(AND($U$3=4,U46>=$AB$38),$AB$42,IF(AND($U$3=5,U46<$AC$38),$AC$40,IF(AND($U$3=5,U46>=$AC$38),$AC$42,IF(AND($U$3=6,U46<$AD$38),$AD$40,IF(AND($U$3=6,U46>=$AD$38),$AD$42,IF(AND($U$3=7,U46<$AE$38),$AE$40,IF(AND($U$3=7,U46>=$AE$38),$AE$42,IF(AND($U$3=8,U46<$AF$38),$AF$40,IF(AND($U$3=8,U46>=$AF$38),$AF$42))))))))))))))))","v":{"$error":"#DIV/0!"}},{"$f":"B46","v":0},null,{"$f":"DEBUT!Y46","v":3},{"$f":"DEBUT!Z46","v":5},{"$f":"DEBUT!AA46","v":15},{"$f":"DEBUT!AB46","v":5},{"$f":"DEBUT!AC46","v":5},{"$f":"DEBUT!AD46","v":6},{"$f":"DEBUT!AE46","v":5},{"$f":"DEBUT!AF46","v":0.25}]
[null,"Contrats ->",null,null,null,null,null,null,null,null,null,null,null,null,null,null,null,null,null,null,null,null,"<-Contrats ","Contrats collectifs"]
[null,{"$f":"EQUIPES!B9","v":0},{"$f":"COUNTIF($C$6:$C$35,B48)","v":0},{"$f":"IF(AND($C$3=1,C48<$Y$38),$Y$40,IF(AND($C$3=1,C48>=$Y$38),$Y$42,IF(AND($C$3=2,C48<$Z$38),$Z$40,IF(AND($C$3=2,C48>=$Z$38),$Z$42,IF(AND($C$3=3,C48<$AA$38),$AA$40,IF(AND($C$3=3,C48>=$AA$38),$AA$42,IF(AND($C$3=4,C48<$AB$38),$AB$40,IF(AND($C$3=4,C48>=$AB$38),$AB$42,IF(AND($C$3=5,C48<$AC$38),$AC$40,IF(AND($C$3=5,C48>=$AC$38),$AC$42,IF(AND($C$3=6,C48<$AD$38),$AD$40,IF(AND($C$3=6,C48>=$AD$38),$AD$42,IF(AND($C$3=7,C48<$AE$38),$AE$40,IF(AND($C$3=7,C48>=$AE$38),$AE$42,IF(AND($C$3=8,C48<$AF$38),$AF$40,IF(AND($C$3=8,C48>=$AF$38),$AF$42))))))))))))))))","v":"C'est bien tu gères la distance"},{"$f":"COUNTIF($E$6:$E$35,B48)","v":0},{"$f":"IF(AND($E$3=1,E48<$Y$38),$Y$40,IF(AND($E$3=1,E48>=$Y$38),$Y$42,IF(AND($E$3=2,E48<$Z$38),$Z$40,IF(AND($E$3=2,E48>=$Z$38),$Z$42,IF(AND($E$3=3,E48<$AA$38),$AA$40,IF(AND($E$3=3,E48>=$AA$38),$AA$42,IF(AND($E$3=4,E48<$AB$38),$AB$40,IF(AND($E$3=4,E48>=$AB$38),$AB$42,IF(AND($E$3=5,E48<$AC$38),$AC$40,IF(AND($E$3=5,E48>=$AC$38),$AC$42,IF(AND($E$3=6,E48<$AD$38),$AD$40,IF(AND($E$3=6,E48>=$AD$38),$AD$42,IF(AND($E$3=7,E48<$AE$38),$AE$40,IF(AND($E$3=7,E48>=$AE$38),$AE$42,IF(AND($E$3=8,E48<$AF$38),$AF$40,IF(AND($E$3=8,E48>=$AF$38),$AF$42))))))))))))))))","v":"Bien tu lèves la tête"},{"$f":"COUNTIF($G$6:$G$35,B48)","v":0},{"$f":"IF(AND($G$3=1,G48<$Y$38),$Y$40,IF(AND($G$3=1,G48>=$Y$38),$Y$42,IF(AND($G$3=2,G48<$Z$38),$Z$40,IF(AND($G$3=2,G48>=$Z$38),$Z$42,IF(AND($G$3=3,G48<$AA$38),$AA$40,IF(AND($G$3=3,G48>=$AA$38),$AA$42,IF(AND($G$3=4,G48<$AB$38),$AB$40,IF(AND($G$3=4,G48>=$AB$38),$AB$42,IF(AND($G$3=5,G48<$AC$38),$AC$40,IF(AND($G$3=5,G48>=$AC$38),$AC$42,IF(AND($G$3=6,G48<$AD$38),$AD$40,IF(AND($G$3=6,G48>=$AD$38),$AD$42,IF(AND($G$3=7,G48<$AE$38),$AE$40,IF(AND($G$3=7,G48>=$AE$38),$AE$42,IF(AND($G$3=8,G48<$AF$38),$AF$40,IF(AND($G$3=8,G48>=$AF$38),$AF$42))))))))))))))))","v":"Tu touches le ballon"},null,{"$f":"IF(AND($I$3=1,I48<$Y$38),$Y$40,IF(AND($I$3=1,I48>=$Y$38),$Y$42,IF(AND($I$3=2,I48<$Z$38),$Z$40,IF(AND($I$3=2,I48>=$Z$38),$Z$42,IF(AND($I$3=3,I48<$AA$38),$AA$40,IF(AND($I$3=3,I48>=$AA$38),$AA$42,IF(AND($I$3=4,I48<$AB$38),$AB$40,IF(AND($I$3=4,I48>=$AB$38),$AB$42,IF(AND($I$3=5,I48<$AC$38),$AC$40,IF(AND($I$3=5,I48>=$AC$38),$AC$42,IF(AND($I$3=6,I48<$AD$38),$AD$40,IF(AND($I$3=6,I48>=$AD$38),$AD$42,IF(AND($I$3=7,I48<$AE$38),$AE$40,IF(AND($I$3=7,I48>=$AE$38),$AE$42,IF(AND($I$3=8,I48<$AF$38),$AF$40,IF(AND($I$3=8,I48>=$AF$38),$AF$42))))))))))))))))","v":{"$error":"#REF!"}},{"$f":"COUNTIF($K$6:$K$35,B48)","v":0},{"$f":"IF(AND($K$3=1,K48<$Y$38),$Y$40,IF(AND($K$3=1,K48>=$Y$38),$Y$42,IF(AND($K$3=2,K48<$Z$38),$Z$40,IF(AND($K$3=2,K48>=$Z$38),$Z$42,IF(AND($K$3=3,K48<$AA$38),$AA$40,IF(AND($K$3=3,K48>=$AA$38),$AA$42,IF(AND($K$3=4,K48<$AB$38),$AB$40,IF(AND($K$3=4,K48>=$AB$38),$AB$42,IF(AND($K$3=5,K48<$AC$38),$AC$40,IF(AND($K$3=5,K48>=$AC$38),$AC$42,IF(AND($K$3=6,K48<$AD$38),$AD$40,IF(AND($K$3=6,K48>=$AD$38),$AD$42,IF(AND($K$3=7,K48<$AE$38),$AE$40,IF(AND($K$3=7,K48>=$AE$38),$AE$42,IF(AND($K$3=8,K48<$AF$38),$AF$40,IF(AND($K$3=8,K48>=$AF$38),$AF$42))))))))))))))))","v":{"$error":"#REF!"}},{"$f":"COUNTIF($M$6:$M$35,B48)","v":0},{"$f":"IF(AND($M$3=1,M48<$Y$38),$Y$40,IF(AND($M$3=1,M48>=$Y$38),$Y$42,IF(AND($M$3=2,M48<$Z$38),$Z$40,IF(AND($M$3=2,M48>=$Z$38),$Z$42,IF(AND($M$3=3,M48<$AA$38),$AA$40,IF(AND($M$3=3,M48>=$AA$38),$AA$42,IF(AND($M$3=4,M48<$AB$38),$AB$40,IF(AND($M$3=4,M48>=$AB$38),$AB$42,IF(AND($M$3=5,M48<$AC$38),$AC$40,IF(AND($M$3=5,M48>=$AC$38),$AC$42,IF(AND($M$3=6,M48<$AD$38),$AD$40,IF(AND($M$3=6,M48>=$AD$38),$AD$42,IF(AND($M$3=7,M48<$AE$38),$AE$40,IF(AND($M$3=7,M48>=$AE$38),$AE$42,IF(AND($M$3=8,M48<$AF$38),$AF$40,IF(AND($M$3=8,M48>=$AF$38),$AF$42))))))))))))))))","v":"Faut oser tirer"},{"$f":"COUNTIF($O$6:$O$35,B48)","v":0},{"$f":"IF(AND($O$3=1,O48<$Y$38),$Y$40,IF(AND($O$3=1,O48>=$Y$38),$Y$42,IF(AND($O$3=2,O48<$Z$38),$Z$40,IF(AND($O$3=2,O48>=$Z$38),$Z$42,IF(AND($O$3=3,O48<$AA$38),$AA$40,IF(AND($O$3=3,O48>=$AA$38),$AA$42,IF(AND($O$3=4,O48<$AB$38),$AB$40,IF(AND($O$3=4,O48>=$AB$38),$AB$42,IF(AND($O$3=5,O48<$AC$38),$AC$40,IF(AND($O$3=5,O48>=$AC$38),$AC$42,IF(AND($O$3=6,O48<$AD$38),$AD$40,IF(AND($O$3=6,O48>=$AD$38),$AD$42,IF(AND($O$3=7,O48<$AE$38),$AE$40,IF(AND($O$3=7,O48>=$AE$38),$AE$42,IF(AND($O$3=8,O48<$AF$38),$AF$40,IF(AND($O$3=8,O48>=$AF$38),$AF$42))))))))))))))))","v":"Pourquoi tes tirs ne rentrent pas ?"},{"$f":"COUNTIF($Q$6:$Q$35,B48)","v":0},{"$f":"IF(AND($Q$3=1,Q48<$Y$38),$Y$40,IF(AND($Q$3=1,Q48>=$Y$38),$Y$42,IF(AND($Q$3=2,Q48<$Z$38),$Z$40,IF(AND($Q$3=2,Q48>=$Z$38),$Z$42,IF(AND($Q$3=3,Q48<$AA$38),$AA$40,IF(AND($Q$3=3,Q48>=$AA$38),$AA$42,IF(AND($Q$3=4,Q48<$AB$38),$AB$40,IF(AND($Q$3=4,Q48>=$AB$38),$AB$42,IF(AND($Q$3=5,Q48<$AC$38),$AC$40,IF(AND($Q$3=5,Q48>=$AC$38),$AC$42,IF(AND($Q$3=6,Q48<$AD$38),$AD$40,IF(AND($Q$3=6,Q48>=$AD$38),$AD$42,IF(AND($Q$3=7,Q48<$AE$38),$AE$40,IF(AND($Q$3=7,Q48>=$AE$38),$AE$42,IF(AND($Q$3=8,Q48<$AF$38),$AF$40,IF(AND($Q$3=8,Q48>=$AF$38),$AF$42))))))))))))))))","v":{"$error":"#REF!"}},{"$f":"COUNTIF($S$6:$S$35,B48)","v":0},{"$f":"IF(AND($S$3=1,S48<$Y$38),$Y$40,IF(AND($S$3=1,S48>=$Y$38),$Y$42,IF(AND($S$3=2,S48<$Z$38),$Z$40,IF(AND($S$3=2,S48>=$Z$38),$Z$42,IF(AND($S$3=3,S48<$AA$38),$AA$40,IF(AND($S$3=3,S48>=$AA$38),$AA$42,IF(AND($S$3=4,S48<$AB$38),$AB$40,IF(AND($S$3=4,S48>=$AB$38),$AB$42,IF(AND($S$3=5,S48<$AC$38),$AC$40,IF(AND($S$3=5,S48>=$AC$38),$AC$42,IF(AND($S$3=6,S48<$AD$38),$AD$40,IF(AND($S$3=6,S48>=$AD$38),$AD$42,IF(AND($S$3=7,S48<$AE$38),$AE$40,IF(AND($S$3=7,S48>=$AE$38),$AE$42,IF(AND($S$3=8,S48<$AF$38),$AF$40,IF(AND($S$3=8,S48>=$AF$38),$AF$42))))))))))))))))","v":"SI tu tires il faudra être plus précis"},{"$f":"S48/SUM(M48+O48+S48)*100","v":{"$error":"#DIV/0!"}},{"$f":"IF(AND($U$3=1,U48<$Y$38),$Y$40,IF(AND($U$3=1,U48>=$Y$38),$Y$42,IF(AND($U$3=2,U48<$Z$38),$Z$40,IF(AND($U$3=2,U48>=$Z$38),$Z$42,IF(AND($U$3=3,U48<$AA$38),$AA$40,IF(AND($U$3=3,U48>=$AA$38),$AA$42,IF(AND($U$3=4,U48<$AB$38),$AB$40,IF(AND($U$3=4,U48>=$AB$38),$AB$42,IF(AND($U$3=5,U48<$AC$38),$AC$40,IF(AND($U$3=5,U48>=$AC$38),$AC$42,IF(AND($U$3=6,U48<$AD$38),$AD$40,IF(AND($U$3=6,U48>=$AD$38),$AD$42,IF(AND($U$3=7,U48<$AE$38),$AE$40,IF(AND($U$3=7,U48>=$AE$38),$AE$42,IF(AND($U$3=8,U48<$AF$38),$AF$40,IF(AND($U$3=8,U48>=$AF$38),$AF$42))))))))))))))))","v":{"$error":"#DIV/0!"}},{"$f":"B48","v":0},null,{"$f":"DEBUT!Y48","v":"Vous êtes bien organisé"},{"$f":"DEBUT!Z48","v":"C'est bien vous faites des passes"},{"$f":"DEBUT!AA48","v":"Vous êtes où?"},{"$f":"DEBUT!AB48","v":"Faut se bouger davantage"},{"$f":"DEBUT!AC48","v":"Faut oser tirer"},{"$f":"DEBUT!AD48","v":"Pourquoi vos tirs ne rentrent pas ? "},{"$f":"DEBUT!AE48","v":"SI vous tirez il faudra être plus précis"},{"$f":"DEBUT!AF48","v":"Pas de chance"}]
[null,"Contrats ->",null,null,null,null,null,null,null,null,null,null,null,null,null,null,null,null,null,null,null,null,"<-Contrats "]
[null,{"$f":"EQUIPES!B10","v":0},{"$f":"COUNTIF($C$6:$C$35,B50)","v":0},{"$f":"IF(AND($C$3=1,C50<$Y$38),$Y$40,IF(AND($C$3=1,C50>=$Y$38),$Y$42,IF(AND($C$3=2,C50<$Z$38),$Z$40,IF(AND($C$3=2,C50>=$Z$38),$Z$42,IF(AND($C$3=3,C50<$AA$38),$AA$40,IF(AND($C$3=3,C50>=$AA$38),$AA$42,IF(AND($C$3=4,C50<$AB$38),$AB$40,IF(AND($C$3=4,C50>=$AB$38),$AB$42,IF(AND($C$3=5,C50<$AC$38),$AC$40,IF(AND($C$3=5,C50>=$AC$38),$AC$42,IF(AND($C$3=6,C50<$AD$38),$AD$40,IF(AND($C$3=6,C50>=$AD$38),$AD$42,IF(AND($C$3=7,C50<$AE$38),$AE$40,IF(AND($C$3=7,C50>=$AE$38),$AE$42,IF(AND($C$3=8,C50<$AF$38),$AF$40,IF(AND($C$3=8,C50>=$AF$38),$AF$42))))))))))))))))","v":"C'est bien tu gères la distance"},{"$f":"COUNTIF($E$6:$E$35,B50)","v":0},{"$f":"IF(AND($E$3=1,E50<$Y$38),$Y$40,IF(AND($E$3=1,E50>=$Y$38),$Y$42,IF(AND($E$3=2,E50<$Z$38),$Z$40,IF(AND($E$3=2,E50>=$Z$38),$Z$42,IF(AND($E$3=3,E50<$AA$38),$AA$40,IF(AND($E$3=3,E50>=$AA$38),$AA$42,IF(AND($E$3=4,E50<$AB$38),$AB$40,IF(AND($E$3=4,E50>=$AB$38),$AB$42,IF(AND($E$3=5,E50<$AC$38),$AC$40,IF(AND($E$3=5,E50>=$AC$38),$AC$42,IF(AND($E$3=6,E50<$AD$38),$AD$40,IF(AND($E$3=6,E50>=$AD$38),$AD$42,IF(AND($E$3=7,E50<$AE$38),$AE$40,IF(AND($E$3=7,E50>=$AE$38),$AE$42,IF(AND($E$3=8,E50<$AF$38),$AF$40,IF(AND($E$3=8,E50>=$AF$38),$AF$42))))))))))))))))","v":"Bien tu lèves la tête"},{"$f":"COUNTIF($G$6:$G$35,B50)","v":0},{"$f":"IF(AND($G$3=1,G50<$Y$38),$Y$40,IF(AND($G$3=1,G50>=$Y$38),$Y$42,IF(AND($G$3=2,G50<$Z$38),$Z$40,IF(AND($G$3=2,G50>=$Z$38),$Z$42,IF(AND($G$3=3,G50<$AA$38),$AA$40,IF(AND($G$3=3,G50>=$AA$38),$AA$42,IF(AND($G$3=4,G50<$AB$38),$AB$40,IF(AND($G$3=4,G50>=$AB$38),$AB$42,IF(AND($G$3=5,G50<$AC$38),$AC$40,IF(AND($G$3=5,G50>=$AC$38),$AC$42,IF(AND($G$3=6,G50<$AD$38),$AD$40,IF(AND($G$3=6,G50>=$AD$38),$AD$42,IF(AND($G$3=7,G50<$AE$38),$AE$40,IF(AND($G$3=7,G50>=$AE$38),$AE$42,IF(AND($G$3=8,G50<$AF$38),$AF$40,IF(AND($G$3=8,G50>=$AF$38),$AF$42))))))))))))))))","v":"Tu touches le ballon"},null,{"$f":"IF(AND($I$3=1,I50<$Y$38),$Y$40,IF(AND($I$3=1,I50>=$Y$38),$Y$42,IF(AND($I$3=2,I50<$Z$38),$Z$40,IF(AND($I$3=2,I50>=$Z$38),$Z$42,IF(AND($I$3=3,I50<$AA$38),$AA$40,IF(AND($I$3=3,I50>=$AA$38),$AA$42,IF(AND($I$3=4,I50<$AB$38),$AB$40,IF(AND($I$3=4,I50>=$AB$38),$AB$42,IF(AND($I$3=5,I50<$AC$38),$AC$40,IF(AND($I$3=5,I50>=$AC$38),$AC$42,IF(AND($I$3=6,I50<$AD$38),$AD$40,IF(AND($I$3=6,I50>=$AD$38),$AD$42,IF(AND($I$3=7,I50<$AE$38),$AE$40,IF(AND($I$3=7,I50>=$AE$38),$AE$42,IF(AND($I$3=8,I50<$AF$38),$AF$40,IF(AND($I$3=8,I50>=$AF$38),$AF$42))))))))))))))))","v":{"$error":"#REF!"}},{"$f":"COUNTIF($K$6:$K$35,B50)","v":0},{"$f":"IF(AND($K$3=1,K50<$Y$38),$Y$40,IF(AND($K$3=1,K50>=$Y$38),$Y$42,IF(AND($K$3=2,K50<$Z$38),$Z$40,IF(AND($K$3=2,K50>=$Z$38),$Z$42,IF(AND($K$3=3,K50<$AA$38),$AA$40,IF(AND($K$3=3,K50>=$AA$38),$AA$42,IF(AND($K$3=4,K50<$AB$38),$AB$40,IF(AND($K$3=4,K50>=$AB$38),$AB$42,IF(AND($K$3=5,K50<$AC$38),$AC$40,IF(AND($K$3=5,K50>=$AC$38),$AC$42,IF(AND($K$3=6,K50<$AD$38),$AD$40,IF(AND($K$3=6,K50>=$AD$38),$AD$42,IF(AND($K$3=7,K50<$AE$38),$AE$40,IF(AND($K$3=7,K50>=$AE$38),$AE$42,IF(AND($K$3=8,K50<$AF$38),$AF$40,IF(AND($K$3=8,K50>=$AF$38),$AF$42))))))))))))))))","v":{"$error":"#REF!"}},{"$f":"COUNTIF($M$6:$M$35,B50)","v":0},{"$f":"IF(AND($M$3=1,M50<$Y$38),$Y$40,IF(AND($M$3=1,M50>=$Y$38),$Y$42,IF(AND($M$3=2,M50<$Z$38),$Z$40,IF(AND($M$3=2,M50>=$Z$38),$Z$42,IF(AND($M$3=3,M50<$AA$38),$AA$40,IF(AND($M$3=3,M50>=$AA$38),$AA$42,IF(AND($M$3=4,M50<$AB$38),$AB$40,IF(AND($M$3=4,M50>=$AB$38),$AB$42,IF(AND($M$3=5,M50<$AC$38),$AC$40,IF(AND($M$3=5,M50>=$AC$38),$AC$42,IF(AND($M$3=6,M50<$AD$38),$AD$40,IF(AND($M$3=6,M50>=$AD$38),$AD$42,IF(AND($M$3=7,M50<$AE$38),$AE$40,IF(AND($M$3=7,M50>=$AE$38),$AE$42,IF(AND($M$3=8,M50<$AF$38),$AF$40,IF(AND($M$3=8,M50>=$AF$38),$AF$42))))))))))))))))","v":"Faut oser tirer"},{"$f":"COUNTIF($O$6:$O$35,B50)","v":0},{"$f":"IF(AND($O$3=1,O50<$Y$38),$Y$40,IF(AND($O$3=1,O50>=$Y$38),$Y$42,IF(AND($O$3=2,O50<$Z$38),$Z$40,IF(AND($O$3=2,O50>=$Z$38),$Z$42,IF(AND($O$3=3,O50<$AA$38),$AA$40,IF(AND($O$3=3,O50>=$AA$38),$AA$42,IF(AND($O$3=4,O50<$AB$38),$AB$40,IF(AND($O$3=4,O50>=$AB$38),$AB$42,IF(AND($O$3=5,O50<$AC$38),$AC$40,IF(AND($O$3=5,O50>=$AC$38),$AC$42,IF(AND($O$3=6,O50<$AD$38),$AD$40,IF(AND($O$3=6,O50>=$AD$38),$AD$42,IF(AND($O$3=7,O50<$AE$38),$AE$40,IF(AND($O$3=7,O50>=$AE$38),$AE$42,IF(AND($O$3=8,O50<$AF$38),$AF$40,IF(AND($O$3=8,O50>=$AF$38),$AF$42))))))))))))))))","v":"Pourquoi tes tirs ne rentrent pas ?"},{"$f":"COUNTIF($Q$6:$Q$35,B50)","v":0},{"$f":"IF(AND($Q$3=1,Q50<$Y$38),$Y$40,IF(AND($Q$3=1,Q50>=$Y$38),$Y$42,IF(AND($Q$3=2,Q50<$Z$38),$Z$40,IF(AND($Q$3=2,Q50>=$Z$38),$Z$42,IF(AND($Q$3=3,Q50<$AA$38),$AA$40,IF(AND($Q$3=3,Q50>=$AA$38),$AA$42,IF(AND($Q$3=4,Q50<$AB$38),$AB$40,IF(AND($Q$3=4,Q50>=$AB$38),$AB$42,IF(AND($Q$3=5,Q50<$AC$38),$AC$40,IF(AND($Q$3=5,Q50>=$AC$38),$AC$42,IF(AND($Q$3=6,Q50<$AD$38),$AD$40,IF(AND($Q$3=6,Q50>=$AD$38),$AD$42,IF(AND($Q$3=7,Q50<$AE$38),$AE$40,IF(AND($Q$3=7,Q50>=$AE$38),$AE$42,IF(AND($Q$3=8,Q50<$AF$38),$AF$40,IF(AND($Q$3=8,Q50>=$AF$38),$AF$42))))))))))))))))","v":{"$error":"#REF!"}},{"$f":"COUNTIF($S$6:$S$35,B50)","v":0},{"$f":"IF(AND($S$3=1,S50<$Y$38),$Y$40,IF(AND($S$3=1,S50>=$Y$38),$Y$42,IF(AND($S$3=2,S50<$Z$38),$Z$40,IF(AND($S$3=2,S50>=$Z$38),$Z$42,IF(AND($S$3=3,S50<$AA$38),$AA$40,IF(AND($S$3=3,S50>=$AA$38),$AA$42,IF(AND($S$3=4,S50<$AB$38),$AB$40,IF(AND($S$3=4,S50>=$AB$38),$AB$42,IF(AND($S$3=5,S50<$AC$38),$AC$40,IF(AND($S$3=5,S50>=$AC$38),$AC$42,IF(AND($S$3=6,S50<$AD$38),$AD$40,IF(AND($S$3=6,S50>=$AD$38),$AD$42,IF(AND($S$3=7,S50<$AE$38),$AE$40,IF(AND($S$3=7,S50>=$AE$38),$AE$42,IF(AND($S$3=8,S50<$AF$38),$AF$40,IF(AND($S$3=8,S50>=$AF$38),$AF$42))))))))))))))))","v":"SI tu tires il faudra être plus précis"},{"$f":"S50/SUM(M50+O50+S50)*100","v":{"$error":"#DIV/0!"}},{"$f":"IF(AND($U$3=1,U50<$Y$38),$Y$40,IF(AND($U$3=1,U50>=$Y$38),$Y$42,IF(AND($U$3=2,U50<$Z$38),$Z$40,IF(AND($U$3=2,U50>=$Z$38),$Z$42,IF(AND($U$3=3,U50<$AA$38),$AA$40,IF(AND($U$3=3,U50>=$AA$38),$AA$42,IF(AND($U$3=4,U50<$AB$38),$AB$40,IF(AND($U$3=4,U50>=$AB$38),$AB$42,IF(AND($U$3=5,U50<$AC$38),$AC$40,IF(AND($U$3=5,U50>=$AC$38),$AC$42,IF(AND($U$3=6,U50<$AD$38),$AD$40,IF(AND($U$3=6,U50>=$AD$38),$AD$42,IF(AND($U$3=7,U50<$AE$38),$AE$40,IF(AND($U$3=7,U50>=$AE$38),$AE$42,IF(AND($U$3=8,U50<$AF$38),$AF$40,IF(AND($U$3=8,U50>=$AF$38),$AF$42))))))))))))))))","v":{"$error":"#DIV/0!"}},{"$f":"B50","v":0},null,{"$f":"DEBUT!Y50","v":"Trop de fautes collectives"},{"$f":"DEBUT!Z50","v":"Trop de ballons perdus"},{"$f":"DEBUT!AA50","v":"Bonne activité collective"},{"$f":"DEBUT!AB50","v":"Bien harcelé"},{"$f":"DEBUT!AC50","v":"Bien essayé mais faudra travailler l'adresse"},{"$f":"DEBUT!AD50","v":"On va travailler la précision"},{"$f":"DEBUT!AE50","v":"Joli"},{"$f":"DEBUT!AF50","v":"Bien visé"}]
[null,"Contrats ->",null,null,null,null,null,null,null,null,null,null,null,null,null,null,null,null,null,null,null,null,"<-Contrats "]
[null,{"$f":"EQUIPES!B11","v":"Emmanuel"},{"$f":"COUNTIF($C$6:$C$35,B52)","v":0},{"$f":"IF(AND($C$3=1,C52<$Y$38),$Y$40,IF(AND($C$3=1,C52>=$Y$38),$Y$42,IF(AND($C$3=2,C52<$Z$38),$Z$40,IF(AND($C$3=2,C52>=$Z$38),$Z$42,IF(AND($C$3=3,C52<$AA$38),$AA$40,IF(AND($C$3=3,C52>=$AA$38),$AA$42,IF(AND($C$3=4,C52<$AB$38),$AB$40,IF(AND($C$3=4,C52>=$AB$38),$AB$42,IF(AND($C$3=5,C52<$AC$38),$AC$40,IF(AND($C$3=5,C52>=$AC$38),$AC$42,IF(AND($C$3=6,C52<$AD$38),$AD$40,IF(AND($C$3=6,C52>=$AD$38),$AD$42,IF(AND($C$3=7,C52<$AE$38),$AE$40,IF(AND($C$3=7,C52>=$AE$38),$AE$42,IF(AND($C$3=8,C52<$AF$38),$AF$40,IF(AND($C$3=8,C52>=$AF$38),$AF$42))))))))))))))))","v":"C'est bien tu gères la distance"},{"$f":"COUNTIF($E$6:$E$35,B52)","v":0},{"$f":"IF(AND($E$3=1,E52<$Y$38),$Y$40,IF(AND($E$3=1,E52>=$Y$38),$Y$42,IF(AND($E$3=2,E52<$Z$38),$Z$40,IF(AND($E$3=2,E52>=$Z$38),$Z$42,IF(AND($E$3=3,E52<$AA$38),$AA$40,IF(AND($E$3=3,E52>=$AA$38),$AA$42,IF(AND($E$3=4,E52<$AB$38),$AB$40,IF(AND($E$3=4,E52>=$AB$38),$AB$42,IF(AND($E$3=5,E52<$AC$38),$AC$40,IF(AND($E$3=5,E52>=$AC$38),$AC$42,IF(AND($E$3=6,E52<$AD$38),$AD$40,IF(AND($E$3=6,E52>=$AD$38),$AD$42,IF(AND($E$3=7,E52<$AE$38),$AE$40,IF(AND($E$3=7,E52>=$AE$38),$AE$42,IF(AND($E$3=8,E52<$AF$38),$AF$40,IF(AND($E$3=8,E52>=$AF$38),$AF$42))))))))))))))))","v":"Bien tu lèves la tête"},{"$f":"COUNTIF($G$6:$G$35,B52)","v":0},{"$f":"IF(AND($G$3=1,G52<$Y$38),$Y$40,IF(AND($G$3=1,G52>=$Y$38),$Y$42,IF(AND($G$3=2,G52<$Z$38),$Z$40,IF(AND($G$3=2,G52>=$Z$38),$Z$42,IF(AND($G$3=3,G52<$AA$38),$AA$40,IF(AND($G$3=3,G52>=$AA$38),$AA$42,IF(AND($G$3=4,G52<$AB$38),$AB$40,IF(AND($G$3=4,G52>=$AB$38),$AB$42,IF(AND($G$3=5,G52<$AC$38),$AC$40,IF(AND($G$3=5,G52>=$AC$38),$AC$42,IF(AND($G$3=6,G52<$AD$38),$AD$40,IF(AND($G$3=6,G52>=$AD$38),$AD$42,IF(AND($G$3=7,G52<$AE$38),$AE$40,IF(AND($G$3=7,G52>=$AE$38),$AE$42,IF(AND($G$3=8,G52<$AF$38),$AF$40,IF(AND($G$3=8,G52>=$AF$38),$AF$42))))))))))))))))","v":"Tu touches le ballon"},null,{"$f":"IF(AND($I$3=1,I52<$Y$38),$Y$40,IF(AND($I$3=1,I52>=$Y$38),$Y$42,IF(AND($I$3=2,I52<$Z$38),$Z$40,IF(AND($I$3=2,I52>=$Z$38),$Z$42,IF(AND($I$3=3,I52<$AA$38),$AA$40,IF(AND($I$3=3,I52>=$AA$38),$AA$42,IF(AND($I$3=4,I52<$AB$38),$AB$40,IF(AND($I$3=4,I52>=$AB$38),$AB$42,IF(AND($I$3=5,I52<$AC$38),$AC$40,IF(AND($I$3=5,I52>=$AC$38),$AC$42,IF(AND($I$3=6,I52<$AD$38),$AD$40,IF(AND($I$3=6,I52>=$AD$38),$AD$42,IF(AND($I$3=7,I52<$AE$38),$AE$40,IF(AND($I$3=7,I52>=$AE$38),$AE$42,IF(AND($I$3=8,I52<$AF$38),$AF$40,IF(AND($I$3=8,I52>=$AF$38),$AF$42))))))))))))))))","v":{"$error":"#REF!"}},{"$f":"COUNTIF($K$6:$K$35,B52)","v":0},{"$f":"IF(AND($K$3=1,K52<$Y$38),$Y$40,IF(AND($K$3=1,K52>=$Y$38),$Y$42,IF(AND($K$3=2,K52<$Z$38),$Z$40,IF(AND($K$3=2,K52>=$Z$38),$Z$42,IF(AND($K$3=3,K52<$AA$38),$AA$40,IF(AND($K$3=3,K52>=$AA$38),$AA$42,IF(AND($K$3=4,K52<$AB$38),$AB$40,IF(AND($K$3=4,K52>=$AB$38),$AB$42,IF(AND($K$3=5,K52<$AC$38),$AC$40,IF(AND($K$3=5,K52>=$AC$38),$AC$42,IF(AND($K$3=6,K52<$AD$38),$AD$40,IF(AND($K$3=6,K52>=$AD$38),$AD$42,IF(AND($K$3=7,K52<$AE$38),$AE$40,IF(AND($K$3=7,K52>=$AE$38),$AE$42,IF(AND($K$3=8,K52<$AF$38),$AF$40,IF(AND($K$3=8,K52>=$AF$38),$AF$42))))))))))))))))","v":{"$error":"#REF!"}},{"$f":"COUNTIF($M$6:$M$35,B52)","v":0},{"$f":"IF(AND($M$3=1,M52<$Y$38),$Y$40,IF(AND($M$3=1,M52>=$Y$38),$Y$42,IF(AND($M$3=2,M52<$Z$38),$Z$40,IF(AND($M$3=2,M52>=$Z$38),$Z$42,IF(AND($M$3=3,M52<$AA$38),$AA$40,IF(AND($M$3=3,M52>=$AA$38),$AA$42,IF(AND($M$3=4,M52<$AB$38),$AB$40,IF(AND($M$3=4,M52>=$AB$38),$AB$42,IF(AND($M$3=5,M52<$AC$38),$AC$40,IF(AND($M$3=5,M52>=$AC$38),$AC$42,IF(AND($M$3=6,M52<$AD$38),$AD$40,IF(AND($M$3=6,M52>=$AD$38),$AD$42,IF(AND($M$3=7,M52<$AE$38),$AE$40,IF(AND($M$3=7,M52>=$AE$38),$AE$42,IF(AND($M$3=8,M52<$AF$38),$AF$40,IF(AND($M$3=8,M52>=$AF$38),$AF$42))))))))))))))))","v":"Faut oser tirer"},{"$f":"COUNTIF($O$6:$O$35,B52)","v":0},{"$f":"IF(AND($O$3=1,O52<$Y$38),$Y$40,IF(AND($O$3=1,O52>=$Y$38),$Y$42,IF(AND($O$3=2,O52<$Z$38),$Z$40,IF(AND($O$3=2,O52>=$Z$38),$Z$42,IF(AND($O$3=3,O52<$AA$38),$AA$40,IF(AND($O$3=3,O52>=$AA$38),$AA$42,IF(AND($O$3=4,O52<$AB$38),$AB$40,IF(AND($O$3=4,O52>=$AB$38),$AB$42,IF(AND($O$3=5,O52<$AC$38),$AC$40,IF(AND($O$3=5,O52>=$AC$38),$AC$42,IF(AND($O$3=6,O52<$AD$38),$AD$40,IF(AND($O$3=6,O52>=$AD$38),$AD$42,IF(AND($O$3=7,O52<$AE$38),$AE$40,IF(AND($O$3=7,O52>=$AE$38),$AE$42,IF(AND($O$3=8,O52<$AF$38),$AF$40,IF(AND($O$3=8,O52>=$AF$38),$AF$42))))))))))))))))","v":"Pourquoi tes tirs ne rentrent pas ?"},{"$f":"COUNTIF($Q$6:$Q$35,B52)","v":0},{"$f":"IF(AND($Q$3=1,Q52<$Y$38),$Y$40,IF(AND($Q$3=1,Q52>=$Y$38),$Y$42,IF(AND($Q$3=2,Q52<$Z$38),$Z$40,IF(AND($Q$3=2,Q52>=$Z$38),$Z$42,IF(AND($Q$3=3,Q52<$AA$38),$AA$40,IF(AND($Q$3=3,Q52>=$AA$38),$AA$42,IF(AND($Q$3=4,Q52<$AB$38),$AB$40,IF(AND($Q$3=4,Q52>=$AB$38),$AB$42,IF(AND($Q$3=5,Q52<$AC$38),$AC$40,IF(AND($Q$3=5,Q52>=$AC$38),$AC$42,IF(AND($Q$3=6,Q52<$AD$38),$AD$40,IF(AND($Q$3=6,Q52>=$AD$38),$AD$42,IF(AND($Q$3=7,Q52<$AE$38),$AE$40,IF(AND($Q$3=7,Q52>=$AE$38),$AE$42,IF(AND($Q$3=8,Q52<$AF$38),$AF$40,IF(AND($Q$3=8,Q52>=$AF$38),$AF$42))))))))))))))))","v":{"$error":"#REF!"}},{"$f":"COUNTIF($S$6:$S$35,B52)","v":0},{"$f":"IF(AND($S$3=1,S52<$Y$38),$Y$40,IF(AND($S$3=1,S52>=$Y$38),$Y$42,IF(AND($S$3=2,S52<$Z$38),$Z$40,IF(AND($S$3=2,S52>=$Z$38),$Z$42,IF(AND($S$3=3,S52<$AA$38),$AA$40,IF(AND($S$3=3,S52>=$AA$38),$AA$42,IF(AND($S$3=4,S52<$AB$38),$AB$40,IF(AND($S$3=4,S52>=$AB$38),$AB$42,IF(AND($S$3=5,S52<$AC$38),$AC$40,IF(AND($S$3=5,S52>=$AC$38),$AC$42,IF(AND($S$3=6,S52<$AD$38),$AD$40,IF(AND($S$3=6,S52>=$AD$38),$AD$42,IF(AND($S$3=7,S52<$AE$38),$AE$40,IF(AND($S$3=7,S52>=$AE$38),$AE$42,IF(AND($S$3=8,S52<$AF$38),$AF$40,IF(AND($S$3=8,S52>=$AF$38),$AF$42))))))))))))))))","v":"SI tu tires il faudra être plus précis"},{"$f":"S52/SUM(M52+O52+S52)*100","v":{"$error":"#DIV/0!"}},{"$f":"IF(AND($U$3=1,U52<$Y$38),$Y$40,IF(AND($U$3=1,U52>=$Y$38),$Y$42,IF(AND($U$3=2,U52<$Z$38),$Z$40,IF(AND($U$3=2,U52>=$Z$38),$Z$42,IF(AND($U$3=3,U52<$AA$38),$AA$40,IF(AND($U$3=3,U52>=$AA$38),$AA$42,IF(AND($U$3=4,U52<$AB$38),$AB$40,IF(AND($U$3=4,U52>=$AB$38),$AB$42,IF(AND($U$3=5,U52<$AC$38),$AC$40,IF(AND($U$3=5,U52>=$AC$38),$AC$42,IF(AND($U$3=6,U52<$AD$38),$AD$40,IF(AND($U$3=6,U52>=$AD$38),$AD$42,IF(AND($U$3=7,U52<$AE$38),$AE$40,IF(AND($U$3=7,U52>=$AE$38),$AE$42,IF(AND($U$3=8,U52<$AF$38),$AF$40,IF(AND($U$3=8,U52>=$AF$38),$AF$42))))))))))))))))","v":{"$error":"#DIV/0!"}},{"$f":"B52","v":"Emmanuel"}]
[null,"Contrats ->",null,null,null,null,null,null,null,null,0,null,null,null,null,null,null,null,null,null,null,null,"<-Contrats "]
[]
[null,{"$f":"B36","v":"VERT"},{"$f":"C36","v":1},"Vous êtes bien organisé",0,"C'est bien vous faites des passes",0,"Vous êtes où?",0,{"$error":"#REF!"},0,{"$error":"#REF!"},0,"Faut oser tirer",0,"Pourquoi vos tirs ne rentrent pas ? ",0,{"$error":"#REF!"},0,"SI vous tirez il faudra être plus précis",{"$error":"#DIV/0!"},"Bien visé"]
[null,"Contrats ->"]
[]
[null,"EQUIPE","FAUTES\n/POSSESSION",null,"PERTE DE BALLE\n/POSSESSION",null,null,null,null,null,"RECUPERATION\n/POSSESSION",null,null,null,"TIR\n/POSSESSION",null,"CONTRE ATTAQUE\n/POSSESSION",null,"PANIER\n/POSSESSION",null,"TIR REUSSI\n/TIR TENTE",null,null,null,"FAUTES/POSSESSION","PERTE DE BALLE /POSSESSION","RECUPERATION /POSSESSION","CONTRE ATTAQUE /POSSESSION","ATTEINTE ZONE AVANT /POSSESSION","TIR REUSSI / TIR TENTE","TIR /POSSESSION","PANIER /POSSESSION"]
[null,{"$f":"B55","v":"VERT"},{"$f":"C55/G5","v":{"$error":"#DIV/0!"}},{"$f":"IF(C59>Y60,Y64,Y62)","v":{"$error":"#DIV/0!"}},{"$f":"#REF!/G5","v":{"$error":"#REF!"}},{"$f":"IF(E59>Z60,Z64,Z62)","v":{"$error":"#REF!"}},null,null,null,null,{"$f":"K55/K35","v":{"$error":"#DIV/0!"}},{"$f":"IF(K59>AA60,AA64,AA62)","v":{"$error":"#DIV/0!"}},null,null,{"$f":"O55/G5","v":{"$error":"#DIV/0!"}},{"$f":"IF(O59>AE60,AE64,AE62)","v":{"$error":"#DIV/0!"}},null,null,{"$f":"S55/G5","v":{"$error":"#DIV/0!"}},{"$f":"IF(S59>AF60,AF64,AF62)","v":{"$error":"#DIV/0!"}},{"$f":"S55/(M55+O55+S55)","v":{"$error":"#DIV/0!"}},{"$f":"IF(U59>AD60,AD64,AD62)","v":{"$error":"#DIV/0!"}}]
[null,"Contrats ->",null,null,null,null,null,null,null,null,null,null,null,null,null,null,null,null,null,null,null,null,null,null,0.05,0.1,0.2,0.5,null,0.3,0.5,0.3]
[null,"PROFILS DE JEU ET SITUATIONS A TRAVAILLER"]
[null,null,"MON POINT FORT",null,"MON POINT FAIBLE",null,"JE VEUX TRAVAILLER …",null,null,null,"SITUATIONS A TRAVAILLER n°",null,"Nom de la situation A TRAVAILLER",null,null,null,null,null,"PROFIL DE JEU DE NOTRE EQUIPE",null,"Nom de la SITUATION A TRAVAILLER",null,null,null,"Bonne maitrise","c'est bien vous demandez le ballon","Allez on s'organise un peu","Dès récupération du ballon il faut s'organiser ensemble","Trop de ballons perdus","Manque d'adresse","Chaque action devrait aboutir à un bon tir","Il faut shooter plus"]
[null,{"$f":"B38","v":"Alexis F."},"TIR",null,"DEFENSE INDIVIDUELLE",null,"PASSE",null,null,null,{"$f":"VLOOKUP(C63,#REF!,4,TRUE)","v":{"$error":"#REF!"}},null,{"$f":"VLOOKUP(G63,DEBUT!$R$3:$V$12,2,FALSE)","v":{"$error":"#N/A"}},null,null,null,null,null,"Contre attaque",null,{"$f":"VLOOKUP(S63,DEBUT!R13:V26,2,FALSE)","v":{"$error":"#N/A"}}]
[null,{"$f":"B40","v":0},"PASSE",null,"DEFENSE INDIVIDUELLE",null,"TIR",null,null,null,{"$f":"VLOOKUP(C64,#REF!,4,TRUE)","v":{"$error":"#REF!"}},null,{"$f":"VLOOKUP(G64,DEBUT!$R$3:$V$12,2,FALSE)","v":{"$error":"#N/A"}},null,null,null,null,null,null,null,null,null,null,null,"Faut se calmer","Trop de ballon perdu : faut lever la t^te","ça défend bien","ça va vite chez vous","Maintenant il faut réussir à tirer","Oh mais c'est Golden State","C'est bien mais faut travailler l'adresse","Efficacité"]
[null,{"$f":"B42","v":0},null,null,"DEFENSE INDIVIDUELLE",null,"TIR",null,null,null,{"$f":"VLOOKUP(C65,#REF!,4,TRUE)","v":{"$error":"#REF!"}},null,{"$f":"VLOOKUP(G65,DEBUT!$R$3:$V$12,2,FALSE)","v":{"$error":"#N/A"}}]
[null,{"$f":"B44","v":0},null,null,"DEFENSE INDIVIDUELLE",null,"TIR",null,null,null,{"$f":"VLOOKUP(C66,#REF!,4,TRUE)","v":{"$error":"#REF!"}},null,{"$f":"VLOOKUP(G66,DEBUT!$R$3:$V$12,2,FALSE)","v":{"$error":"#N/A"}}]
[null,{"$f":"B46","v":0},null,null,"DEFENSE INDIVIDUELLE",null,"TIR",null,null,null,{"$f":"VLOOKUP(C67,#REF!,4,TRUE)","v":{"$error":"#REF!"}},null,{"$f":"VLOOKUP(G67,DEBUT!$R$3:$V$12,2,FALSE)","v":{"$error":"#N/A"}}]
[null,{"$f":"B48","v":0},null,null,"DEFENSE INDIVIDUELLE",null,"TIR",null,null,null,{"$f":"VLOOKUP(C68,#REF!,4,TRUE)","v":{"$error":"#REF!"}},null,{"$f":"VLOOKUP(G68,DEBUT!$R$3:$V$12,2,FALSE)","v":{"$error":"#N/A"}}]
[null,{"$f":"B50","v":0},null,null,"DEFENSE INDIVIDUELLE",null,"TIR",null,null,null,{"$f":"VLOOKUP(C69,#REF!,4,TRUE)","v":{"$error":"#REF!"}},null,{"$f":"VLOOKUP(G69,DEBUT!$R$3:$V$12,2,FALSE)","v":{"$error":"#N/A"}}]
[null,{"$f":"B52","v":"Emmanuel"},null,null,"DEFENSE INDIVIDUELLE",null,"TIR",null,null,null,{"$f":"VLOOKUP(C70,#REF!,4,TRUE)","v":{"$error":"#REF!"}},null,{"$f":"VLOOKUP(G70,DEBUT!$R$3:$V$12,2,FALSE)","v":{"$error":"#N/A"}}]
[]
[null,null,null,"Le profil de jeu peut être choisi par l'élève à partir de l'analyse de ses stats ou alors à partir d'une formule du type : si TIR = 0 alors travailler SA1"]

{"sheet":"STATS CLASSE","index":6,"n_rows":38,"n_cols":22,"rows_kept":38,"cut":false,"hidden":false,"merged":[[37,21,37,22],[31,21,31,22],[32,21,32,22],[33,21,33,22],[34,21,34,22],[35,21,35,22],[36,21,36,22],[25,21,25,22],[26,21,26,22],[27,21,27,22],[28,21,28,22],[29,21,29,22],[30,21,30,22],[20,21,20,22],[21,21,21,22],[22,21,22,22],[23,21,23,22],[24,21,24,22],[13,21,13,22],[14,21,14,22],[15,21,15,22],[16,21,16,22],[17,21,17,22],[18,21,18,22],[7,21,7,22],[8,21,8,22],[9,21,9,22],[10,21,10,22],[11,21,11,22],[12,21,12,22],[36,19,36,20],[37,3,37,4],[37,5,37,6],[37,7,37,8],[37,13,37,14],[37,15,37,16],[37,19,37,20],[36,7,36,8],[36,13,36,14],[36,15,36,16],[35,15,35,16],[35,19,35,20],[35,13,35,14],[34,13,34,14],[34,15,34,16],[34,19,34,20],[33,13,33,14],[19,21,19,22],[6,1,13,1],[14,1,21,1],[22,1,29,1],[30,1,37,1],[36,3,36,4],[36,5,36,6],[35,3,35,4],[35,5,35,6],[35,7,35,8],[34,3,34,4],[34,5,34,6],[34,7,34,8],[33,3,33,4],[33,5,33,6],[33,7,33,8],[30,3,30,4],[30,5,30,6],[30,7,30,8],[28,3,28,4],[28,5,28,6],[28,7,28,8],[26,3,26,4],[26,5,26,6],[26,7,26,8],[33,15,33,16],[33,19,33,20],[32,3,32,4],[32,5,32,6],[32,7,32,8],[32,13,32,14],[32,15,32,16],[32,19,32,20],[31,3,31,4],[31,5,31,6],[31,7,31,8],[31,13,31,14],[31,15,31,16],[31,19,31,20],[30,13,30,14],[30,15,30,16],[30,19,30,20],[29,3,29,4],[29,5,29,6],[29,7,29,8],[29,13,29,14],[29,15,29,16],[29,19,29,20],[28,13,28,14],[28,15,28,16],[28,19,28,20],[27,3,27,4],[27,5,27,6],[27,7,27,8],[27,13,27,14],[27,15,27,16],[27,19,27,20],[26,13,26,14],[26,15,26,16],[26,19,26,20],[25,3,25,4],[25,5,25,6],[25,7,25,8],[25,13,25,14],[25,15,25,16],[25,19,25,20],[24,3,24,4],[24,5,24,6],[24,7,24,8],[24,13,24,14],[24,15,24,16],[24,19,24,20],[23,3,23,4],[23,5,23,6],[23,7,23,8],[23,13,23,14],[23,15,23,16],[23,19,23,20],[22,3,22,4],[22,5,22,6],[22,7,22,8],[22,13,22,14],[22,15,22,16],[22,19,22,20],[21,3,21,4],[21,5,21,6],[21,7,21,8],[21,13,21,14],[21,15,21,16],[21,19,21,20],[20,3,20,4],[20,5,20,6],[20,7,20,8],[20,13,20,14],[20,15,20,16],[20,19,20,20],[19,3,19,4],[19,5,19,6],[19,7,19,8],[19,13,19,14],[19,15,19,16],[19,19,19,20],[18,3,18,4],[18,5,18,6],[18,7,18,8],[18,13,18,14],[18,15,18,16],[18,19,18,20],[17,3,17,4],[17,5,17,6],[17,7,17,8],[17,13,17,14],[17,15,17,16],[17,19,17,20],[16,3,16,4],[16,5,16,6],[16,7,16,8],[16,13,16,14],[16,15,16,16],[16,19,16,20],[15,3,15,4],[15,5,15,6],[15,7,15,8],[15,13,15,14],[15,15,15,16],[15,19,15,20],[14,3,14,4],[14,5,14,6],[14,7,14,8],[14,13,14,14],[14,15,14,16],[14,19,14,20],[13,3,13,4],[13,5,13,6],[13,7,13,8],[13,13,13,14],[13,15,13,16],[13,19,13,20],[12,3,12,4],[12,5,12,6],[12,7,12,8],[12,13,12,14],[12,15,12,16],[12,19,12,20],[11,3,11,4],[11,5,11,6],[11,7,11,8],[11,13,11,14],[11,15,11,16],[11,19,11,20],[10,3,10,4],[10,5,10,6],[10,7,10,8],[10,13,10,14],[10,15,10,16],[10,19,10,20],[9,3,9,4],[9,5,9,6],[9,7,9,8],[9,13,9,14],[9,15,9,16],[9,19,9,20],[8,3,8,4],[8,5,8,6],[8,7,8,8],[8,13,8,14],[8,15,8,16],[8,19,8,20],[7,3,7,4],[7,5,7,6],[7,7,7,8],[7,13,7,14],[7,15,7,16],[7,19,7,20],[6,3,6,4],[6,5,6,6],[6,7,6,8],[6,13,6,14],[6,15,6,16],[6,19,6,20],[4,17,5,18],[4,19,5,20],[4,21,5,22],[5,7,5,8],[5,9,5,10],[5,11,5,12],[4,3,5,4],[4,5,5,6],[4,7,4,12],[4,13,5,14],[4,15,5,16],[6,21,6,22]]}
[]
[]
[]
[]
[null,null,null,{"$f":"'OBS1'!C4","v":"FAUTE"},null,{"$f":"'OBS1'!E4","v":"BALLON PERDU"},null,{"$f":"'OBS1'!G4","v":"POSSESSION"},null,null,null,null,null,{"$f":"'OBS1'!M4","v":"TIRS"},null,{"$f":"'OBS1'!O4","v":"BONS TIRS"},null,"PANIERS",null,{"$f":"'OBS1'!S4","v":"PANIERS"},null,{"$f":"'OBS1'!U4","v":"% REUSSITE"}]
[null,null,null,null,null,null,null,0]
[null,{"$f":"EQUIPES!B3","v":"BLEU"},{"$f":"EQUIPES!B4","v":"Alexis F."},{"$f":"VLOOKUP($C$7,'OBS1'!$B$38:$V$53,2,FALSE)","v":0},null,{"$f":"VLOOKUP($C$7,'OBS1'!$B$38:$V$53,4,FALSE)","v":0},null,{"$f":"VLOOKUP($C$7,'OBS1'!$B$38:$V$53,6,FALSE)","v":0},null,null,null,null,null,{"$f":"VLOOKUP($C$7,'OBS1'!$B$38:$V$53,8,FALSE)","v":0},null,{"$f":"VLOOKUP($C$7,'OBS1'!$B$38:$V$53,10,FALSE)","v":0},null,null,null,{"$f":"VLOOKUP($C$7,'OBS1'!$B$38:$V$53,12,FALSE)","v":0},null,{"$f":"VLOOKUP($C$7,'OBS1'!$B$38:$V$53,14,FALSE)","v":0}]
[null,null,{"$f":"EQUIPES!B5","v":0},{"$f":"VLOOKUP($C$8,'OBS1'!$B$38:$V$53,2,FALSE)","v":0},null,{"$f":"VLOOKUP($C$8,'OBS1'!$B$38:$V$53,4,FALSE)","v":0},null,{"$f":"VLOOKUP($C$8,'OBS1'!$B$38:$V$53,6,FALSE)","v":0},null,null,null,null,null,{"$f":"VLOOKUP($C$8,'OBS1'!$B$38:$V$53,8,FALSE)","v":0},null,{"$f":"VLOOKUP($C$8,'OBS1'!$B$38:$V$53,10,FALSE)","v":0},null,null,null,{"$f":"VLOOKUP($C$8,'OBS1'!$B$38:$V$53,12,FALSE)","v":0},null,{"$f":"VLOOKUP($C$8,'OBS1'!$B$38:$V$53,14,FALSE)","v":0}]
[null,null,{"$f":"EQUIPES!B6","v":0},{"$f":"VLOOKUP($C$9,'OBS1'!$B$38:$V$53,2,FALSE)","v":0},null,{"$f":"VLOOKUP($C$9,'OBS1'!$B$38:$V$53,4,FALSE)","v":0},null,{"$f":"VLOOKUP($C$9,'OBS1'!$B$38:$V$53,6,FALSE)","v":0},null,null,null,null,null,{"$f":"VLOOKUP($C$9,'OBS1'!$B$38:$V$53,8,FALSE)","v":0},null,{"$f":"VLOOKUP($C$9,'OBS1'!$B$38:$V$53,10,FALSE)","v":0},null,null,null,{"$f":"VLOOKUP($C$9,'OBS1'!$B$38:$V$53,12,FALSE)","v":0},null,{"$f":"VLOOKUP($C$9,'OBS1'!$B$38:$V$53,14,FALSE)","v":0}]
[null,null,{"$f":"EQUIPES!B7","v":0},{"$f":"VLOOKUP($C$10,'OBS1'!$B$38:$V$53,2,FALSE)","v":0},null,{"$f":"VLOOKUP($C$10,'OBS1'!$B$38:$V$53,4,FALSE)","v":0},null,{"$f":"VLOOKUP($C$10,'OBS1'!$B$38:$V$53,6,FALSE)","v":0},null,null,null,null,null,{"$f":"VLOOKUP($C$10,'OBS1'!$B$38:$V$53,8,FALSE)","v":0},null,{"$f":"VLOOKUP($C$10,'OBS1'!$B$38:$V$53,10,FALSE)","v":0},null,null,null,{"$f":"VLOOKUP($C$10,'OBS1'!$B$38:$V$53,12,FALSE)","v":0},null,{"$f":"VLOOKUP($C$10,'OBS1'!$B$38:$V$53,14,FALSE)","v":0}]
[null,null,{"$f":"EQUIPES!B8","v":0},{"$f":"VLOOKUP($C$11,'OBS1'!$B$38:$V$53,2,FALSE)","v":0},null,{"$f":"VLOOKUP($C$11,'OBS1'!$B$38:$V$53,4,FALSE)","v":0},null,{"$f":"VLOOKUP($C$11,'OBS1'!$B$38:$V$53,6,FALSE)","v":0},null,null,null,null,null,{"$f":"VLOOKUP($C$11,'OBS1'!$B$38:$V$53,8,FALSE)","v":0},null,{"$f":"VLOOKUP($C$11,'OBS1'!$B$38:$V$53,10,FALSE)","v":0},null,null,null,{"$f":"VLOOKUP($C$11,'OBS1'!$B$38:$V$53,12,FALSE)","v":0},null,{"$f":"VLOOKUP($C$11,'OBS1'!$B$38:$V$53,14,FALSE)","v":0}]
[null,null,{"$f":"EQUIPES!B9","v":0},{"$f":"VLOOKUP($C$12,'OBS1'!$B$38:$V$53,2,FALSE)","v":0},null,{"$f":"VLOOKUP($C$12,'OBS1'!$B$38:$V$53,4,FALSE)","v":0},null,{"$f":"VLOOKUP($C$12,'OBS1'!$B$38:$V$53,6,FALSE)","v":0},null,null,null,null,null,{"$f":"VLOOKUP($C$12,'OBS1'!$B$38:$V$53,8,FALSE)","v":0},null,{"$f":"VLOOKUP($C$12,'OBS1'!$B$38:$V$53,10,FALSE)","v":0},null,null,null,{"$f":"VLOOKUP($C$12,'OBS1'!$B$38:$V$53,12,FALSE)","v":0},null,{"$f":"VLOOKUP($C$12,'OBS1'!$B$38:$V$53,14,FALSE)","v":0}]
[null,null,{"$f":"EQUIPES!B10","v":0},{"$f":"VLOOKUP($C$13,'OBS1'!$B$38:$V$53,2,FALSE)","v":0},null,{"$f":"VLOOKUP($C$13,'OBS1'!$B$38:$V$53,4,FALSE)","v":0},null,{"$f":"VLOOKUP($C$13,'OBS1'!$B$38:$V$53,6,FALSE)","v":0},null,null,null,null,null,{"$f":"VLOOKUP($C$13,'OBS1'!$B$38:$V$53,8,FALSE)","v":0},null,{"$f":"VLOOKUP($C$13,'OBS1'!$B$38:$V$53,10,FALSE)","v":0},null,null,null,{"$f":"VLOOKUP($C$13,'OBS1'!$B$38:$V$53,12,FALSE)","v":0},null,{"$f":"VLOOKUP($C$13,'OBS1'!$B$38:$V$53,14,FALSE)","v":0}]
[null,null,{"$f":"EQUIPES!B11","v":"Emmanuel"},{"$f":"VLOOKUP($C$14,'OBS1'!$B$38:$V$53,2,FALSE)","v":0},null,{"$f":"VLOOKUP($C$14,'OBS1'!$B$38:$V$53,4,FALSE)","v":0},null,{"$f":"VLOOKUP($C$14,'OBS1'!$B$38:$V$53,6,FALSE)","v":0},null,null,null,null,null,{"$f":"VLOOKUP($C$14,'OBS1'!$B$38:$V$53,8,FALSE)","v":0},null,{"$f":"VLOOKUP($C$14,'OBS1'!$B$38:$V$53,10,FALSE)","v":0},null,null,null,{"$f":"VLOOKUP($C$14,'OBS1'!$B$38:$V$53,12,FALSE)","v":0},null,{"$f":"VLOOKUP($C$14,'OBS1'!$B$38:$V$53,14,FALSE)","v":0}]
[null,{"$f":"EQUIPES!D3","v":"JAUNE"},{"$f":"EQUIPES!D4","v":"Alexandre"},{"$f":"VLOOKUP($C$7,'OBS2'!$B$38:$V$53,2,FALSE)","v":0},null,{"$f":"VLOOKUP($C$7,'OBS2'!$B$38:$V$53,4,FALSE)","v":0},null,{"$f":"VLOOKUP($C$7,'OBS2'!$B$38:$V$53,6,FALSE)","v":0},null,null,null,null,null,{"$f":"VLOOKUP($C$7,'OBS2'!$B$38:$V$53,8,FALSE)","v":0},null,{"$f":"VLOOKUP($C$7,'OBS2'!$B$38:$V$53,10,FALSE)","v":0},null,null,null,{"$f":"VLOOKUP($C$7,'OBS2'!$B$38:$V$53,12,FALSE)","v":0},null,{"$f":"VLOOKUP($C$7,'OBS2'!$B$38:$V$53,14,FALSE)","v":0}]
[null,null,{"$f":"EQUIPES!D5","v":"Anthony"},{"$f":"VLOOKUP($C$8,'OBS2'!$B$38:$V$53,2,FALSE)","v":0},null,{"$f":"VLOOKUP($C$8,'OBS2'!$B$38:$V$53,4,FALSE)","v":0},null,{"$f":"VLOOKUP($C$8,'OBS2'!$B$38:$V$53,6,FALSE)","v":0},null,null,null,null,null,{"$f":"VLOOKUP($C$8,'OBS2'!$B$38:$V$53,8,FALSE)","v":0},null,{"$f":"VLOOKUP($C$8,'OBS2'!$B$38:$V$53,10,FALSE)","v":0},null,null,null,{"$f":"VLOOKUP($C$8,'OBS2'!$B$38:$V$53,12,FALSE)","v":0},null,{"$f":"VLOOKUP($C$8,'OBS2'!$B$38:$V$53,14,FALSE)","v":0}]
[null,null,{"$f":"EQUIPES!D6","v":0},{"$f":"VLOOKUP($C$9,'OBS2'!$B$38:$V$53,2,FALSE)","v":0},null,{"$f":"VLOOKUP($C$9,'OBS2'!$B$38:$V$53,4,FALSE)","v":0},null,{"$f":"VLOOKUP($C$9,'OBS2'!$B$38:$V$53,6,FALSE)","v":0},null,null,null,null,null,{"$f":"VLOOKUP($C$9,'OBS2'!$B$38:$V$53,8,FALSE)","v":0},null,{"$f":"VLOOKUP($C$9,'OBS2'!$B$38:$V$53,10,FALSE)","v":0},null,null,null,{"$f":"VLOOKUP($C$9,'OBS2'!$B$38:$V$53,12,FALSE)","v":0},null,{"$f":"VLOOKUP($C$9,'OBS2'!$B$38:$V$53,14,FALSE)","v":0}]
[null,null,{"$f":"EQUIPES!D7","v":0},{"$f":"VLOOKUP($C$10,'OBS2'!$B$38:$V$53,2,FALSE)","v":0},null,{"$f":"VLOOKUP($C$10,'OBS2'!$B$38:$V$53,4,FALSE)","v":0},null,{"$f":"VLOOKUP($C$10,'OBS2'!$B$38:$V$53,6,FALSE)","v":0},null,null,null,null,null,{"$f":"VLOOKUP($C$10,'OBS2'!$B$38:$V$53,8,FALSE)","v":0},null,{"$f":"VLOOKUP($C$10,'OBS2'!$B$38:$V$53,10,FALSE)","v":0},null,null,null,{"$f":"VLOOKUP($C$10,'OBS2'!$B$38:$V$53,12,FALSE)","v":0},null,{"$f":"VLOOKUP($C$10,'OBS2'!$B$38:$V$53,14,FALSE)","v":0}]
[null,null,{"$f":"EQUIPES!D8","v":0},{"$f":"VLOOKUP($C$11,'OBS2'!$B$38:$V$53,2,FALSE)","v":0},null,{"$f":"VLOOKUP($C$11,'OBS2'!$B$38:$V$53,4,FALSE)","v":0},null,{"$f":"VLOOKUP($C$11,'OBS2'!$B$38:$V$53,6,FALSE)","v":0},null,null,null,null,null,{"$f":"VLOOKUP($C$11,'OBS2'!$B$38:$V$53,8,FALSE)","v":0},null,{"$f":"VLOOKUP($C$11,'OBS2'!$B$38:$V$53,10,FALSE)","v":0},null,null,null,{"$f":"VLOOKUP($C$11,'OBS2'!$B$38:$V$53,12,FALSE)","v":0},null,{"$f":"VLOOKUP($C$11,'OBS2'!$B$38:$V$53,14,FALSE)","v":0}]
[null,null,{"$f":"EQUIPES!D9","v":0},{"$f":"VLOOKUP($C$12,'OBS2'!$B$38:$V$53,2,FALSE)","v":0},null,{"$f":"VLOOKUP($C$12,'OBS2'!$B$38:$V$53,4,FALSE)","v":0},null,{"$f":"VLOOKUP($C$12,'OBS2'!$B$38:$V$53,6,FALSE)","v":0},null,null,null,null,null,{"$f":"VLOOKUP($C$12,'OBS2'!$B$38:$V$53,8,FALSE)","v":0},null,{"$f":"VLOOKUP($C$12,'OBS2'!$B$38:$V$53,10,FALSE)","v":0},null,null,null,{"$f":"VLOOKUP($C$12,'OBS2'!$B$38:$V$53,12,FALSE)","v":0},null,{"$f":"VLOOKUP($C$12,'OBS2'!$B$38:$V$53,14,FALSE)","v":0}]
[null,null,{"$f":"EQUIPES!D10","v":0},{"$f":"VLOOKUP($C$13,'OBS2'!$B$38:$V$53,2,FALSE)","v":0},null,{"$f":"VLOOKUP($C$13,'OBS2'!$B$38:$V$53,4,FALSE)","v":0},null,{"$f":"VLOOKUP($C$13,'OBS2'!$B$38:$V$53,6,FALSE)","v":0},null,null,null,null,null,{"$f":"VLOOKUP($C$13,'OBS2'!$B$38:$V$53,8,FALSE)","v":0},null,{"$f":"VLOOKUP($C$13,'OBS2'!$B$38:$V$53,10,FALSE)","v":0},null,null,null,{"$f":"VLOOKUP($C$13,'OBS2'!$B$38:$V$53,12,FALSE)","v":0},null,{"$f":"VLOOKUP($C$13,'OBS2'!$B$38:$V$53,14,FALSE)","v":0}]
[null,null,{"$f":"EQUIPES!D11","v":0},{"$f":"VLOOKUP($C$14,'OBS2'!$B$38:$V$53,2,FALSE)","v":0},null,{"$f":"VLOOKUP($C$14,'OBS2'!$B$38:$V$53,4,FALSE)","v":0},null,{"$f":"VLOOKUP($C$14,'OBS2'!$B$38:$V$53,6,FALSE)","v":0},null,null,null,null,null,{"$f":"VLOOKUP($C$14,'OBS2'!$B$38:$V$53,8,FALSE)","v":0},null,{"$f":"VLOOKUP($C$14,'OBS2'!$B$38:$V$53,10,FALSE)","v":0},null,null,null,{"$f":"VLOOKUP($C$14,'OBS2'!$B$38:$V$53,12,FALSE)","v":0},null,{"$f":"VLOOKUP($C$14,'OBS2'!$B$38:$V$53,14,FALSE)","v":0}]
[null,{"$f":"EQUIPES!F3","v":"ORANGE"},{"$f":"EQUIPES!F4","v":"Emmanuel"},{"$f":"VLOOKUP($C$7,'OBS3'!$B$38:$V$53,2,FALSE)","v":0},null,{"$f":"VLOOKUP($C$7,'OBS3'!$B$38:$V$53,4,FALSE)","v":0},null,{"$f":"VLOOKUP($C$7,'OBS3'!$B$38:$V$53,6,FALSE)","v":0},null,null,null,null,null,{"$f":"VLOOKUP($C$7,'OBS3'!$B$38:$V$53,8,FALSE)","v":0},null,{"$f":"VLOOKUP($C$7,'OBS3'!$B$38:$V$53,10,FALSE)","v":0},null,null,null,{"$f":"VLOOKUP($C$7,'OBS3'!$B$38:$V$53,12,FALSE)","v":0},null,{"$f":"VLOOKUP($C$7,'OBS3'!$B$38:$V$53,14,FALSE)","v":0}]
[null,null,{"$f":"EQUIPES!F5","v":"Eric"},{"$f":"VLOOKUP($C$8,'OBS3'!$B$38:$V$53,2,FALSE)","v":0},null,{"$f":"VLOOKUP($C$8,'OBS3'!$B$38:$V$53,4,FALSE)","v":0},null,{"$f":"VLOOKUP($C$8,'OBS3'!$B$38:$V$53,6,FALSE)","v":0},null,null,null,null,null,{"$f":"VLOOKUP($C$8,'OBS3'!$B$38:$V$53,8,FALSE)","v":0},null,{"$f":"VLOOKUP($C$8,'OBS3'!$B$38:$V$53,10,FALSE)","v":0},null,null,null,{"$f":"VLOOKUP($C$8,'OBS3'!$B$38:$V$53,12,FALSE)","v":0},null,{"$f":"VLOOKUP($C$8,'OBS3'!$B$38:$V$53,14,FALSE)","v":0}]
[null,null,{"$f":"EQUIPES!F6","v":0},{"$f":"VLOOKUP($C$9,'OBS3'!$B$38:$V$53,2,FALSE)","v":0},null,{"$f":"VLOOKUP($C$9,'OBS3'!$B$38:$V$53,4,FALSE)","v":0},null,{"$f":"VLOOKUP($C$9,'OBS3'!$B$38:$V$53,6,FALSE)","v":0},null,null,null,null,null,{"$f":"VLOOKUP($C$9,'OBS3'!$B$38:$V$53,8,FALSE)","v":0},null,{"$f":"VLOOKUP($C$9,'OBS3'!$B$38:$V$53,10,FALSE)","v":0},null,null,null,{"$f":"VLOOKUP($C$9,'OBS3'!$B$38:$V$53,12,FALSE)","v":0},null,{"$f":"VLOOKUP($C$9,'OBS3'!$B$38:$V$53,14,FALSE)","v":0}]
[null,null,{"$f":"EQUIPES!F7","v":0},{"$f":"VLOOKUP($C$10,'OBS3'!$B$38:$V$53,2,FALSE)","v":0},null,{"$f":"VLOOKUP($C$10,'OBS3'!$B$38:$V$53,4,FALSE)","v":0},null,{"$f":"VLOOKUP($C$10,'OBS3'!$B$38:$V$53,6,FALSE)","v":0},null,null,null,null,null,{"$f":"VLOOKUP($C$10,'OBS3'!$B$38:$V$53,8,FALSE)","v":0},null,{"$f":"VLOOKUP($C$10,'OBS3'!$B$38:$V$53,10,FALSE)","v":0},null,null,null,{"$f":"VLOOKUP($C$10,'OBS3'!$B$38:$V$53,12,FALSE)","v":0},null,{"$f":"VLOOKUP($C$10,'OBS3'!$B$38:$V$53,14,FALSE)","v":0}]
[null,null,{"$f":"EQUIPES!F8","v":0},{"$f":"VLOOKUP($C$11,'OBS3'!$B$38:$V$53,2,FALSE)","v":0},null,{"$f":"VLOOKUP($C$11,'OBS3'!$B$38:$V$53,4,FALSE)","v":0},null,{"$f":"VLOOKUP($C$11,'OBS3'!$B$38:$V$53,6,FALSE)","v":0},null,null,null,null,null,{"$f":"VLOOKUP($C$11,'OBS3'!$B$38:$V$53,8,FALSE)","v":0},null,{"$f":"VLOOKUP($C$11,'OBS3'!$B$38:$V$53,10,FALSE)","v":0},null,null,null,{"$f":"VLOOKUP($C$11,'OBS3'!$B$38:$V$53,12,FALSE)","v":0},null,{"$f":"VLOOKUP($C$11,'OBS3'!$B$38:$V$53,14,FALSE)","v":0}]
[null,null,{"$f":"EQUIPES!F9","v":0},{"$f":"VLOOKUP($C$12,'OBS3'!$B$38:$V$53,2,FALSE)","v":0},null,{"$f":"VLOOKUP($C$12,'OBS3'!$B$38:$V$53,4,FALSE)","v":0},null,{"$f":"VLOOKUP($C$12,'OBS3'!$B$38:$V$53,6,FALSE)","v":0},null,null,null,null,null,{"$f":"VLOOKUP($C$12,'OBS3'!$B$38:$V$53,8,FALSE)","v":0},null,{"$f":"VLOOKUP($C$12,'OBS3'!$B$38:$V$53,10,FALSE)","v":0},null,null,null,{"$f":"VLOOKUP($C$12,'OBS3'!$B$38:$V$53,12,FALSE)","v":0},null,{"$f":"VLOOKUP($C$12,'OBS3'!$B$38:$V$53,14,FALSE)","v":0}]
[null,null,{"$f":"EQUIPES!F10","v":0},{"$f":"VLOOKUP($C$13,'OBS3'!$B$38:$V$53,2,FALSE)","v":0},null,{"$f":"VLOOKUP($C$13,'OBS3'!$B$38:$V$53,4,FALSE)","v":0},null,{"$f":"VLOOKUP($C$13,'OBS3'!$B$38:$V$53,6,FALSE)","v":0},null,null,null,null,null,{"$f":"VLOOKUP($C$13,'OBS3'!$B$38:$V$53,8,FALSE)","v":0},null,{"$f":"VLOOKUP($C$13,'OBS3'!$B$38:$V$53,10,FALSE)","v":0},null,null,null,{"$f":"VLOOKUP($C$13,'OBS3'!$B$38:$V$53,12,FALSE)","v":0},null,{"$f":"VLOOKUP($C$13,'OBS3'!$B$38:$V$53,14,FALSE)","v":0}]
[null,null,{"$f":"EQUIPES!F11","v":0},{"$f":"VLOOKUP($C$14,'OBS3'!$B$38:$V$53,2,FALSE)","v":0},null,{"$f":"VLOOKUP($C$14,'OBS3'!$B$38:$V$53,4,FALSE)","v":0},null,{"$f":"VLOOKUP($C$14,'OBS3'!$B$38:$V$53,6,FALSE)","v":0},null,null,null,null,null,{"$f":"VLOOKUP($C$14,'OBS3'!$B$38:$V$53,8,FALSE)","v":0},null,{"$f":"VLOOKUP($C$14,'OBS3'!$B$38:$V$53,10,FALSE)","v":0},null,null,null,{"$f":"VLOOKUP($C$14,'OBS3'!$B$38:$V$53,12,FALSE)","v":0},null,{"$f":"VLOOKUP($C$14,'OBS3'!$B$38:$V$53,14,FALSE)","v":0}]
[null,{"$f":"EQUIPES!H3","v":"VERT"},{"$f":"EQUIPES!H4","v":"Gwen"},{"$f":"VLOOKUP($C$7,'OBS4'!$B$38:$V$53,2,FALSE)","v":0},null,{"$f":"VLOOKUP($C$7,'OBS4'!$B$38:$V$53,4,FALSE)","v":0},null,{"$f":"VLOOKUP($C$7,'OBS4'!$B$38:$V$53,6,FALSE)","v":0},null,null,null,null,null,{"$f":"VLOOKUP($C$7,'OBS4'!$B$38:$V$53,8,FALSE)","v":0},null,{"$f":"VLOOKUP($C$7,'OBS4'!$B$38:$V$53,10,FALSE)","v":0},null,null,null,{"$f":"VLOOKUP($C$7,'OBS4'!$B$38:$V$53,12,FALSE)","v":0},null,{"$f":"VLOOKUP($C$7,'OBS4'!$B$38:$V$53,14,FALSE)","v":0}]
[null,null,{"$f":"EQUIPES!H5","v":"Marco"},{"$f":"VLOOKUP($C$8,'OBS4'!$B$38:$V$53,2,FALSE)","v":0},null,{"$f":"VLOOKUP($C$8,'OBS4'!$B$38:$V$53,4,FALSE)","v":0},null,{"$f":"VLOOKUP($C$8,'OBS4'!$B$38:$V$53,6,FALSE)","v":0},null,null,null,null,null,{"$f":"VLOOKUP($C$8,'OBS4'!$B$38:$V$53,8,FALSE)","v":0},null,{"$f":"VLOOKUP($C$8,'OBS4'!$B$38:$V$53,10,FALSE)","v":0},null,null,null,{"$f":"VLOOKUP($C$8,'OBS4'!$B$38:$V$53,12,FALSE)","v":0},null,{"$f":"VLOOKUP($C$8,'OBS4'!$B$38:$V$53,14,FALSE)","v":0}]
[null,null,{"$f":"EQUIPES!H6","v":0},{"$f":"VLOOKUP($C$9,'OBS4'!$B$38:$V$53,2,FALSE)","v":0},null,{"$f":"VLOOKUP($C$9,'OBS4'!$B$38:$V$53,4,FALSE)","v":0},null,{"$f":"VLOOKUP($C$9,'OBS4'!$B$38:$V$53,6,FALSE)","v":0},null,null,null,null,null,{"$f":"VLOOKUP($C$9,'OBS4'!$B$38:$V$53,8,FALSE)","v":0},null,{"$f":"VLOOKUP($C$9,'OBS4'!$B$38:$V$53,10,FALSE)","v":0},null,null,null,{"$f":"VLOOKUP($C$9,'OBS4'!$B$38:$V$53,12,FALSE)","v":0},null,{"$f":"VLOOKUP($C$9,'OBS4'!$B$38:$V$53,14,FALSE)","v":0}]
[null,null,{"$f":"EQUIPES!H7","v":0},{"$f":"VLOOKUP($C$10,'OBS4'!$B$38:$V$53,2,FALSE)","v":0},null,{"$f":"VLOOKUP($C$10,'OBS4'!$B$38:$V$53,4,FALSE)","v":0},null,{"$f":"VLOOKUP($C$10,'OBS4'!$B$38:$V$53,6,FALSE)","v":0},null,null,null,null,null,{"$f":"VLOOKUP($C$10,'OBS4'!$B$38:$V$53,8,FALSE)","v":0},null,{"$f":"VLOOKUP($C$10,'OBS4'!$B$38:$V$53,10,FALSE)","v":0},null,null,null,{"$f":"VLOOKUP($C$10,'OBS4'!$B$38:$V$53,12,FALSE)","v":0},null,{"$f":"VLOOKUP($C$10,'OBS4'!$B$38:$V$53,14,FALSE)","v":0}]
[null,null,{"$f":"EQUIPES!H8","v":0},{"$f":"VLOOKUP($C$11,'OBS4'!$B$38:$V$53,2,FALSE)","v":0},null,{"$f":"VLOOKUP($C$11,'OBS4'!$B$38:$V$53,4,FALSE)","v":0},null,{"$f":"VLOOKUP($C$11,'OBS4'!$B$38:$V$53,6,FALSE)","v":0},null,null,null,null,null,{"$f":"VLOOKUP($C$11,'OBS4'!$B$38:$V$53,8,FALSE)","v":0},null,{"$f":"VLOOKUP($C$11,'OBS4'!$B$38:$V$53,10,FALSE)","v":0},null,null,null,{"$f":"VLOOKUP($C$11,'OBS4'!$B$38:$V$53,12,FALSE)","v":0},null,{"$f":"VLOOKUP($C$11,'OBS4'!$B$38:$V$53,14,FALSE)","v":0}]
[null,null,{"$f":"EQUIPES!H9","v":0},{"$f":"VLOOKUP($C$12,'OBS4'!$B$38:$V$53,2,FALSE)","v":0},null,{"$f":"VLOOKUP($C$12,'OBS4'!$B$38:$V$53,4,FALSE)","v":0},null,{"$f":"VLOOKUP($C$12,'OBS4'!$B$38:$V$53,6,FALSE)","v":0},null,null,null,null,null,{"$f":"VLOOKUP($C$12,'OBS4'!$B$38:$V$53,8,FALSE)","v":0},null,{"$f":"VLOOKUP($C$12,'OBS4'!$B$38:$V$53,10,FALSE)","v":0},null,null,null,{"$f":"VLOOKUP($C$12,'OBS4'!$B$38:$V$53,12,FALSE)","v":0},null,{"$f":"VLOOKUP($C$12,'OBS4'!$B$38:$V$53,14,FALSE)","v":0}]
[null,null,{"$f":"EQUIPES!H10","v":0},{"$f":"VLOOKUP($C$13,'OBS4'!$B$38:$V$53,2,FALSE)","v":0},null,{"$f":"VLOOKUP($C$13,'OBS4'!$B$38:$V$53,4,FALSE)","v":0},null,{"$f":"VLOOKUP($C$13,'OBS4'!$B$38:$V$53,6,FALSE)","v":0},null,null,null,null,null,{"$f":"VLOOKUP($C$13,'OBS4'!$B$38:$V$53,8,FALSE)","v":0},null,{"$f":"VLOOKUP($C$13,'OBS4'!$B$38:$V$53,10,FALSE)","v":0},null,null,null,{"$f":"VLOOKUP($C$13,'OBS4'!$B$38:$V$53,12,FALSE)","v":0},null,{"$f":"VLOOKUP($C$13,'OBS4'!$B$38:$V$53,14,FALSE)","v":0}]
[null,null,{"$f":"EQUIPES!H11","v":0},{"$f":"VLOOKUP($C$14,'OBS4'!$B$38:$V$53,2,FALSE)","v":0},null,{"$f":"VLOOKUP($C$14,'OBS4'!$B$38:$V$53,4,FALSE)","v":0},null,{"$f":"VLOOKUP($C$14,'OBS4'!$B$38:$V$53,6,FALSE)","v":0},null,null,null,null,null,{"$f":"VLOOKUP($C$14,'OBS4'!$B$38:$V$53,8,FALSE)","v":0},null,{"$f":"VLOOKUP($C$14,'OBS4'!$B$38:$V$53,10,FALSE)","v":0},null,null,null,{"$f":"VLOOKUP($C$14,'OBS4'!$B$38:$V$53,12,FALSE)","v":0},null,{"$f":"VLOOKUP($C$14,'OBS4'!$B$38:$V$53,14,FALSE)","v":0}]

{"sheet":"APPEL","index":7,"n_rows":39,"n_cols":28,"rows_kept":39,"cut":false,"hidden":false,"merged":[[0,22,0,23],[0,25,0,26],[0,1,0,2],[0,4,0,5],[0,7,0,8],[0,10,0,11],[0,13,0,14],[0,16,0,17],[0,19,0,20]]}
[null,"TELEC",null,null,"1PROE",null,null,"TGA",null,null,"1EVS",null,null,"1GA",null,null,"1TU",null,null,"STAGE"]
[null,"NOMS","PRENOMS","sexe","NOMS","PRENOMS","sexe","NOMS","PRENOMS","sexe","NOMS","PRENOMS","sexe","NOMS","PRENOMS","sexe","NOMS","PRENOMS","sexe","NOMS","PRENOMS","sexe","NOMS","PRENOMS","sexe","NOMS","PRENOMS","sexe"]
[1,null,"Abdelbasset","g",null,"Abdelwahid","g",null,"Bertile","f",null,"Abir","f",null,"Camille","f",null,"Amir","g",null,"Alexandre","g"]
[2,null,"Alen","g",null,"Ali","g",null,"Chirine","f",null,"Adama","g",null,"Emilie","f",null,"Badrane","g",null,"Alexis F.","g"]
[3,null,"Bilal","g",null,"Fares","g",null,"Isma","f",null,"Elfeta","f",null,"Gehna","f",null,"Emre","g",null,"Anthony","g"]
[4,null,"Christian","g",null,"Gilles","g",null,"Jihenne","f",null,"Faiz","g",null,"Ismeta","f",null,"Hedi","g",null,"Christian","g"]
[5,null,"Halis","g",null,"Haykel","g",null,"Kandji","f",null,"Fares","g",null,"Janette","f",null,"Mansour","g",null,"Claudine","f"]
[6,null,"Laurent","g",null,"Mohamed","g",null,"Kenza","f",null,"Hocine","g",null,"Jenna","f",null,"Mounia","g",null,"Emmanuel","g"]
[7,null,"Mickael","g",null,"Mohamed","g",null,"Khayra","f",null,"Imen","f",null,"Juliana","f",null,"Mustafa","g",null,"Eric","g"]
[8,null,"Salim","g",null,"Mohamed","g",null,"Liddia","f",null,"Jenny","f",null,"Kelly","f",null,"Sombate rothanak","g",null,"Fred","g"]
[9,null,"Willy","g",null,"Phi tram","g",null,"Louiza","f",null,"Jennyline","f",null,"Laura","f",null,"Wail","g",null,"Gwen","g"]
[10,null,null,null,null,"Ryad","g",null,"Lydia","f",null,"Kévin","g",null,"Lea","f",null,"Yohann","g",null,"Julien","g"]
[11,null,null,null,null,"Xhorxh","g",null,"Margarita","f",null,"Melvine","f",null,"Linda","f",null,"Zayd","g",null,"Laurent","g"]
[12,null,null,null,null,"Yassine","g",null,"Mouna","f",null,"Nesrine","f",null,"Maïssane","f",null,"Alexandre",null,null,"Marc-Antoine","g"]
[13,null,null,null,null,null,null,null,"Nadia","f",null,"Ruth","f",null,"Mélinda","f",null,"Alexis F.",null,null,"Marco","g"]
[14,null,null,null,null,null,null,null,"Naila","f",null,"Sabrina","f",null,"Meltem","f",null,"Anthony",null,null,"Morgane","f"]
[15,null,null,null,null,null,null,null,"Naoures","f",null,"Sandra","f",null,"Morgane","f",null,"Christian",null,null,"Nathalie","f"]
[16,null,null,null,null,null,null,null,"Nessrine","f",null,"Siwar","f",null,"Naomie","f",null,"Claudine",null,null,"Nico Afriat","g"]
[17,null,null,null,null,null,null,null,"Noemie","f",null,"Suleyman","g",null,"Nejma","f",null,"Emmanuel",null,null,"Nico Podu","g"]
[18,null,null,null,null,null,null,null,"Sarinece","f",null,null,null,null,"Nore-ymen","f",null,"Eric",null,null,"Olivier","g"]
[19,null,null,null,null,null,null,null,"Sofia","f",null,null,null,null,"Rachda","f",null,"Fred",null,null,"Pascal","g"]
[20,null,null,null,null,null,null,null,"Thais sirine","f",null,null,null,null,"Sauraya","f",null,"Gwen",null,null,"Phil G.","g"]
[21,null,null,null,null,null,null,null,"Victoria","f",null,null,null,null,"Sibel","f",null,"Julien",null,null,"Philippe G.","g"]
[22,null,null,null,null,null,null,null,"Wiem","f",null,null,null,null,"Wacilla","f",null,"Laurent",null,null,"Stef","g"]
[23,null,null,null,null,null,null,null,"Ynès","f",null,null,null,null,"Yosr","f",null,"Marc-Antoine",null,null,"Thomas","g"]
[24,null,null,null,null,null,null,null,"Zineb","f",null,null,null,null,"Zekiye","f",null,"Marco",null,null,"Tristan","g"]
[25,null,null,null,null,null,null,null,null,null,null,null,null,null,null,null,null,"Morgane",null,null,"Vivien","g"]
[26,null,null,null,null,null,null,null,null,null,null,null,null,null,null,null,null,"Nathalie",null,null,"Xav","g"]
[27,null,null,null,null,null,null,null,null,null,null,null,null,null,null,null,null,"Nico Afriat",null,null,"CC","f"]
[28,null,null,null,null,null,null,null,null,null,null,null,null,null,null,null,null,"Nico Podu",null,null,"Barby","f"]
[29,null,null,null,null,null,null,null,null,null,null,null,null,null,null,null,null,"Olivier",null,null,"Jo","g"]
[30,null,null,null,null,null,null,null,null,null,null,null,null,null,null,null,null,"Pascal",null,null,"Nico T.","g"]
[31,null,null,null,null,null,null,null,null,null,null,null,null,null,null,null,null,"Phil G.",null,null,"Steven","g"]
[32,null,null,null,null,null,null,null,null,null,null,null,null,null,null,null,null,"Philippe G.",null,null,"Cyrilinou","g"]
[33,null,null,null,null,null,null,null,null,null,null,null,null,null,null,null,null,"Stef",null,null,"Mick","g"]
[34,null,null,null,null,null,null,null,null,null,null,null,null,null,null,null,null,"Thomas"]
[35,null,null,null,null,null,null,null,null,null,null,null,null,null,null,null,null,"Tristan"]
[36,null,null,null,null,null,null,null,null,null,null,null,null,null,null,null,null,"Vivien"]
[null,null,null,null,null,null,null,null,null,null,null,null,null,null,null,null,null,"Xav"]

{"sheet":"DEBUT","index":8,"n_rows":74,"n_cols":36,"rows_kept":74,"cut":false,"hidden":false,"merged":[[45,29,46,29],[45,30,46,30],[45,31,46,31],[47,24,48,24],[47,25,48,25],[47,26,48,26],[47,27,48,27],[47,28,48,28],[47,29,48,29],[47,30,48,30],[47,31,48,31],[45,24,46,24],[45,25,46,25],[45,26,46,26],[45,27,46,27],[45,28,46,28],[39,29,40,29],[39,30,40,30],[39,31,40,31],[41,24,42,24],[41,25,42,25],[41,26,42,26],[41,27,42,27],[41,28,42,28],[41,29,42,29],[41,30,42,30],[41,31,42,31],[39,24,40,24],[39,25,40,25],[39,26,40,26],[39,27,40,27],[39,28,40,28],[35,29,36,29],[35,30,36,30],[35,31,36,31],[37,24,38,24],[37,25,38,25],[37,26,38,26],[37,27,38,27],[37,28,38,28],[37,29,38,29],[37,30,38,30],[37,31,38,31],[35,24,36,24],[35,25,36,25],[35,26,36,26],[35,27,36,27],[35,28,36,28],[61,29,62,29],[61,30,62,30],[61,31,62,31],[63,24,64,24],[63,25,64,25],[63,26,64,26],[63,27,64,27],[63,28,64,28],[63,29,64,29],[63,30,64,30],[63,31,64,31],[61,24,62,24],[61,25,62,25],[61,26,62,26],[61,27,62,27],[61,28,62,28],[57,29,58,29],[57,30,58,30],[57,31,58,31],[59,24,60,24],[59,25,60,25],[59,26,60,26],[59,27,60,27],[59,28,60,28],[59,29,60,29],[59,30,60,30],[59,31,60,31],[57,24,58,24],[57,25,58,25],[57,26,58,26],[57,27,58,27],[57,28,58,28],[0,15,0,21],[81,2,86,2],[87,2,91,2],[43,1,49,1],[50,1,57,1],[68,2,71,2],[72,2,75,2],[76,2,78,2],[28,3,29,3],[62,4,62,6],[62,7,62,9],[62,10,62,12],[28,10,28,12]]}
[]
[]
[]
[]
[]
[]
[]
[]
[]
[]
[]
[]
[]
[]
[]
[]
[]
[]
[]
[]
[]
[]
[]
[]
[]
[]
[]
[]
[]
[]
[]
[]
[]
[]
[]
[null,null,null,null,null,null,null,null,null,null,null,null,null,null,null,null,null,null,null,null,null,null,null,null,"FAUTE","BALLON PERDU","POSSESSION","RECUPERATION B","TIRS","BONS TIRS","PANIERS","% REUSSITE",null,null,null,"SCORE"]
[null,null,null,null,null,null,null,null,null,null,null,null,null,null,null,null,null,null,null,null,null,null,null,null,null,null,null,null,null,null,null,null,null,null,null,0]
[null,null,null,null,null,null,null,null,null,null,null,null,null,null,null,null,null,null,null,null,null,null,null,null,2,2,2,2,2,2,2,0.2,null,null,null,1]
[null,null,null,null,null,null,null,null,null,null,null,null,null,null,null,null,null,null,null,null,null,null,null,"Contrats ind",null,null,null,null,null,null,null,null,null,null,null,2]
[null,null,null,null,null,null,null,null,null,null,null,null,null,null,null,null,null,null,null,null,null,null,null,0,"C'est bien tu gères la distance","Bien tu lèves la tête","Tu touches le ballon","Faut se bouger davantage","Faut oser tirer","Pourquoi tes tirs ne rentrent pas ?","SI tu tires il faudra être plus précis","Pas de chance",null,null,null,3]
[null,null,null,null,null,null,null,null,null,null,null,null,null,null,null,null,null,null,null,null,null,null,null,null,null,null,null,null,null,null,null,null,null,null,null,4]
[null,null,null,null,null,null,null,null,null,null,null,null,null,null,null,null,null,null,null,null,null,null,null,null,"Doucement ","A qui tu fais la passe?","T'es plutot actif","Bien harcelé","Bien essayé mais faudra travailler l'adresse","On va travailler la précision","Joli","Bien visé",null,null,null,5]
[null,null,null,null,null,null,null,null,null,null,null,null,null,null,null,null,null,null,null,null,null,null,null,null,null,null,null,null,null,null,null,null,null,null,null,6]
[null,null,null,null,null,null,null,null,null,null,null,null,null,null,null,null,null,null,null,null,null,null,null,"Aide aux formules",1,2,3,4,5,6,7,8,9,10,null,7]
[null,null,null,null,null,null,null,null,null,null,null,null,null,null,null,null,null,null,null,null,null,null,null,null,null,null,null,null,null,null,null,null,null,null,null,8]
[null,null,null,null,null,null,null,null,null,null,null,null,null,null,null,null,null,null,null,null,null,null,null,null,3,5,15,5,5,6,5,0.25,null,null,null,9]
[null,null,null,null,null,null,null,null,null,null,null,null,null,null,null,null,null,null,null,null,null,null,null,"Contrats collectifs",null,null,null,null,null,null,null,null,null,null,null,10]
[null,null,null,null,null,null,null,null,null,null,null,null,null,null,null,null,null,null,null,null,null,null,null,null,"Vous êtes bien organisé","C'est bien vous faites des passes","Vous êtes où?","Faut se bouger davantage","Faut oser tirer","Pourquoi vos tirs ne rentrent pas ? ","SI vous tirez il faudra être plus précis","Pas de chance",null,null,null,11]
[null,null,null,null,null,null,null,null,null,null,null,null,null,null,null,null,null,null,null,null,null,null,null,null,null,null,null,null,null,null,null,null,null,null,null,12]
[null,null,null,null,null,null,null,null,null,null,null,null,null,null,null,null,null,null,null,null,null,null,null,null,"Trop de fautes collectives","Trop de ballons perdus","Bonne activité collective","Bien harcelé","Bien essayé mais faudra travailler l'adresse","On va travailler la précision","Joli","Bien visé",null,null,null,13]
[null,null,null,null,null,null,null,null,null,null,null,null,null,null,null,null,null,null,null,null,null,null,null,null,null,null,null,null,null,null,null,null,null,null,null,14]
[null,null,null,null,null,null,null,null,null,null,null,null,null,null,null,null,null,null,null,null,null,null,null,null,null,null,null,null,null,null,null,null,null,null,null,15]
[null,null,null,null,null,null,null,null,null,null,null,null,null,null,null,null,null,null,null,null,null,null,null,null,null,null,null,null,null,null,null,null,null,null,null,16]
[null,null,null,null,null,null,null,null,null,null,null,null,null,null,null,null,null,null,null,null,null,null,null,null,null,null,null,null,null,null,null,null,null,null,null,17]
[null,null,null,null,null,null,null,null,null,null,null,null,null,null,null,null,null,null,null,null,null,null,null,null,null,null,null,null,null,null,null,null,null,null,null,18]
[null,null,null,null,null,null,null,null,null,null,null,null,null,null,null,null,null,null,null,null,null,null,null,null,null,null,null,null,null,null,null,null,null,null,null,19]
[null,null,null,null,null,null,null,null,null,null,null,null,null,null,null,null,null,null,null,null,null,null,null,null,null,null,null,null,null,null,null,null,null,null,null,20]
[null,null,null,null,null,null,null,null,null,null,null,null,null,null,null,null,null,null,null,null,null,null,null,null,null,null,null,null,null,null,null,null,null,null,null,21]
[null,null,null,null,null,null,null,null,null,null,null,null,null,null,null,null,null,null,null,null,null,null,null,null,null,null,null,null,null,null,null,null,null,null,null,22]
[null,null,null,null,null,null,null,null,null,null,null,null,null,null,null,null,null,null,null,null,null,null,null,null,null,null,null,null,null,null,null,null,null,null,null,23]
[null,null,null,null,null,null,null,null,null,null,null,null,null,null,null,null,null,null,null,null,null,null,null,null,null,null,null,null,null,null,null,null,null,null,null,24]
[null,null,null,null,null,null,null,null,null,null,null,null,null,null,null,null,null,null,null,null,null,null,null,null,null,null,null,null,null,null,null,null,null,null,null,25]
[null,null,null,null,null,null,null,null,null,null,null,null,null,null,null,null,null,null,null,null,null,null,null,null,null,null,null,null,null,null,null,null,null,null,null,26]
[null,null,null,null,null,null,null,null,null,null,null,null,null,null,null,null,null,null,null,null,null,null,null,null,null,null,null,null,null,null,null,null,null,null,null,27]
[null,null,null,null,null,null,null,null,null,null,null,null,null,null,null,null,null,null,null,null,null,null,null,null,null,null,null,null,null,null,null,null,null,null,null,28]
[null,null,null,null,null,null,null,null,null,null,null,null,null,null,null,null,null,null,null,null,null,null,null,null,null,null,null,null,null,null,null,null,null,null,null,29]
[null,null,null,null,null,null,null,null,null,null,null,null,null,null,null,null,null,null,null,null,null,null,null,null,null,null,null,null,null,null,null,null,null,null,null,30]
[null,null,null,null,null,null,null,null,null,null,null,null,null,null,null,null,null,null,null,null,null,null,null,null,null,null,null,null,null,null,null,null,null,null,null,31]
[null,null,null,null,null,null,null,null,null,null,null,null,null,null,null,null,null,null,null,null,null,null,null,null,null,null,null,null,null,null,null,null,null,null,null,32]
[null,null,null,null,null,null,null,null,null,null,null,null,null,null,null,null,null,null,null,null,null,null,null,null,null,null,null,null,null,null,null,null,null,null,null,33]
[null,null,null,null,null,null,null,null,null,null,null,null,null,null,null,null,null,null,null,null,null,null,null,null,null,null,null,null,null,null,null,null,null,null,null,34]
[null,null,null,null,null,null,null,null,null,null,null,null,null,null,null,null,null,null,null,null,null,null,null,null,null,null,null,null,null,null,null,null,null,null,null,35]
[null,null,null,null,null,null,null,null,null,null,null,null,null,null,null,null,null,null,null,null,null,null,null,null,null,null,null,null,null,null,null,null,null,null,null,36]
[null,null,null,null,null,null,null,null,null,null,null,null,null,null,null,null,null,null,null,null,null,null,null,null,null,null,null,null,null,null,null,null,null,null,null,37]