{"text_format":"1","workbook":"xlsx","n_sheets":4,"sheets":["MENU","BAREME","Classe  1","Histo"],"not_rendered":{"charts":0,"images":4,"macros":1,"external_links":0,"defined_names":45,"comments":0,"pivot_tables":0},"unopened":[],"bounds":{"document_bytes":16777216,"sheet_cells":100000,"rows_first":2000,"rows_last":500,"rows_between":2000,"halvings":0,"cell_chars":16384,"cell_head_chars":4096},"cells_cut":0,"cells_raw":0,"read":"whole","date_system":"1900"}

{"sheet":"MENU","index":0,"n_rows":41,"n_cols":36,"rows_kept":41,"cut":false,"hidden":false,"merged":[[9,35,9,36]]}
[]
[]
[]
[]
[]
[]
[]
[]
[]
[null,null,null,null,null,null,null,null,null,null,null,null,null,null,null,null,null,null,null,null,null,null,null,null,null,null,null,null,null,null,null,null,null,null,"Barème : ",{"$f":"Date_Bareme","v":"2021-05-11"}]
[]
[]
[]
[]
[]
{"$rows_left_out":27}
{"sheet":"BAREME","index":1,"n_rows":45,"n_cols":33,"rows_kept":45,"cut":false,"hidden":false,"merged":[[27,1,27,4],[28,1,30,4],[34,1,34,3],[0,17,0,27],[2,29,2,32],[3,29,3,32],[1,4,1,6]]}
[null,null,null,null,null,null,null,null,null,null,null,null,null,null,null,null,null,"CAP - BEP  800 m"]
[null,null,null,null,"2021-05-11"]
[null,null,null,null,null,null,null,null,null,null,null,null,null,null,null,null,null,null,null,null,null,null,null,null,null,null,null,null,null,"Mode d'éval  AFLP 3 & 4  "]
[null,null,null,null,null,null,null,null,null,null,null,null,null,null,null,null,null,null,null,null,{"$f":"$G$11","v":"1-"},{"$f":"$G$12","v":"1+"},{"$f":"$G$13","v":"2-"},{"$f":"$G$14","v":"2+"},{"$f":"$G$15","v":"3-"},{"$f":"$G$16","v":"3+"},{"$f":"$G$17","v":"4-"},{"$f":"$G$18","v":"4+"},null,"Niveau"]
[null,null,null,null,"Tolerance  course identique  + ou -  ",3,null,null,"Niv Perf","TEMPS","TEMPS",null,"TEMPS","NOTE","TEMPS","NOTE",null,"Decal F",null,null,3,4,5,6,7,8,9,10]
[null,null,null,null,null,null,null,null," / 14","Filles","Garcons",null,"Filles"," / 14","Garcons"," / 14",null,"Decal G",null,null,2,3,4,5,6,7,8,9,null,null,null,"Notes  3 & 4"]
[null,null,"Projet de course",null,null,null,null,null,"1a",5.05,4.1500000000000004,null,0.01,{"$f":"I34","v":"5a"},0.01,{"$f":"N7","v":"5a"},null,"5a",{"$f":"M7","v":0.01},{"$f":"O7","v":0.01},6,6,7,7,7,7,7,7,null,null," /2"," /4"," /6"]
[null,null,"Projets ","Projets ","Projets ",null,null,null,"1b",5,4.04,null,{"$f":"BAREME!J34+0.01","v":0.01},{"$f":"I33","v":"5a"},{"$f":"BAREME!K34+0.01","v":0.01},"5a",null,"5a",0.01,0.01,6,6,7,7,7,7,7,7,null,null,0,0,0]
[null,null,"Réussi","Initiaux","Corrigés",null,"Degré",null,"1c",4.55,3.58,null,{"$f":"BAREME!J33+0.01","v":0.01},{"$f":"I32","v":"5a"},{"$f":"BAREME!K33+0.01","v":0.01},"5a",null,"5a",0.01,0.01,6,6,7,7,7,7,7,7,null,null,0.5,0.5,0.5]
[null,null,0,0,0,null," AFLP 1",null,"1d",4.45,3.52,null,{"$f":"BAREME!J32+0.01","v":0.01},{"$f":"I31","v":"5a"},{"$f":"BAREME!K32+0.01","v":0.01},"5a",null,"5a",0.01,0.01,6,6,7,7,7,7,7,7,null,null,1,1,1]
[null,null,1,1.5,1,null,"1-",null,"1e",4.4000000000000004,3.47,null,{"$f":"BAREME!J31+0.01","v":0.01},{"$f":"I30","v":"5a"},{"$f":"BAREME!K31+0.01","v":0.01},"5a",null,"5a",0.01,0.01,6,6,7,7,7,7,7,7,null,null,1.5,1.5,1.5]
[null,null,2,3,2,null,"1+",null,"2a",4.3499999999999996,3.42,null,{"$f":"BAREME!J30+0.01","v":0.01},{"$f":"I29","v":"5a"},{"$f":"BAREME!K30+0.01","v":0.01},"5a",null,"5a",0.01,0.01,6,6,7,7,7,7,7,7,null,null,2,2,2]
[null,null,null,null,null,null,"2-",null,"2b",4.3,3.37,null,{"$f":"BAREME!J29+0.01","v":0.01},{"$f":"I28","v":"5a"},{"$f":"BAREME!K29+0.01","v":0.01},"5a",null,"5a",0.01,0.01,6,6,7,7,7,7,7,7,null,null,null,2.5,2.5]
[null,"Note C1",null,6,null,null,"2+",null,"2c",4.25,3.32,null,{"$f":"BAREME!J28+0.01","v":0.01},{"$f":"I27","v":"5a"},{"$f":"BAREME!K28+0.01","v":0.01},"5a",null,"5a",0.01,0.01,6,6,7,7,7,7,7,7,null,null,null,3,3]
[null,"Prepa",null,3,null,null,"3-",null,"2d",4.2,3.28,null,{"$f":"BAREME!J27+0.01","v":0.01},{"$f":"I26","v":"4e"},{"$f":"BAREME!K27+0.01","v":0.01},"4e",null,"5a",0.01,0.01,6,6,7,7,7,7,7,7,null,null,null,3.5,3.5]
{"$rows_left_out":31}
{"sheet":"Classe  1","index":2,"n_rows":39,"n_cols":39,"rows_kept":39,"cut":false,"hidden":false,"merged":[[0,9,0,22]]}
[null,null,null,null,null,null,null,null,null,{"$f":"BAREME!R1","v":"CAP - BEP  800 m"}]
[null,"Classe  1",null,null,null,null,null,null,null,null,null,null,"COURSES",null,null,null,null,null,null,null,null,null,null,"NOTES",null,null,null,null,null,null,null,null,null,null,"00:00:00"]
[null,"NOM","Prenom","SEXE","Rapport AFLP 3/4","Degré AFLP 1 ",null,"Course 1","Course 2","Course 3","Course 4","Course 5",{"$f":"Dist_Tot","v":800},"vitesse","Degré AFLP 3","Degré AFLP 4"," ",null,null,"Note AFLP 1","Note AFLP 2","Note 3","Note 4"," CAP-BEP/20",null,"Dossard","Alerte",null,null," COMMENTAIRES",null,null,null,null,"Arrivée","Dossard \nArrivée",null,null," \nALERTE"]
[1,null,null,null,null,null,null,null,null,null,{"$f":"IF(ISBLANK(G4),IF(ISERR(VALUE(F4)),LEFT(F4,1),T(VLOOKUP(VALUE(F4),BAREME!$M$37:$O$45,2,FALSE))),IF(ISERR(VALUE(G4)), LEFT(G4,1), T( VLOOKUP(VALUE(G4),BAREME!$M$37:$O$45,2,FALSE))))","v":""},{"$f":"IF(ISBLANK(G4),IF(ISERR(VALUE(F4)),RIGHT(F4,1),T(VLOOKUP(VALUE(F4),BAREME!$M$37:$O$45,3,FALSE))),IF(ISERR(VALUE(G4)), RIGHT(G4,1), T( VLOOKUP(VALUE(G4),BAREME!$M$37:$O$45,3,FALSE))))","v":""},{"$f":"IF(COUNT(H4:J4)=Nb_Courses,SUM(INT(H4:J4),INT(SUM(H4:J4-INT(H4:J4))/0.6),MOD(SUM(H4:J4-INT(H4:J4)),0.6)),\"\")","v":""},{"$f":"  IF(ISNUMBER(M4),  (Dist_Tot/(INT(M4)*0.6+(M4-INT(M4))))*0.036,\"\")","v":""},null,null,null,null,null,{"$f":"IF(AND(ISNUMBER(M4),D4<>\"\",F4<>\"\"),VLOOKUP(M4,IF(D4=\"F\",Bareme_F,Bareme_G),Decal),IF(OR(H4=\"X\",I4=\"X\",J4=\"X\"),0,\"\"))","v":""},null,{"$f":"IFERROR(VLOOKUP(O4,Niv_AFLP_3_4,CHOOSE(LEFT(E4,1)/2,   2,3,4),FALSE),\"\")","v":""},{"$f":"IFERROR(VLOOKUP(P4,Niv_AFLP_3_4,CHOOSE(RIGHT(E4,1)/2, 2,3,4),FALSE),\"\")","v":""},{"$f":"IF(COUNT(T4:W4),SUM(T4:W4),IF(ISTEXT(H4),H4,\"\"))","v":""},"",null,{"$f":"IFERROR(IF(COUNTIF(Dossard,Z4)>1,\"Doublon\",IF(OR(X4=\"A\",X4=\"D\"),\"\",   IF(AB4<>\"\",AB4,   IF(AND(D4<>\"F\",D4<>\"G\",D4<>\"M\",D4<>\"\"),\"Sexe Non Valide\",IF(AND(D4=\"\",M4<>\"\"),\" Sexe ?\",IF(OR(N(V4)<0,N(V4)>Max_Note3),\"Pb Note 3\",IF(OR(N(W4)<0,N(W4)>Max_Note4),\"Pb Note 4\",IF(AND(ISNUMBER(X4),COUNT(T4:W4)<4), \"Il manque \"& (4-COUNT(T4:W4)) & \" note(s)\",\"\")))))))), \"\")","v":""},{"$f":"IF(  COUNT(H4:J4),   IF(ISBLANK(F4),\"Manque le Degré AFLP1 \",IF(AND(F4<>\"\",ISERROR(MATCH(F4,Liste_AFLP1,0))),\"ErreurDegré AFLP1\",IF(AND(ISBLANK(E4),ISNUMBER(X4)),\"Manque Rapport AFLP3/4\",\"\"))),\"\")","v":""},null,null,null,null,null,"Tps 1",null,null,{"$f":"IF(ISBLANK(Dossard_Arrivée),\"\",MATCH(Dossard_Arrivée,Dossard,0))","v":""},{"$f":"ISERROR(AK4)","v":false},{"$f":"IF(AL4,\" DOSSARD NON ATTRIBUE\",IF(COUNTIF(Dossard_Arrivée,Dossard_Arrivée)>1,\"Doublon\",IF(AND(Dossard_Arrivée<>\"\",Arrivee=\"\"),\"DOSSARD SANS TEMPS\",IF(AND(Dossard_Arrivée=\"\",Arrivee<>\"\"),\"TEMPS SANS DOSSARD\",\"\"))))","v":""}]
[2,null,null,null,null,null,null,null,null,null,{"$f":"IF(ISBLANK(G5),IF(ISERR(VALUE(F5)),LEFT(F5,1),CHOOSE(VALUE(F5)+1,\"\",\"=\",\"+\",\"=\",\"=\",\"-\",\"+\",\"-\",\"+\")),IF(ISERR(VALUE(G5)),LEFT(G5,1),CHOOSE(VALUE(G5),\"=\",\"+\",\"=\",\"=\",\"-\",\"+\",\"-\",\"+\")))","v":""},{"$f":"IF(ISBLANK(G5),IF(ISERR(VALUE(F5)),RIGHT(F5,1),T(VLOOKUP(VALUE(F5),BAREME!$M$37:$O$45,3,FALSE))),IF(ISERR(VALUE(G5)), RIGHT(G5,1), T( VLOOKUP(VALUE(G5),BAREME!$M$37:$O$45,3,FALSE))))","v":""},{"$f":"IF(COUNT(H5:J5)=Nb_Courses,SUM(INT(H5:J5),INT(SUM(H5:J5-INT(H5:J5))/0.6),MOD(SUM(H5:J5-INT(H5:J5)),0.6)),\"\")","v":""},{"$f":"  IF(ISNUMBER(M5),  (Dist_Tot/(INT(M5)*0.6+(M5-INT(M5))))*0.036,\"\")","v":""},null,null,null,null,null,{"$f":"IF(AND(ISNUMBER(M5),D5<>\"\",F5<>\"\"),VLOOKUP(M5,IF(D5=\"F\",Bareme_F,Bareme_G),Decal),IF(OR(H5=\"X\",I5=\"X\",J5=\"X\"),0,\"\"))","v":""},null,"","",{"$f":"IF(COUNT(T5:W5),SUM(T5:W5),IF(ISTEXT(H5),H5,\"\"))","v":""},"",null,{"$f":"IFERROR(IF(COUNTIF(Dossard,Z5)>1,\"Doublon\",IF(OR(X5=\"A\",X5=\"D\"),\"\",   IF(AB5<>\"\",AB5,   IF(AND(D5<>\"F\",D5<>\"G\",D5<>\"M\",D5<>\"\"),\"Sexe Non Valide\",IF(AND(D5=\"\",M5<>\"\"),\" Sexe ?\",IF(OR(N(V5)<0,N(V5)>Max_Note3),\"Pb Note 3\",IF(OR(N(W5)<0,N(W5)>Max_Note4),\"Pb Note 4\",IF(AND(ISNUMBER(X5),COUNT(T5:W5)<4), \"Il manque \"& (4-COUNT(T5:W5)) & \" note(s)\",\"\")))))))), \"\")","v":""},"",null,null,null,null,null,"Tps 2",null,null,"",{"$f":"ISERROR(AK5)","v":false},""]
[3,null,null,null,null,null,null,null,null,null,"",{"$f":"IF(ISBLANK(G6),IF(ISERR(VALUE(F6)),RIGHT(F6,1),T(VLOOKUP(VALUE(F6),BAREME!$M$37:$O$45,3,FALSE))),IF(ISERR(VALUE(G6)), RIGHT(G6,1), T( VLOOKUP(VALUE(G6),BAREME!$M$37:$O$45,3,FALSE))))","v":""},{"$f":"IF(COUNT(H6:J6)=Nb_Courses,SUM(INT(H6:J6),INT(SUM(H6:J6-INT(H6:J6))/0.6),MOD(SUM(H6:J6-INT(H6:J6)),0.6)),\"\")","v":""},"",null,null,null,null,null,{"$f":"IF(AND(ISNUMBER(M6),D6<>\"\",F6<>\"\"),VLOOKUP(M6,IF(D6=\"F\",Bareme_F,Bareme_G),Decal),IF(OR(H6=\"X\",I6=\"X\",J6=\"X\"),0,\"\"))","v":""},null,"","","","",null,{"$f":"IFERROR(IF(COUNTIF(Dossard,Z6)>1,\"Doublon\",IF(OR(X6=\"A\",X6=\"D\"),\"\",   IF(AB6<>\"\",AB6,   IF(AND(D6<>\"F\",D6<>\"G\",D6<>\"M\",D6<>\"\"),\"Sexe Non Valide\",IF(AND(D6=\"\",M6<>\"\"),\" Sexe ?\",IF(OR(N(V6)<0,N(V6)>Max_Note3),\"Pb Note 3\",IF(OR(N(W6)<0,N(W6)>Max_Note4),\"Pb Note 4\",IF(AND(ISNUMBER(X6),COUNT(T6:W6)<4), \"Il manque \"& (4-COUNT(T6:W6)) & \" note(s)\",\"\")))))))), \"\")","v":""},"",null,null,null,null,null,"Tps 3",null,null,"",false,""]
[4,null,null,null,null,null,null,null,null,null,"",{"$f":"IF(ISBLANK(G7),IF(ISERR(VALUE(F7)),RIGHT(F7,1),T(VLOOKUP(VALUE(F7),BAREME!$M$37:$O$45,3,FALSE))),IF(ISERR(VALUE(G7)), RIGHT(G7,1), T( VLOOKUP(VALUE(G7),BAREME!$M$37:$O$45,3,FALSE))))","v":""},{"$f":"IF(COUNT(H7:J7)=Nb_Courses,SUM(INT(H7:J7),INT(SUM(H7:J7-INT(H7:J7))/0.6),MOD(SUM(H7:J7-INT(H7:J7)),0.6)),\"\")","v":""},"",null,null,null,null,null,{"$f":"IF(AND(ISNUMBER(M7),D7<>\"\",F7<>\"\"),VLOOKUP(M7,IF(D7=\"F\",Bareme_F,Bareme_G),Decal),IF(OR(H7=\"X\",I7=\"X\",J7=\"X\"),0,\"\"))","v":""},null,"","","","",null,{"$f":"IFERROR(IF(COUNTIF(Dossard,Z7)>1,\"Doublon\",IF(OR(X7=\"A\",X7=\"D\"),\"\",   IF(AB7<>\"\",AB7,   IF(AND(D7<>\"F\",D7<>\"G\",D7<>\"M\",D7<>\"\"),\"Sexe Non Valide\",IF(AND(D7=\"\",M7<>\"\"),\" Sexe ?\",IF(OR(N(V7)<0,N(V7)>Max_Note3),\"Pb Note 3\",IF(OR(N(W7)<0,N(W7)>Max_Note4),\"Pb Note 4\",IF(AND(ISNUMBER(X7),COUNT(T7:W7)<4), \"Il manque \"& (4-COUNT(T7:W7)) & \" note(s)\",\"\")))))))), \"\")","v":""},"",null,null,null,null,null,"Tps 4",null,null,"",false,""]
[5,null,null,null,null,null,null,null,null,null,"",{"$f":"IF(ISBLANK(G8),IF(ISERR(VALUE(F8)),RIGHT(F8,1),T(VLOOKUP(VALUE(F8),BAREME!$M$37:$O$45,3,FALSE))),IF(ISERR(VALUE(G8)), RIGHT(G8,1), T( VLOOKUP(VALUE(G8),BAREME!$M$37:$O$45,3,FALSE))))","v":""},{"$f":"IF(COUNT(H8:J8)=Nb_Courses,SUM(INT(H8:J8),INT(SUM(H8:J8-INT(H8:J8))/0.6),MOD(SUM(H8:J8-INT(H8:J8)),0.6)),\"\")","v":""},"",null,null,null,null,null,{"$f":"IF(AND(ISNUMBER(M8),D8<>\"\",F8<>\"\"),VLOOKUP(M8,IF(D8=\"F\",Bareme_F,Bareme_G),Decal),IF(OR(H8=\"X\",I8=\"X\",J8=\"X\"),0,\"\"))","v":""},null,"","","","",null,{"$f":"IFERROR(IF(COUNTIF(Dossard,Z8)>1,\"Doublon\",IF(OR(X8=\"A\",X8=\"D\"),\"\",   IF(AB8<>\"\",AB8,   IF(AND(D8<>\"F\",D8<>\"G\",D8<>\"M\",D8<>\"\"),\"Sexe Non Valide\",IF(AND(D8=\"\",M8<>\"\"),\" Sexe ?\",IF(OR(N(V8)<0,N(V8)>Max_Note3),\"Pb Note 3\",IF(OR(N(W8)<0,N(W8)>Max_Note4),\"Pb Note 4\",IF(AND(ISNUMBER(X8),COUNT(T8:W8)<4), \"Il manque \"& (4-COUNT(T8:W8)) & \" note(s)\",\"\")))))))), \"\")","v":""},"",null,null,null,null,null,"Tps 5",null,null,"",false,""]
[4,null,null,null,null,null,null,null,null,null,"",{"$f":"IF(ISBLANK(G9),IF(ISERR(VALUE(F9)),RIGHT(F9,1),T(VLOOKUP(VALUE(F9),BAREME!$M$37:$O$45,3,FALSE))),IF(ISERR(VALUE(G9)), RIGHT(G9,1), T( VLOOKUP(VALUE(G9),BAREME!$M$37:$O$45,3,FALSE))))","v":""},{"$f":"IF(COUNT(H9:J9)=Nb_Courses,SUM(INT(H9:J9),INT(SUM(H9:J9-INT(H9:J9))/0.6),MOD(SUM(H9:J9-INT(H9:J9)),0.6)),\"\")","v":""},"",null,null,null,null,null,{"$f":"IF(AND(ISNUMBER(M9),D9<>\"\",F9<>\"\"),VLOOKUP(M9,IF(D9=\"F\",Bareme_F,Bareme_G),Decal),IF(OR(H9=\"X\",I9=\"X\",J9=\"X\"),0,\"\"))","v":""},null,"","","","",null,{"$f":"IFERROR(IF(COUNTIF(Dossard,Z9)>1,\"Doublon\",IF(OR(X9=\"A\",X9=\"D\"),\"\",   IF(AB9<>\"\",AB9,   IF(AND(D9<>\"F\",D9<>\"G\",D9<>\"M\",D9<>\"\"),\"Sexe Non Valide\",IF(AND(D9=\"\",M9<>\"\"),\" Sexe ?\",IF(OR(N(V9)<0,N(V9)>Max_Note3),\"Pb Note 3\",IF(OR(N(W9)<0,N(W9)>Max_Note4),\"Pb Note 4\",IF(AND(ISNUMBER(X9),COUNT(T9:W9)<4), \"Il manque \"& (4-COUNT(T9:W9)) & \" note(s)\",\"\")))))))), \"\")","v":""},"",null,null,null,null,null,"Tps 6",null,null,"",false,""]
[7,null,null,null,null,null,null,null,null,null,"",{"$f":"IF(ISBLANK(G10),IF(ISERR(VALUE(F10)),RIGHT(F10,1),T(VLOOKUP(VALUE(F10),BAREME!$M$37:$O$45,3,FALSE))),IF(ISERR(VALUE(G10)), RIGHT(G10,1), T( VLOOKUP(VALUE(G10),BAREME!$M$37:$O$45,3,FALSE))))","v":""},{"$f":"IF(COUNT(H10:J10)=Nb_Courses,SUM(INT(H10:J10),INT(SUM(H10:J10-INT(H10:J10))/0.6),MOD(SUM(H10:J10-INT(H10:J10)),0.6)),\"\")","v":""},"",null,null,null,null,null,{"$f":"IF(AND(ISNUMBER(M10),D10<>\"\",F10<>\"\"),VLOOKUP(M10,IF(D10=\"F\",Bareme_F,Bareme_G),Decal),IF(OR(H10=\"X\",I10=\"X\",J10=\"X\"),0,\"\"))","v":""},null,"","","","",null,{"$f":"IFERROR(IF(COUNTIF(Dossard,Z10)>1,\"Doublon\",IF(OR(X10=\"A\",X10=\"D\"),\"\",   IF(AB10<>\"\",AB10,   IF(AND(D10<>\"F\",D10<>\"G\",D10<>\"M\",D10<>\"\"),\"Sexe Non Valide\",IF(AND(D10=\"\",M10<>\"\"),\" Sexe ?\",IF(OR(N(V10)<0,N(V10)>Max_Note3),\"Pb Note 3\",IF(OR(N(W10)<0,N(W10)>Max_Note4),\"Pb Note 4\",IF(AND(ISNUMBER(X10),COUNT(T10:W10)<4), \"Il manque \"& (4-COUNT(T10:W10)) & \" note(s)\",\"\")))))))), \"\")","v":""},"",null,null,null,null,null,"Tps 7",null,null,"",false,""]
[8,null,null,null,null,null,null,null,null,null,"",{"$f":"IF(ISBLANK(G11),IF(ISERR(VALUE(F11)),RIGHT(F11,1),T(VLOOKUP(VALUE(F11),BAREME!$M$37:$O$45,3,FALSE))),IF(ISERR(VALUE(G11)), RIGHT(G11,1), T( VLOOKUP(VALUE(G11),BAREME!$M$37:$O$45,3,FALSE))))","v":""},{"$f":"IF(COUNT(H11:J11)=Nb_Courses,SUM(INT(H11:J11),INT(SUM(H11:J11-INT(H11:J11))/0.6),MOD(SUM(H11:J11-INT(H11:J11)),0.6)),\"\")","v":""},"",null,null,null,null,null,{"$f":"IF(AND(ISNUMBER(M11),D11<>\"\",F11<>\"\"),VLOOKUP(M11,IF(D11=\"F\",Bareme_F,Bareme_G),Decal),IF(OR(H11=\"X\",I11=\"X\",J11=\"X\"),0,\"\"))","v":""},null,"","","","",null,{"$f":"IFERROR(IF(COUNTIF(Dossard,Z11)>1,\"Doublon\",IF(OR(X11=\"A\",X11=\"D\"),\"\",   IF(AB11<>\"\",AB11,   IF(AND(D11<>\"F\",D11<>\"G\",D11<>\"M\",D11<>\"\"),\"Sexe Non Valide\",IF(AND(D11=\"\",M11<>\"\"),\" Sexe ?\",IF(OR(N(V11)<0,N(V11)>Max_Note3),\"Pb Note 3\",IF(OR(N(W11)<0,N(W11)>Max_Note4),\"Pb Note 4\",IF(AND(ISNUMBER(X11),COUNT(T11:W11)<4), \"Il manque \"& (4-COUNT(T11:W11)) & \" note(s)\",\"\")))))))), \"\")","v":""},"",null,null,null,null,null,"Tps 8",null,null,"",false,""]
[9,null,null,null,null,null,null,null,null,null,"",{"$f":"IF(ISBLANK(G12),IF(ISERR(VALUE(F12)),RIGHT(F12,1),T(VLOOKUP(VALUE(F12),BAREME!$M$37:$O$45,3,FALSE))),IF(ISERR(VALUE(G12)), RIGHT(G12,1), T( VLOOKUP(VALUE(G12),BAREME!$M$37:$O$45,3,FALSE))))","v":""},{"$f":"IF(COUNT(H12:J12)=Nb_Courses,SUM(INT(H12:J12),INT(SUM(H12:J12-INT(H12:J12))/0.6),MOD(SUM(H12:J12-INT(H12:J12)),0.6)),\"\")","v":""},"",null,null,null,null,null,{"$f":"IF(AND(ISNUMBER(M12),D12<>\"\",F12<>\"\"),VLOOKUP(M12,IF(D12=\"F\",Bareme_F,Bareme_G),Decal),IF(OR(H12=\"X\",I12=\"X\",J12=\"X\"),0,\"\"))","v":""},null,"","","","",null,{"$f":"IFERROR(IF(COUNTIF(Dossard,Z12)>1,\"Doublon\",IF(OR(X12=\"A\",X12=\"D\"),\"\",   IF(AB12<>\"\",AB12,   IF(AND(D12<>\"F\",D12<>\"G\",D12<>\"M\",D12<>\"\"),\"Sexe Non Valide\",IF(AND(D12=\"\",M12<>\"\"),\" Sexe ?\",IF(OR(N(V12)<0,N(V12)>Max_Note3),\"Pb Note 3\",IF(OR(N(W12)<0,N(W12)>Max_Note4),\"Pb Note 4\",IF(AND(ISNUMBER(X12),COUNT(T12:W12)<4), \"Il manque \"& (4-COUNT(T12:W12)) & \" note(s)\",\"\")))))))), \"\")","v":""},"",null,null,null,null,null,"Tps 9",null,null,"",false,""]
[10,null,null,null,null,null,null,null,null,null,"",{"$f":"IF(ISBLANK(G13),IF(ISERR(VALUE(F13)),RIGHT(F13,1),T(VLOOKUP(VALUE(F13),BAREME!$M$37:$O$45,3,FALSE))),IF(ISERR(VALUE(G13)), RIGHT(G13,1), T( VLOOKUP(VALUE(G13),BAREME!$M$37:$O$45,3,FALSE))))","v":""},{"$f":"IF(COUNT(H13:J13)=Nb_Courses,SUM(INT(H13:J13),INT(SUM(H13:J13-INT(H13:J13))/0.6),MOD(SUM(H13:J13-INT(H13:J13)),0.6)),\"\")","v":""},"",null,null,null,null,null,{"$f":"IF(AND(ISNUMBER(M13),D13<>\"\",F13<>\"\"),VLOOKUP(M13,IF(D13=\"F\",Bareme_F,Bareme_G),Decal),IF(OR(H13=\"X\",I13=\"X\",J13=\"X\"),0,\"\"))","v":""},null,"","","","",null,{"$f":"IFERROR(IF(COUNTIF(Dossard,Z13)>1,\"Doublon\",IF(OR(X13=\"A\",X13=\"D\"),\"\",   IF(AB13<>\"\",AB13,   IF(AND(D13<>\"F\",D13<>\"G\",D13<>\"M\",D13<>\"\"),\"Sexe Non Valide\",IF(AND(D13=\"\",M13<>\"\"),\" Sexe ?\",IF(OR(N(V13)<0,N(V13)>Max_Note3),\"Pb Note 3\",IF(OR(N(W13)<0,N(W13)>Max_Note4),\"Pb Note 4\",IF(AND(ISNUMBER(X13),COUNT(T13:W13)<4), \"Il manque \"& (4-COUNT(T13:W13)) & \" note(s)\",\"\")))))))), \"\")","v":""},"",null,null,null,null,null,"Tps 10",null,null,"",false,""]
[11,null,null,null,null,null,null,null,null,null,"",{"$f":"IF(ISBLANK(G14),IF(ISERR(VALUE(F14)),RIGHT(F14,1),T(VLOOKUP(VALUE(F14),BAREME!$M$37:$O$45,3,FALSE))),IF(ISERR(VALUE(G14)), RIGHT(G14,1), T( VLOOKUP(VALUE(G14),BAREME!$M$37:$O$45,3,FALSE))))","v":""},{"$f":"IF(COUNT(H14:J14)=Nb_Courses,SUM(INT(H14:J14),INT(SUM(H14:J14-INT(H14:J14))/0.6),MOD(SUM(H14:J14-INT(H14:J14)),0.6)),\"\")","v":""},"",null,null,null,null,null,{"$f":"IF(AND(ISNUMBER(M14),D14<>\"\",F14<>\"\"),VLOOKUP(M14,IF(D14=\"F\",Bareme_F,Bareme_G),Decal),IF(OR(H14=\"X\",I14=\"X\",J14=\"X\"),0,\"\"))","v":""},null,"","","","",null,{"$f":"IFERROR(IF(COUNTIF(Dossard,Z14)>1,\"Doublon\",IF(OR(X14=\"A\",X14=\"D\"),\"\",   IF(AB14<>\"\",AB14,   IF(AND(D14<>\"F\",D14<>\"G\",D14<>\"M\",D14<>\"\"),\"Sexe Non Valide\",IF(AND(D14=\"\",M14<>\"\"),\" Sexe ?\",IF(OR(N(V14)<0,N(V14)>Max_Note3),\"Pb Note 3\",IF(OR(N(W14)<0,N(W14)>Max_Note4),\"Pb Note 4\",IF(AND(ISNUMBER(X14),COUNT(T14:W14)<4), \"Il manque \"& (4-COUNT(T14:W14)) & \" note(s)\",\"\")))))))), \"\")","v":""},"",null,null,null,null,null,"Tps 11",null,null,"",false,""]
[12,null,null,null,null,null,null,null,null,null,"",{"$f":"IF(ISBLANK(G15),IF(ISERR(VALUE(F15)),RIGHT(F15,1),T(VLOOKUP(VALUE(F15),BAREME!$M$37:$O$45,3,FALSE))),IF(ISERR(VALUE(G15)), RIGHT(G15,1), T( VLOOKUP(VALUE(G15),BAREME!$M$37:$O$45,3,FALSE))))","v":""},{"$f":"IF(COUNT(H15:J15)=Nb_Courses,SUM(INT(H15:J15),INT(SUM(H15:J15-INT(H15:J15))/0.6),MOD(SUM(H15:J15-INT(H15:J15)),0.6)),\"\")","v":""},"",null,null,null,null,null,{"$f":"IF(AND(ISNUMBER(M15),D15<>\"\",F15<>\"\"),VLOOKUP(M15,IF(D15=\"F\",Bareme_F,Bareme_G),Decal),IF(OR(H15=\"X\",I15=\"X\",J15=\"X\"),0,\"\"))","v":""},null,"","","","",null,{"$f":"IFERROR(IF(COUNTIF(Dossard,Z15)>1,\"Doublon\",IF(OR(X15=\"A\",X15=\"D\"),\"\",   IF(AB15<>\"\",AB15,   IF(AND(D15<>\"F\",D15<>\"G\",D15<>\"M\",D15<>\"\"),\"Sexe Non Valide\",IF(AND(D15=\"\",M15<>\"\"),\" Sexe ?\",IF(OR(N(V15)<0,N(V15)>Max_Note3),\"Pb Note 3\",IF(OR(N(W15)<0,N(W15)>Max_Note4),\"Pb Note 4\",IF(AND(ISNUMBER(X15),COUNT(T15:W15)<4), \"Il manque \"& (4-COUNT(T15:W15)) & \" note(s)\",\"\")))))))), \"\")","v":""},"",null,null,null,null,null,"Tps 12",null,null,"",false,""]
{"$rows_left_out":25}
{"sheet":"Histo","index":3,"n_rows":143,"n_cols":35,"rows_kept":143,"cut":false,"hidden":false,"merged":[]}
[]
[null,null,null,"HISTORIQUE",null,null,null,null,null,null,null,null,null,null,null,null,null,null,null,null,null,null,null,null,null,null,null,null,null,null,null,null,null,null,3.0092592592592671E-4]
[]
[]
[]
["V3,0","2021-05-10","Version de Diffusion"]
[null,null,"Mise à jour de la page AIDE"]
[null,null,"Suppression du Multi-classes"]
[null,null,"Bouton Classe dans Bareme avec mise à jour  macro pour changement automatique du nom de la plaque en fonction de la classe "]
[null,null,"Matrice nommée dans rechercheV pour note AFLP 3 & 4"]
[null,null,"Correction erreur ref macro pour les fleches haut bas du bloc Degré AFLP1"]
[null,null,"Correction del formule nommée  Rap_AFLP3_4 pour tenir compte du numero de ligne de la valeur recherchée en utilisant index et ligne-3 pour decalage ligne physique et tableau"]
[]
["V2.11","2021-05-09","Dans Chronometrage = Transfere_Resultats  calcul de la derniere colonne de perf en fonction de la variable nommée Nb_Courses  et ajustement du MESSAGE d'ERREUR"]
[null,null,"Suppression des formules et masquage des colonnes inutiles sans suppression pour éviter erreur de ref dans VBA"]
{"$rows_left_out":128}