{"text_format":"1","workbook":"xlsx","n_sheets":5,"sheets":["ACCUEIL","TPSTOUR","REFERENTIELS","DEBUT","APPEL"],"not_rendered":{"charts":0,"images":5,"macros":1,"external_links":0,"defined_names":14,"comments":0,"pivot_tables":0},"unopened":[],"bounds":{"document_bytes":16777216,"sheet_cells":100000,"rows_first":2000,"rows_last":500,"rows_between":2000,"halvings":0,"cell_chars":16384,"cell_head_chars":4096},"cells_cut":0,"cells_raw":0,"read":"whole","date_system":"1900"}

{"sheet":"ACCUEIL","index":0,"n_rows":16,"n_cols":3,"rows_kept":16,"cut":false,"hidden":false,"merged":[[15,2,15,5]]}
[]
[]
[]
[]
[]
[]
[]
[]
[]
[]
[]
[]
[]
[]
[]
[null,null,"3x500"]

{"sheet":"TPSTOUR","index":1,"n_rows":36,"n_cols":55,"rows_kept":36,"cut":false,"hidden":false,"merged":[[1,13,1,47],[35,1,35,3],[1,1,1,5]]}
[]
[null,null,null,null,null,null,null,null,null,null,null,null,null,"CLIQUEZ SUR CHRONO (lancer un autre chrono en //) PUIS SUR LE NOM D'UN COUREUR AUX 250 et 500m. CLIQUEZ SUR RAZ A LA FIN DE CHAQUE 500 ",null,null,null,null,null,null,null,null,null,null,null,null,null,null,null,null,null,null,null,null,null,null,null,null,null,null,null,null,null,null,null,null,null,null,null,null,null,null,"Classe"]
[null,1,null,2,null,3,4,4,5,5,6,6,null,7,null,8,9,9,10,10,12,11,null,12,null,13,16,14,17,15,18,16,null,17,null,18,22,19,23,20,24,21,null,22,null,23,28,24,null,null,null,null,"STAGE"]
["Lancer un chrono en parallèle",{"$f":"BA5","v":"Alexandre"},null,{"$f":"BA6","v":"Alexis F."},null,{"$f":"BA7","v":"Anthony"},null,{"$f":"BA8","v":"Christian"},null,{"$f":"BA9","v":"Claudine"},null,{"$f":"BA10","v":"Emmanuel"},null,{"$f":"BA11","v":"vivien"},null,{"$f":"BA12","v":"Fred"},null,{"$f":"BA13","v":"Gwen"},null,{"$f":"BA14","v":"Julien"},null,{"$f":"BA15","v":"Laurent"},null,{"$f":"BA16","v":"Marc-Antoine"},null,{"$f":"BA17","v":"Marco"},null,{"$f":"BA18","v":"Morgane"},null,{"$f":"BA19","v":"Nathalie"},null,{"$f":"BA20","v":"Nico Afriat"},null,{"$f":"BA21","v":"Nico Podu"},null,{"$f":"BA22","v":"Olivier"},null,{"$f":"BA23","v":"Pascal"},null,{"$f":"BA24","v":"Phil G."},null,{"$f":"BA25","v":"Philippe G."},null,{"$f":"BA26","v":"Stef"},null,{"$f":"BA27","v":"Thomas"},null,{"$f":"BA28","v":"Tristan"},null,null,null,null,null,null,"Faire Ctrl+S après avoir renommer formes"]
[null,{"$f":"VLOOKUP(B4,$BA$5:$BB$28,2,FALSE)","v":"g"},{"$error":"#N/A"},"g",{"$error":"#N/A"},"g",{"$error":"#N/A"},"g",{"$error":"#N/A"},"f",{"$error":"#N/A"},"g",{"$error":"#N/A"},"g",{"$error":"#N/A"},"g",{"$error":"#N/A"},"g",{"$error":"#N/A"},"g",{"$error":"#N/A"},"g",{"$error":"#N/A"},"g",{"$error":"#N/A"},"g",{"$error":"#N/A"},"f",{"$error":"#N/A"},"f",{"$error":"#N/A"},"g",{"$error":"#N/A"},"g",{"$error":"#N/A"},"g",{"$error":"#N/A"},"g",{"$error":"#N/A"},"g",{"$error":"#N/A"},"g",{"$error":"#N/A"},"g",{"$error":"#N/A"},"g",{"$error":"#N/A"},"g",null,null,null,1,{"$f":"OFFSET(INDEX(eleves,MATCH(AZ5,numero,0),MATCH($BA$3,classe,0)),0,1)","v":"Alexandre"},{"$f":"OFFSET(INDEX(eleves,MATCH(AZ5,numero,0),MATCH($BA$3,classe,0)),0,2)","v":"g"}]
[250,null,null,null,null,null,null,null,null,null,null,null,null,null,null,null,null,null,null,null,null,null,null,null,null,null,null,null,null,null,null,null,null,null,null,null,null,null,null,null,null,null,null,null,null,null,null,null,null,250,null,2,"Alexis F.","g"]
["1er 500",null,null,null,null,null,null,null,null,null,null,null,null,null,null,null,null,null,null,null,null,null,null,null,null,null,null,null,null,null,null,null,null,null,null,null,null,null,null,null,null,null,null,null,null,null,null,null,null,"1er 500",null,3,"Anthony","g"]
[250,null,null,null,null,null,null,null,null,null,null,null,null,null,null,null,null,null,null,null,null,null,null,null,null,null,null,null,null,null,null,null,null,null,null,null,null,null,null,null,null,null,null,null,null,null,null,null,null,250,null,4,"Christian","g"]
["2è 500",null,null,null,null,null,null,null,null,null,null,null,null,null,null,null,null,null,null,null,null,null,null,null,null,null,null,null,null,null,null,null,null,null,null,null,null,null,null,null,null,null,null,null,null,null,null,null,null,"2è 500",null,5,"Claudine","f"]
[250,null,null,null,null,null,null,null,null,null,null,null,null,null,null,null,null,null,null,null,null,null,null,null,null,null,null,null,null,null,null,null,null,null,null,null,null,null,null,null,null,null,null,null,null,null,null,null,null,250,null,6,"Emmanuel","g"]
["3è 500",null,null,null,null,null,null,null,null,null,null,null,null,null,null,null,null,null,null,null,null,null,null,null,null,null,null,null,null,null,null,null,null,null,null,null,null,null,null,null,null,null,null,null,null,null,null,null,null,"3è 500",null,7,"vivien","g"]
[null,null,null,null,null,null,null,null,null,null,null,null,null,null,null,null,null,null,null,null,null,null,null,null,null,null,null,null,null,null,null,null,null,null,null,null,null,null,null,null,null,null,null,null,null,null,null,null,null,null,null,8,"Fred","g"]
["3x500",{"$f":"B11+B9+B7","v":"00:00:00"},{"$f":"C11+C9+C7","v":"00:00:00"},"00:00:00","00:00:00","00:00:00","00:00:00","00:00:00","00:00:00","00:00:00","00:00:00","00:00:00","00:00:00","00:00:00","00:00:00","00:00:00","00:00:00","00:00:00","00:00:00","00:00:00","00:00:00","00:00:00","00:00:00","00:00:00","00:00:00","00:00:00","00:00:00","00:00:00","00:00:00","00:00:00","00:00:00","00:00:00","00:00:00","00:00:00","00:00:00","00:00:00","00:00:00","00:00:00","00:00:00","00:00:00","00:00:00","00:00:00","00:00:00","00:00:00","00:00:00","00:00:00","00:00:00","00:00:00",null,"3x500",null,9,"Gwen","g"]
[null,null,null,null,null,null,null,null,null,null,null,null,null,null,null,null,null,null,null,null,null,null,null,null,null,null,null,null,null,null,null,null,null,null,null,null,null,null,null,null,null,null,null,null,null,null,null,null,null,null,null,10,"Julien","g"]
["NOTE/15",{"$f":"IFERROR(IF(B5=\"g\",VLOOKUP(B13,DEBUT!$K$5:$M$35,3,TRUE),VLOOKUP(B13,DEBUT!$L$5:$M$35,2,TRUE)),\"\")","v":""},{"$f":"IFERROR(IF(C5=\"g\",VLOOKUP(C13,DEBUT!$K$5:$M$35,3,TRUE),VLOOKUP(C13,DEBUT!$L$5:$M$35,2,TRUE)),\"\")","v":""},{"$f":"IFERROR(IF(D5=\"g\",VLOOKUP(D13,DEBUT!$K$5:$M$35,3,TRUE),VLOOKUP(D13,DEBUT!$L$5:$M$35,2,TRUE)),\"\")","v":""},{"$f":"IFERROR(IF(E5=\"g\",VLOOKUP(E13,DEBUT!$K$5:$M$35,3,TRUE),VLOOKUP(E13,DEBUT!$L$5:$M$35,2,TRUE)),\"\")","v":""},{"$f":"IFERROR(IF(F5=\"g\",VLOOKUP(F13,DEBUT!$K$5:$M$35,3,TRUE),VLOOKUP(F13,DEBUT!$L$5:$M$35,2,TRUE)),\"\")","v":""},{"$f":"IFERROR(IF(G5=\"g\",VLOOKUP(G13,DEBUT!$K$5:$M$35,3,TRUE),VLOOKUP(G13,DEBUT!$L$5:$M$35,2,TRUE)),\"\")","v":""},{"$f":"IFERROR(IF(H5=\"g\",VLOOKUP(H13,DEBUT!$K$5:$M$35,3,TRUE),VLOOKUP(H13,DEBUT!$L$5:$M$35,2,TRUE)),\"\")","v":""},{"$f":"IFERROR(IF(I5=\"g\",VLOOKUP(I13,DEBUT!$K$5:$M$35,3,TRUE),VLOOKUP(I13,DEBUT!$L$5:$M$35,2,TRUE)),\"\")","v":""},{"$f":"IFERROR(IF(J5=\"g\",VLOOKUP(J13,DEBUT!$K$5:$M$35,3,TRUE),VLOOKUP(J13,DEBUT!$L$5:$M$35,2,TRUE)),\"\")","v":""},{"$f":"IFERROR(IF(K5=\"g\",VLOOKUP(K13,DEBUT!$K$5:$M$35,3,TRUE),VLOOKUP(K13,DEBUT!$L$5:$M$35,2,TRUE)),\"\")","v":""},{"$f":"IFERROR(IF(L5=\"g\",VLOOKUP(L13,DEBUT!$K$5:$M$35,3,TRUE),VLOOKUP(L13,DEBUT!$L$5:$M$35,2,TRUE)),\"\")","v":""},{"$f":"IFERROR(IF(M5=\"g\",VLOOKUP(M13,DEBUT!$K$5:$M$35,3,TRUE),VLOOKUP(M13,DEBUT!$L$5:$M$35,2,TRUE)),\"\")","v":""},{"$f":"IFERROR(IF(N5=\"g\",VLOOKUP(N13,DEBUT!$K$5:$M$35,3,TRUE),VLOOKUP(N13,DEBUT!$L$5:$M$35,2,TRUE)),\"\")","v":""},{"$f":"IFERROR(IF(O5=\"g\",VLOOKUP(O13,DEBUT!$K$5:$M$35,3,TRUE),VLOOKUP(O13,DEBUT!$L$5:$M$35,2,TRUE)),\"\")","v":""},{"$f":"IFERROR(IF(P5=\"g\",VLOOKUP(P13,DEBUT!$K$5:$M$35,3,TRUE),VLOOKUP(P13,DEBUT!$L$5:$M$35,2,TRUE)),\"\")","v":""},{"$f":"IFERROR(IF(Q5=\"g\",VLOOKUP(Q13,DEBUT!$K$5:$M$35,3,TRUE),VLOOKUP(Q13,DEBUT!$L$5:$M$35,2,TRUE)),\"\")","v":""},{"$f":"IFERROR(IF(R5=\"g\",VLOOKUP(R13,DEBUT!$K$5:$M$35,3,TRUE),VLOOKUP(R13,DEBUT!$L$5:$M$35,2,TRUE)),\"\")","v":""},{"$f":"IFERROR(IF(S5=\"g\",VLOOKUP(S13,DEBUT!$K$5:$M$35,3,TRUE),VLOOKUP(S13,DEBUT!$L$5:$M$35,2,TRUE)),\"\")","v":""},{"$f":"IFERROR(IF(T5=\"g\",VLOOKUP(T13,DEBUT!$K$5:$M$35,3,TRUE),VLOOKUP(T13,DEBUT!$L$5:$M$35,2,TRUE)),\"\")","v":""},{"$f":"IFERROR(IF(U5=\"g\",VLOOKUP(U13,DEBUT!$K$5:$M$35,3,TRUE),VLOOKUP(U13,DEBUT!$L$5:$M$35,2,TRUE)),\"\")","v":""},{"$f":"IFERROR(IF(V5=\"g\",VLOOKUP(V13,DEBUT!$K$5:$M$35,3,TRUE),VLOOKUP(V13,DEBUT!$L$5:$M$35,2,TRUE)),\"\")","v":""},{"$f":"IFERROR(IF(W5=\"g\",VLOOKUP(W13,DEBUT!$K$5:$M$35,3,TRUE),VLOOKUP(W13,DEBUT!$L$5:$M$35,2,TRUE)),\"\")","v":""},{"$f":"IFERROR(IF(X5=\"g\",VLOOKUP(X13,DEBUT!$K$5:$M$35,3,TRUE),VLOOKUP(X13,DEBUT!$L$5:$M$35,2,TRUE)),\"\")","v":""},{"$f":"IFERROR(IF(Y5=\"g\",VLOOKUP(Y13,DEBUT!$K$5:$M$35,3,TRUE),VLOOKUP(Y13,DEBUT!$L$5:$M$35,2,TRUE)),\"\")","v":""},{"$f":"IFERROR(IF(Z5=\"g\",VLOOKUP(Z13,DEBUT!$K$5:$M$35,3,TRUE),VLOOKUP(Z13,DEBUT!$L$5:$M$35,2,TRUE)),\"\")","v":""},{"$f":"IFERROR(IF(AA5=\"g\",VLOOKUP(AA13,DEBUT!$K$5:$M$35,3,TRUE),VLOOKUP(AA13,DEBUT!$L$5:$M$35,2,TRUE)),\"\")","v":""},{"$f":"IFERROR(IF(AB5=\"g\",VLOOKUP(AB13,DEBUT!$K$5:$M$35,3,TRUE),VLOOKUP(AB13,DEBUT!$L$5:$M$35,2,TRUE)),\"\")","v":""},{"$f":"IFERROR(IF(AC5=\"g\",VLOOKUP(AC13,DEBUT!$K$5:$M$35,3,TRUE),VLOOKUP(AC13,DEBUT!$L$5:$M$35,2,TRUE)),\"\")","v":""},{"$f":"IFERROR(IF(AD5=\"g\",VLOOKUP(AD13,DEBUT!$K$5:$M$35,3,TRUE),VLOOKUP(AD13,DEBUT!$L$5:$M$35,2,TRUE)),\"\")","v":""},{"$f":"IFERROR(IF(AE5=\"g\",VLOOKUP(AE13,DEBUT!$K$5:$M$35,3,TRUE),VLOOKUP(AE13,DEBUT!$L$5:$M$35,2,TRUE)),\"\")","v":""},{"$f":"IFERROR(IF(AF5=\"g\",VLOOKUP(AF13,DEBUT!$K$5:$M$35,3,TRUE),VLOOKUP(AF13,DEBUT!$L$5:$M$35,2,TRUE)),\"\")","v":""},{"$f":"IFERROR(IF(AG5=\"g\",VLOOKUP(AG13,DEBUT!$K$5:$M$35,3,TRUE),VLOOKUP(AG13,DEBUT!$L$5:$M$35,2,TRUE)),\"\")","v":""},{"$f":"IFERROR(IF(AH5=\"g\",VLOOKUP(AH13,DEBUT!$K$5:$M$35,3,TRUE),VLOOKUP(AH13,DEBUT!$L$5:$M$35,2,TRUE)),\"\")","v":""},{"$f":"IFERROR(IF(AI5=\"g\",VLOOKUP(AI13,DEBUT!$K$5:$M$35,3,TRUE),VLOOKUP(AI13,DEBUT!$L$5:$M$35,2,TRUE)),\"\")","v":""},{"$f":"IFERROR(IF(AJ5=\"g\",VLOOKUP(AJ13,DEBUT!$K$5:$M$35,3,TRUE),VLOOKUP(AJ13,DEBUT!$L$5:$M$35,2,TRUE)),\"\")","v":""},{"$f":"IFERROR(IF(AK5=\"g\",VLOOKUP(AK13,DEBUT!$K$5:$M$35,3,TRUE),VLOOKUP(AK13,DEBUT!$L$5:$M$35,2,TRUE)),\"\")","v":""},{"$f":"IFERROR(IF(AL5=\"g\",VLOOKUP(AL13,DEBUT!$K$5:$M$35,3,TRUE),VLOOKUP(AL13,DEBUT!$L$5:$M$35,2,TRUE)),\"\")","v":""},{"$f":"IFERROR(IF(AM5=\"g\",VLOOKUP(AM13,DEBUT!$K$5:$M$35,3,TRUE),VLOOKUP(AM13,DEBUT!$L$5:$M$35,2,TRUE)),\"\")","v":""},{"$f":"IFERROR(IF(AN5=\"g\",VLOOKUP(AN13,DEBUT!$K$5:$M$35,3,TRUE),VLOOKUP(AN13,DEBUT!$L$5:$M$35,2,TRUE)),\"\")","v":""},{"$f":"IFERROR(IF(AO5=\"g\",VLOOKUP(AO13,DEBUT!$K$5:$M$35,3,TRUE),VLOOKUP(AO13,DEBUT!$L$5:$M$35,2,TRUE)),\"\")","v":""},{"$f":"IFERROR(IF(AP5=\"g\",VLOOKUP(AP13,DEBUT!$K$5:$M$35,3,TRUE),VLOOKUP(AP13,DEBUT!$L$5:$M$35,2,TRUE)),\"\")","v":""},{"$f":"IFERROR(IF(AQ5=\"g\",VLOOKUP(AQ13,DEBUT!$K$5:$M$35,3,TRUE),VLOOKUP(AQ13,DEBUT!$L$5:$M$35,2,TRUE)),\"\")","v":""},{"$f":"IFERROR(IF(AR5=\"g\",VLOOKUP(AR13,DEBUT!$K$5:$M$35,3,TRUE),VLOOKUP(AR13,DEBUT!$L$5:$M$35,2,TRUE)),\"\")","v":""},{"$f":"IFERROR(IF(AS5=\"g\",VLOOKUP(AS13,DEBUT!$K$5:$M$35,3,TRUE),VLOOKUP(AS13,DEBUT!$L$5:$M$35,2,TRUE)),\"\")","v":""},{"$f":"IFERROR(IF(AT5=\"g\",VLOOKUP(AT13,DEBUT!$K$5:$M$35,3,TRUE),VLOOKUP(AT13,DEBUT!$L$5:$M$35,2,TRUE)),\"\")","v":""},{"$f":"IFERROR(IF(AU5=\"g\",VLOOKUP(AU13,DEBUT!$K$5:$M$35,3,TRUE),VLOOKUP(AU13,DEBUT!$L$5:$M$35,2,TRUE)),\"\")","v":""},{"$f":"IFERROR(IF(AV5=\"g\",VLOOKUP(AV13,DEBUT!$K$5:$M$35,3,TRUE),VLOOKUP(AV13,DEBUT!$L$5:$M$35,2,TRUE)),\"\")","v":""},null,"NOTE/15",null,11,"Laurent","g"]
[null,null,null,null,null,null,null,null,null,null,null,null,null,null,null,null,null,null,null,null,null,null,null,null,null,null,null,null,null,null,null,null,null,null,null,null,null,null,null,null,null,null,null,null,null,null,null,null,null,null,null,12,"Marc-Antoine","g"]
["ECART MAX",{"$f":"LARGE(B19:B21,1)","v":0},null,{"$f":"LARGE(D19:D21,1)","v":0},null,{"$f":"LARGE(F19:F21,1)","v":0},null,{"$f":"LARGE(H19:H21,1)","v":0},null,{"$f":"LARGE(J19:J21,1)","v":0},null,{"$f":"LARGE(L19:L21,1)","v":0},null,{"$f":"LARGE(N19:N21,1)","v":0},null,{"$f":"LARGE(P19:P21,1)","v":0},null,{"$f":"LARGE(R19:R21,1)","v":0},null,{"$f":"LARGE(T19:T21,1)","v":0},null,{"$f":"LARGE(V19:V21,1)","v":0},null,{"$f":"LARGE(X19:X21,1)","v":0},null,{"$f":"LARGE(Z19:Z21,1)","v":0},null,{"$f":"LARGE(AB19:AB21,1)","v":0},null,{"$f":"LARGE(AD19:AD21,1)","v":0},null,{"$f":"LARGE(AF19:AF21,1)","v":0},null,{"$f":"LARGE(AH19:AH21,1)","v":0},null,{"$f":"LARGE(AJ19:AJ21,1)","v":0},null,{"$f":"LARGE(AL19:AL21,1)","v":0},null,{"$f":"LARGE(AN19:AN21,1)","v":0},null,{"$f":"LARGE(AP19:AP21,1)","v":0},null,{"$f":"LARGE(AR19:AR21,1)","v":0},null,{"$f":"LARGE(AT19:AT21,1)","v":0},null,{"$f":"LARGE(AV19:AV21,1)","v":0},null,"ECART MAX",null,13,"Marco","g"]
["NOTE ECART /3",{"$f":"VLOOKUP(B17,DEBUT!$O$5:$P$23,2,TRUE)","v":3},null,{"$f":"VLOOKUP(D17,DEBUT!$O$5:$P$23,2,TRUE)","v":3},null,{"$f":"VLOOKUP(F17,DEBUT!$O$5:$P$23,2,TRUE)","v":3},null,{"$f":"VLOOKUP(H17,DEBUT!$O$5:$P$23,2,TRUE)","v":3},null,{"$f":"VLOOKUP(J17,DEBUT!$O$5:$P$23,2,TRUE)","v":3},null,{"$f":"VLOOKUP(L17,DEBUT!$O$5:$P$23,2,TRUE)","v":3},null,{"$f":"VLOOKUP(N17,DEBUT!$O$5:$P$23,2,TRUE)","v":3},null,{"$f":"VLOOKUP(P17,DEBUT!$O$5:$P$23,2,TRUE)","v":3},null,{"$f":"VLOOKUP(R17,DEBUT!$O$5:$P$23,2,TRUE)","v":3},null,{"$f":"VLOOKUP(T17,DEBUT!$O$5:$P$23,2,TRUE)","v":3},null,{"$f":"VLOOKUP(V17,DEBUT!$O$5:$P$23,2,TRUE)","v":3},null,{"$f":"VLOOKUP(X17,DEBUT!$O$5:$P$23,2,TRUE)","v":3},null,{"$f":"VLOOKUP(Z17,DEBUT!$O$5:$P$23,2,TRUE)","v":3},null,{"$f":"VLOOKUP(AB17,DEBUT!$O$5:$P$23,2,TRUE)","v":3},null,{"$f":"VLOOKUP(AD17,DEBUT!$O$5:$P$23,2,TRUE)","v":3},null,{"$f":"VLOOKUP(AF17,DEBUT!$O$5:$P$23,2,TRUE)","v":3},null,{"$f":"VLOOKUP(AH17,DEBUT!$O$5:$P$23,2,TRUE)","v":3},null,{"$f":"VLOOKUP(AJ17,DEBUT!$O$5:$P$23,2,TRUE)","v":3},null,{"$f":"VLOOKUP(AL17,DEBUT!$O$5:$P$23,2,TRUE)","v":3},null,{"$f":"VLOOKUP(AN17,DEBUT!$O$5:$P$23,2,TRUE)","v":3},null,{"$f":"VLOOKUP(AP17,DEBUT!$O$5:$P$23,2,TRUE)","v":3},null,{"$f":"VLOOKUP(AR17,DEBUT!$O$5:$P$23,2,TRUE)","v":3},null,{"$f":"VLOOKUP(AT17,DEBUT!$O$5:$P$23,2,TRUE)","v":3},null,{"$f":"VLOOKUP(AV17,DEBUT!$O$5:$P$23,2,TRUE)","v":3},null,"NOTE ECART /3",null,14,"Morgane","f"]
[null,{"$f":"ABS((HOUR(B7)*3600+MINUTE(B7)*60+SECOND(B7))-(HOUR(B9)*3600+MINUTE(B9)*60+SECOND(B9)))","v":0},null,{"$f":"ABS((HOUR(D7)*3600+MINUTE(D7)*60+SECOND(D7))-(HOUR(D9)*3600+MINUTE(D9)*60+SECOND(D9)))","v":0},null,{"$f":"ABS((HOUR(F7)*3600+MINUTE(F7)*60+SECOND(F7))-(HOUR(F9)*3600+MINUTE(F9)*60+SECOND(F9)))","v":0},null,{"$f":"ABS((HOUR(H7)*3600+MINUTE(H7)*60+SECOND(H7))-(HOUR(H9)*3600+MINUTE(H9)*60+SECOND(H9)))","v":0},null,{"$f":"ABS((HOUR(J7)*3600+MINUTE(J7)*60+SECOND(J7))-(HOUR(J9)*3600+MINUTE(J9)*60+SECOND(J9)))","v":0},null,{"$f":"ABS((HOUR(L7)*3600+MINUTE(L7)*60+SECOND(L7))-(HOUR(L9)*3600+MINUTE(L9)*60+SECOND(L9)))","v":0},null,{"$f":"ABS((HOUR(N7)*3600+MINUTE(N7)*60+SECOND(N7))-(HOUR(N9)*3600+MINUTE(N9)*60+SECOND(N9)))","v":0},null,{"$f":"ABS((HOUR(P7)*3600+MINUTE(P7)*60+SECOND(P7))-(HOUR(P9)*3600+MINUTE(P9)*60+SECOND(P9)))","v":0},null,{"$f":"ABS((HOUR(R7)*3600+MINUTE(R7)*60+SECOND(R7))-(HOUR(R9)*3600+MINUTE(R9)*60+SECOND(R9)))","v":0},null,{"$f":"ABS((HOUR(T7)*3600+MINUTE(T7)*60+SECOND(T7))-(HOUR(T9)*3600+MINUTE(T9)*60+SECOND(T9)))","v":0},null,{"$f":"ABS((HOUR(V7)*3600+MINUTE(V7)*60+SECOND(V7))-(HOUR(V9)*3600+MINUTE(V9)*60+SECOND(V9)))","v":0},null,{"$f":"ABS((HOUR(X7)*3600+MINUTE(X7)*60+SECOND(X7))-(HOUR(X9)*3600+MINUTE(X9)*60+SECOND(X9)))","v":0},null,{"$f":"ABS((HOUR(Z7)*3600+MINUTE(Z7)*60+SECOND(Z7))-(HOUR(Z9)*3600+MINUTE(Z9)*60+SECOND(Z9)))","v":0},null,{"$f":"ABS((HOUR(AB7)*3600+MINUTE(AB7)*60+SECOND(AB7))-(HOUR(AB9)*3600+MINUTE(AB9)*60+SECOND(AB9)))","v":0},null,{"$f":"ABS((HOUR(AD7)*3600+MINUTE(AD7)*60+SECOND(AD7))-(HOUR(AD9)*3600+MINUTE(AD9)*60+SECOND(AD9)))","v":0},null,{"$f":"ABS((HOUR(AF7)*3600+MINUTE(AF7)*60+SECOND(AF7))-(HOUR(AF9)*3600+MINUTE(AF9)*60+SECOND(AF9)))","v":0},null,{"$f":"ABS((HOUR(AH7)*3600+MINUTE(AH7)*60+SECOND(AH7))-(HOUR(AH9)*3600+MINUTE(AH9)*60+SECOND(AH9)))","v":0},null,{"$f":"ABS((HOUR(AJ7)*3600+MINUTE(AJ7)*60+SECOND(AJ7))-(HOUR(AJ9)*3600+MINUTE(AJ9)*60+SECOND(AJ9)))","v":0},null,{"$f":"ABS((HOUR(AL7)*3600+MINUTE(AL7)*60+SECOND(AL7))-(HOUR(AL9)*3600+MINUTE(AL9)*60+SECOND(AL9)))","v":0},null,{"$f":"ABS((HOUR(AN7)*3600+MINUTE(AN7)*60+SECOND(AN7))-(HOUR(AN9)*3600+MINUTE(AN9)*60+SECOND(AN9)))","v":0},null,{"$f":"ABS((HOUR(AP7)*3600+MINUTE(AP7)*60+SECOND(AP7))-(HOUR(AP9)*3600+MINUTE(AP9)*60+SECOND(AP9)))","v":0},null,{"$f":"ABS((HOUR(AR7)*3600+MINUTE(AR7)*60+SECOND(AR7))-(HOUR(AR9)*3600+MINUTE(AR9)*60+SECOND(AR9)))","v":0},null,{"$f":"ABS((HOUR(AT7)*3600+MINUTE(AT7)*60+SECOND(AT7))-(HOUR(AT9)*3600+MINUTE(AT9)*60+SECOND(AT9)))","v":0},null,{"$f":"ABS((HOUR(AV7)*3600+MINUTE(AV7)*60+SECOND(AV7))-(HOUR(AV9)*3600+MINUTE(AV9)*60+SECOND(AV9)))","v":0},null,null,null,15,"Nathalie","f"]
[null,{"$f":"ABS((HOUR(B7)*3600+MINUTE(B7)*60+SECOND(B7))-(HOUR(B11)*3600+MINUTE(B11)*60+SECOND(B11)))","v":0},null,{"$f":"ABS((HOUR(D7)*3600+MINUTE(D7)*60+SECOND(D7))-(HOUR(D11)*3600+MINUTE(D11)*60+SECOND(D11)))","v":0},null,{"$f":"ABS((HOUR(F7)*3600+MINUTE(F7)*60+SECOND(F7))-(HOUR(F11)*3600+MINUTE(F11)*60+SECOND(F11)))","v":0},null,{"$f":"ABS((HOUR(H7)*3600+MINUTE(H7)*60+SECOND(H7))-(HOUR(H11)*3600+MINUTE(H11)*60+SECOND(H11)))","v":0},null,{"$f":"ABS((HOUR(J7)*3600+MINUTE(J7)*60+SECOND(J7))-(HOUR(J11)*3600+MINUTE(J11)*60+SECOND(J11)))","v":0},null,{"$f":"ABS((HOUR(L7)*3600+MINUTE(L7)*60+SECOND(L7))-(HOUR(L11)*3600+MINUTE(L11)*60+SECOND(L11)))","v":0},null,{"$f":"ABS((HOUR(N7)*3600+MINUTE(N7)*60+SECOND(N7))-(HOUR(N11)*3600+MINUTE(N11)*60+SECOND(N11)))","v":0},null,{"$f":"ABS((HOUR(P7)*3600+MINUTE(P7)*60+SECOND(P7))-(HOUR(P11)*3600+MINUTE(P11)*60+SECOND(P11)))","v":0},null,{"$f":"ABS((HOUR(R7)*3600+MINUTE(R7)*60+SECOND(R7))-(HOUR(R11)*3600+MINUTE(R11)*60+SECOND(R11)))","v":0},null,{"$f":"ABS((HOUR(T7)*3600+MINUTE(T7)*60+SECOND(T7))-(HOUR(T11)*3600+MINUTE(T11)*60+SECOND(T11)))","v":0},null,{"$f":"ABS((HOUR(V7)*3600+MINUTE(V7)*60+SECOND(V7))-(HOUR(V11)*3600+MINUTE(V11)*60+SECOND(V11)))","v":0},null,{"$f":"ABS((HOUR(X7)*3600+MINUTE(X7)*60+SECOND(X7))-(HOUR(X11)*3600+MINUTE(X11)*60+SECOND(X11)))","v":0},null,{"$f":"ABS((HOUR(Z7)*3600+MINUTE(Z7)*60+SECOND(Z7))-(HOUR(Z11)*3600+MINUTE(Z11)*60+SECOND(Z11)))","v":0},null,{"$f":"ABS((HOUR(AB7)*3600+MINUTE(AB7)*60+SECOND(AB7))-(HOUR(AB11)*3600+MINUTE(AB11)*60+SECOND(AB11)))","v":0},null,{"$f":"ABS((HOUR(AD7)*3600+MINUTE(AD7)*60+SECOND(AD7))-(HOUR(AD11)*3600+MINUTE(AD11)*60+SECOND(AD11)))","v":0},null,{"$f":"ABS((HOUR(AF7)*3600+MINUTE(AF7)*60+SECOND(AF7))-(HOUR(AF11)*3600+MINUTE(AF11)*60+SECOND(AF11)))","v":0},null,{"$f":"ABS((HOUR(AH7)*3600+MINUTE(AH7)*60+SECOND(AH7))-(HOUR(AH11)*3600+MINUTE(AH11)*60+SECOND(AH11)))","v":0},null,{"$f":"ABS((HOUR(AJ7)*3600+MINUTE(AJ7)*60+SECOND(AJ7))-(HOUR(AJ11)*3600+MINUTE(AJ11)*60+SECOND(AJ11)))","v":0},null,{"$f":"ABS((HOUR(AL7)*3600+MINUTE(AL7)*60+SECOND(AL7))-(HOUR(AL11)*3600+MINUTE(AL11)*60+SECOND(AL11)))","v":0},null,{"$f":"ABS((HOUR(AN7)*3600+MINUTE(AN7)*60+SECOND(AN7))-(HOUR(AN11)*3600+MINUTE(AN11)*60+SECOND(AN11)))","v":0},null,{"$f":"ABS((HOUR(AP7)*3600+MINUTE(AP7)*60+SECOND(AP7))-(HOUR(AP11)*3600+MINUTE(AP11)*60+SECOND(AP11)))","v":0},null,{"$f":"ABS((HOUR(AR7)*3600+MINUTE(AR7)*60+SECOND(AR7))-(HOUR(AR11)*3600+MINUTE(AR11)*60+SECOND(AR11)))","v":0},null,{"$f":"ABS((HOUR(AT7)*3600+MINUTE(AT7)*60+SECOND(AT7))-(HOUR(AT11)*3600+MINUTE(AT11)*60+SECOND(AT11)))","v":0},null,{"$f":"ABS((HOUR(AV7)*3600+MINUTE(AV7)*60+SECOND(AV7))-(HOUR(AV11)*3600+MINUTE(AV11)*60+SECOND(AV11)))","v":0},null,null,null,16,"Nico Afriat","g"]
[null,{"$f":"ABS((HOUR(B11)*3600+MINUTE(B11)*60+SECOND(B11))-(HOUR(B9)*3600+MINUTE(B9)*60+SECOND(B9)))","v":0},null,{"$f":"ABS((HOUR(D11)*3600+MINUTE(D11)*60+SECOND(D11))-(HOUR(D9)*3600+MINUTE(D9)*60+SECOND(D9)))","v":0},null,{"$f":"ABS((HOUR(F11)*3600+MINUTE(F11)*60+SECOND(F11))-(HOUR(F9)*3600+MINUTE(F9)*60+SECOND(F9)))","v":0},null,{"$f":"ABS((HOUR(H11)*3600+MINUTE(H11)*60+SECOND(H11))-(HOUR(H9)*3600+MINUTE(H9)*60+SECOND(H9)))","v":0},null,{"$f":"ABS((HOUR(J11)*3600+MINUTE(J11)*60+SECOND(J11))-(HOUR(J9)*3600+MINUTE(J9)*60+SECOND(J9)))","v":0},null,{"$f":"ABS((HOUR(L11)*3600+MINUTE(L11)*60+SECOND(L11))-(HOUR(L9)*3600+MINUTE(L9)*60+SECOND(L9)))","v":0},null,{"$f":"ABS((HOUR(N11)*3600+MINUTE(N11)*60+SECOND(N11))-(HOUR(N9)*3600+MINUTE(N9)*60+SECOND(N9)))","v":0},null,{"$f":"ABS((HOUR(P11)*3600+MINUTE(P11)*60+SECOND(P11))-(HOUR(P9)*3600+MINUTE(P9)*60+SECOND(P9)))","v":0},null,{"$f":"ABS((HOUR(R11)*3600+MINUTE(R11)*60+SECOND(R11))-(HOUR(R9)*3600+MINUTE(R9)*60+SECOND(R9)))","v":0},null,{"$f":"ABS((HOUR(T11)*3600+MINUTE(T11)*60+SECOND(T11))-(HOUR(T9)*3600+MINUTE(T9)*60+SECOND(T9)))","v":0},null,{"$f":"ABS((HOUR(V11)*3600+MINUTE(V11)*60+SECOND(V11))-(HOUR(V9)*3600+MINUTE(V9)*60+SECOND(V9)))","v":0},null,{"$f":"ABS((HOUR(X11)*3600+MINUTE(X11)*60+SECOND(X11))-(HOUR(X9)*3600+MINUTE(X9)*60+SECOND(X9)))","v":0},null,{"$f":"ABS((HOUR(Z11)*3600+MINUTE(Z11)*60+SECOND(Z11))-(HOUR(Z9)*3600+MINUTE(Z9)*60+SECOND(Z9)))","v":0},null,{"$f":"ABS((HOUR(AB11)*3600+MINUTE(AB11)*60+SECOND(AB11))-(HOUR(AB9)*3600+MINUTE(AB9)*60+SECOND(AB9)))","v":0},null,{"$f":"ABS((HOUR(AD11)*3600+MINUTE(AD11)*60+SECOND(AD11))-(HOUR(AD9)*3600+MINUTE(AD9)*60+SECOND(AD9)))","v":0},null,{"$f":"ABS((HOUR(AF11)*3600+MINUTE(AF11)*60+SECOND(AF11))-(HOUR(AF9)*3600+MINUTE(AF9)*60+SECOND(AF9)))","v":0},null,{"$f":"ABS((HOUR(AH11)*3600+MINUTE(AH11)*60+SECOND(AH11))-(HOUR(AH9)*3600+MINUTE(AH9)*60+SECOND(AH9)))","v":0},null,{"$f":"ABS((HOUR(AJ11)*3600+MINUTE(AJ11)*60+SECOND(AJ11))-(HOUR(AJ9)*3600+MINUTE(AJ9)*60+SECOND(AJ9)))","v":0},null,{"$f":"ABS((HOUR(AL11)*3600+MINUTE(AL11)*60+SECOND(AL11))-(HOUR(AL9)*3600+MINUTE(AL9)*60+SECOND(AL9)))","v":0},null,{"$f":"ABS((HOUR(AN11)*3600+MINUTE(AN11)*60+SECOND(AN11))-(HOUR(AN9)*3600+MINUTE(AN9)*60+SECOND(AN9)))","v":0},null,{"$f":"ABS((HOUR(AP11)*3600+MINUTE(AP11)*60+SECOND(AP11))-(HOUR(AP9)*3600+MINUTE(AP9)*60+SECOND(AP9)))","v":0},null,{"$f":"ABS((HOUR(AR11)*3600+MINUTE(AR11)*60+SECOND(AR11))-(HOUR(AR9)*3600+MINUTE(AR9)*60+SECOND(AR9)))","v":0},null,{"$f":"ABS((HOUR(AT11)*3600+MINUTE(AT11)*60+SECOND(AT11))-(HOUR(AT9)*3600+MINUTE(AT9)*60+SECOND(AT9)))","v":0},null,{"$f":"ABS((HOUR(AV11)*3600+MINUTE(AV11)*60+SECOND(AV11))-(HOUR(AV9)*3600+MINUTE(AV9)*60+SECOND(AV9)))","v":0},null,null,null,17,"Nico Podu","g"]
["NOTE ECHAUFFEMENT/3",null,null,null,null,null,null,null,null,null,null,null,null,null,null,null,null,null,null,null,null,null,null,null,null,null,null,null,null,null,null,null,null,null,null,null,null,null,null,null,null,null,null,null,null,null,null,null,0,"NOTE ECHAUFFEMENT/3",null,18,"Olivier","g"]
["NOTE /20",{"$f":"IFERROR(B22+B18+B15,\"\")","v":""},{"$f":"IFERROR(C22+C18+C15,\"\")","v":""},"","","","","","","","","","","","","","","","","","","","","","","","","","","","","","","","","","","","","","","","","","","","","",null,"NOTE /20",null,19,"Pascal","g"]
[null,null,null,null,null,null,null,null,null,null,null,null,null,null,null,null,null,null,null,null,null,null,null,null,null,null,null,null,null,null,null,null,null,null,null,null,null,null,null,null,null,null,null,null,null,null,null,null,null,null,null,20,{"$f":"OFFSET(INDEX(eleves,MATCH(AZ24,numero,0),MATCH($BA$3,classe,0)),0,1)","v":"Phil G."},{"$f":"OFFSET(INDEX(eleves,MATCH(AZ24,numero,0),MATCH($BA$3,classe,0)),0,2)","v":"g"}]
["Vitesse 250",{"$f":"IFERROR(250/C25*3.6,\"\")","v":""},{"$f":"HOUR(B6)*3600+MINUTE(B6)*60+SECOND(B6)","v":"00:00:00"},{"$f":"IFERROR(250/E25*3.6,\"\")","v":""},{"$f":"HOUR(D6)*3600+MINUTE(D6)*60+SECOND(D6)","v":"00:00:00"},{"$f":"IFERROR(250/G25*3.6,\"\")","v":""},{"$f":"HOUR(F6)*3600+MINUTE(F6)*60+SECOND(F6)","v":"00:00:00"},{"$f":"IFERROR(250/I25*3.6,\"\")","v":""},{"$f":"HOUR(H6)*3600+MINUTE(H6)*60+SECOND(H6)","v":"00:00:00"},{"$f":"IFERROR(250/K25*3.6,\"\")","v":""},{"$f":"HOUR(J6)*3600+MINUTE(J6)*60+SECOND(J6)","v":"00:00:00"},{"$f":"IFERROR(250/M25*3.6,\"\")","v":""},{"$f":"HOUR(L6)*3600+MINUTE(L6)*60+SECOND(L6)","v":"00:00:00"},{"$f":"IFERROR(250/O25*3.6,\"\")","v":""},{"$f":"HOUR(N6)*3600+MINUTE(N6)*60+SECOND(N6)","v":"00:00:00"},{"$f":"IFERROR(250/Q25*3.6,\"\")","v":""},{"$f":"HOUR(P6)*3600+MINUTE(P6)*60+SECOND(P6)","v":"00:00:00"},{"$f":"IFERROR(250/S25*3.6,\"\")","v":""},{"$f":"HOUR(R6)*3600+MINUTE(R6)*60+SECOND(R6)","v":"00:00:00"},{"$f":"IFERROR(250/U25*3.6,\"\")","v":""},{"$f":"HOUR(T6)*3600+MINUTE(T6)*60+SECOND(T6)","v":"00:00:00"},{"$f":"IFERROR(250/W25*3.6,\"\")","v":""},{"$f":"HOUR(V6)*3600+MINUTE(V6)*60+SECOND(V6)","v":"00:00:00"},{"$f":"IFERROR(250/Y25*3.6,\"\")","v":""},{"$f":"HOUR(X6)*3600+MINUTE(X6)*60+SECOND(X6)","v":"00:00:00"},{"$f":"IFERROR(250/AA25*3.6,\"\")","v":""},{"$f":"HOUR(Z6)*3600+MINUTE(Z6)*60+SECOND(Z6)","v":"00:00:00"},{"$f":"IFERROR(250/AC25*3.6,\"\")","v":""},{"$f":"HOUR(AB6)*3600+MINUTE(AB6)*60+SECOND(AB6)","v":"00:00:00"},{"$f":"IFERROR(250/AE25*3.6,\"\")","v":""},{"$f":"HOUR(AD6)*3600+MINUTE(AD6)*60+SECOND(AD6)","v":"00:00:00"},{"$f":"IFERROR(250/AG25*3.6,\"\")","v":""},{"$f":"HOUR(AF6)*3600+MINUTE(AF6)*60+SECOND(AF6)","v":"00:00:00"},{"$f":"IFERROR(250/AI25*3.6,\"\")","v":""},{"$f":"HOUR(AH6)*3600+MINUTE(AH6)*60+SECOND(AH6)","v":"00:00:00"},{"$f":"IFERROR(250/AK25*3.6,\"\")","v":""},{"$f":"HOUR(AJ6)*3600+MINUTE(AJ6)*60+SECOND(AJ6)","v":"00:00:00"},{"$f":"IFERROR(250/AM25*3.6,\"\")","v":""},{"$f":"HOUR(AL6)*3600+MINUTE(AL6)*60+SECOND(AL6)","v":"00:00:00"},{"$f":"IFERROR(250/AO25*3.6,\"\")","v":""},{"$f":"HOUR(AN6)*3600+MINUTE(AN6)*60+SECOND(AN6)","v":"00:00:00"},{"$f":"IFERROR(250/AQ25*3.6,\"\")","v":""},{"$f":"HOUR(AP6)*3600+MINUTE(AP6)*60+SECOND(AP6)","v":"00:00:00"},{"$f":"IFERROR(250/AS25*3.6,\"\")","v":""},{"$f":"HOUR(AR6)*3600+MINUTE(AR6)*60+SECOND(AR6)","v":"00:00:00"},{"$f":"IFERROR(250/AU25*3.6,\"\")","v":""},{"$f":"HOUR(AT6)*3600+MINUTE(AT6)*60+SECOND(AT6)","v":"00:00:00"},{"$f":"IFERROR(250/AW25*3.6,\"\")","v":""},null,"Vitesse 250",null,21,{"$f":"OFFSET(INDEX(eleves,MATCH(AZ25,numero,0),MATCH($BA$3,classe,0)),0,1)","v":"Philippe G."},{"$f":"OFFSET(INDEX(eleves,MATCH(AZ25,numero,0),MATCH($BA$3,classe,0)),0,2)","v":"g"}]
["Vitesse 250",{"$f":"IFERROR(250/C26*3.6,\"\")","v":""},{"$f":"ABS((HOUR(B7)*3600+MINUTE(B7)*60+SECOND(B7))-(HOUR(B6)*3600+MINUTE(B6)*60+SECOND(B6)))","v":0},{"$f":"IFERROR(250/E26*3.6,\"\")","v":""},{"$f":"ABS((HOUR(D7)*3600+MINUTE(D7)*60+SECOND(D7))-(HOUR(D6)*3600+MINUTE(D6)*60+SECOND(D6)))","v":0},{"$f":"IFERROR(250/G26*3.6,\"\")","v":""},{"$f":"ABS((HOUR(F7)*3600+MINUTE(F7)*60+SECOND(F7))-(HOUR(F6)*3600+MINUTE(F6)*60+SECOND(F6)))","v":0},{"$f":"IFERROR(250/I26*3.6,\"\")","v":""},{"$f":"ABS((HOUR(H7)*3600+MINUTE(H7)*60+SECOND(H7))-(HOUR(H6)*3600+MINUTE(H6)*60+SECOND(H6)))","v":0},{"$f":"IFERROR(250/K26*3.6,\"\")","v":""},{"$f":"ABS((HOUR(J7)*3600+MINUTE(J7)*60+SECOND(J7))-(HOUR(J6)*3600+MINUTE(J6)*60+SECOND(J6)))","v":0},{"$f":"IFERROR(250/M26*3.6,\"\")","v":""},{"$f":"ABS((HOUR(L7)*3600+MINUTE(L7)*60+SECOND(L7))-(HOUR(L6)*3600+MINUTE(L6)*60+SECOND(L6)))","v":0},{"$f":"IFERROR(250/O26*3.6,\"\")","v":""},{"$f":"ABS((HOUR(N7)*3600+MINUTE(N7)*60+SECOND(N7))-(HOUR(N6)*3600+MINUTE(N6)*60+SECOND(N6)))","v":0},{"$f":"IFERROR(250/Q26*3.6,\"\")","v":""},{"$f":"ABS((HOUR(P7)*3600+MINUTE(P7)*60+SECOND(P7))-(HOUR(P6)*3600+MINUTE(P6)*60+SECOND(P6)))","v":0},{"$f":"IFERROR(250/S26*3.6,\"\")","v":""},{"$f":"ABS((HOUR(R7)*3600+MINUTE(R7)*60+SECOND(R7))-(HOUR(R6)*3600+MINUTE(R6)*60+SECOND(R6)))","v":0},{"$f":"IFERROR(250/U26*3.6,\"\")","v":""},{"$f":"ABS((HOUR(T7)*3600+MINUTE(T7)*60+SECOND(T7))-(HOUR(T6)*3600+MINUTE(T6)*60+SECOND(T6)))","v":0},{"$f":"IFERROR(250/W26*3.6,\"\")","v":""},{"$f":"ABS((HOUR(V7)*3600+MINUTE(V7)*60+SECOND(V7))-(HOUR(V6)*3600+MINUTE(V6)*60+SECOND(V6)))","v":0},{"$f":"IFERROR(250/Y26*3.6,\"\")","v":""},{"$f":"ABS((HOUR(X7)*3600+MINUTE(X7)*60+SECOND(X7))-(HOUR(X6)*3600+MINUTE(X6)*60+SECOND(X6)))","v":0},{"$f":"IFERROR(250/AA26*3.6,\"\")","v":""},{"$f":"ABS((HOUR(Z7)*3600+MINUTE(Z7)*60+SECOND(Z7))-(HOUR(Z6)*3600+MINUTE(Z6)*60+SECOND(Z6)))","v":0},{"$f":"IFERROR(250/AC26*3.6,\"\")","v":""},{"$f":"ABS((HOUR(AB7)*3600+MINUTE(AB7)*60+SECOND(AB7))-(HOUR(AB6)*3600+MINUTE(AB6)*60+SECOND(AB6)))","v":0},{"$f":"IFERROR(250/AE26*3.6,\"\")","v":""},{"$f":"ABS((HOUR(AD7)*3600+MINUTE(AD7)*60+SECOND(AD7))-(HOUR(AD6)*3600+MINUTE(AD6)*60+SECOND(AD6)))","v":0},{"$f":"IFERROR(250/AG26*3.6,\"\")","v":""},{"$f":"ABS((HOUR(AF7)*3600+MINUTE(AF7)*60+SECOND(AF7))-(HOUR(AF6)*3600+MINUTE(AF6)*60+SECOND(AF6)))","v":0},{"$f":"IFERROR(250/AI26*3.6,\"\")","v":""},{"$f":"ABS((HOUR(AH7)*3600+MINUTE(AH7)*60+SECOND(AH7))-(HOUR(AH6)*3600+MINUTE(AH6)*60+SECOND(AH6)))","v":0},{"$f":"IFERROR(250/AK26*3.6,\"\")","v":""},{"$f":"ABS((HOUR(AJ7)*3600+MINUTE(AJ7)*60+SECOND(AJ7))-(HOUR(AJ6)*3600+MINUTE(AJ6)*60+SECOND(AJ6)))","v":0},{"$f":"IFERROR(250/AM26*3.6,\"\")","v":""},{"$f":"ABS((HOUR(AL7)*3600+MINUTE(AL7)*60+SECOND(AL7))-(HOUR(AL6)*3600+MINUTE(AL6)*60+SECOND(AL6)))","v":0},{"$f":"IFERROR(250/AO26*3.6,\"\")","v":""},{"$f":"ABS((HOUR(AN7)*3600+MINUTE(AN7)*60+SECOND(AN7))-(HOUR(AN6)*3600+MINUTE(AN6)*60+SECOND(AN6)))","v":0},{"$f":"IFERROR(250/AQ26*3.6,\"\")","v":""},{"$f":"ABS((HOUR(AP7)*3600+MINUTE(AP7)*60+SECOND(AP7))-(HOUR(AP6)*3600+MINUTE(AP6)*60+SECOND(AP6)))","v":0},{"$f":"IFERROR(250/AS26*3.6,\"\")","v":""},{"$f":"ABS((HOUR(AR7)*3600+MINUTE(AR7)*60+SECOND(AR7))-(HOUR(AR6)*3600+MINUTE(AR6)*60+SECOND(AR6)))","v":0},{"$f":"IFERROR(250/AU26*3.6,\"\")","v":""},{"$f":"ABS((HOUR(AT7)*3600+MINUTE(AT7)*60+SECOND(AT7))-(HOUR(AT6)*3600+MINUTE(AT6)*60+SECOND(AT6)))","v":0},{"$f":"IFERROR(250/AW26*3.6,\"\")","v":""},null,"Vitesse 250",null,22,{"$f":"OFFSET(INDEX(eleves,MATCH(AZ26,numero,0),MATCH($BA$3,classe,0)),0,1)","v":"Stef"},{"$f":"OFFSET(INDEX(eleves,MATCH(AZ26,numero,0),MATCH($BA$3,classe,0)),0,2)","v":"g"}]
["Vitesse 1er 500",{"$f":"IFERROR(500/C27*3.6,\"\")","v":""},{"$f":"HOUR(B7)*3600+MINUTE(B7)*60+SECOND(B7)","v":"00:00:00"},{"$f":"IFERROR(500/E27*3.6,\"\")","v":""},{"$f":"HOUR(D7)*3600+MINUTE(D7)*60+SECOND(D7)","v":"00:00:00"},{"$f":"IFERROR(500/G27*3.6,\"\")","v":""},{"$f":"HOUR(F7)*3600+MINUTE(F7)*60+SECOND(F7)","v":"00:00:00"},{"$f":"IFERROR(500/I27*3.6,\"\")","v":""},{"$f":"HOUR(H7)*3600+MINUTE(H7)*60+SECOND(H7)","v":"00:00:00"},{"$f":"IFERROR(500/K27*3.6,\"\")","v":""},{"$f":"HOUR(J7)*3600+MINUTE(J7)*60+SECOND(J7)","v":"00:00:00"},{"$f":"IFERROR(500/M27*3.6,\"\")","v":""},{"$f":"HOUR(L7)*3600+MINUTE(L7)*60+SECOND(L7)","v":"00:00:00"},{"$f":"IFERROR(500/O27*3.6,\"\")","v":""},{"$f":"HOUR(N7)*3600+MINUTE(N7)*60+SECOND(N7)","v":"00:00:00"},{"$f":"IFERROR(500/Q27*3.6,\"\")","v":""},{"$f":"HOUR(P7)*3600+MINUTE(P7)*60+SECOND(P7)","v":"00:00:00"},{"$f":"IFERROR(500/S27*3.6,\"\")","v":""},{"$f":"HOUR(R7)*3600+MINUTE(R7)*60+SECOND(R7)","v":"00:00:00"},{"$f":"IFERROR(500/U27*3.6,\"\")","v":""},{"$f":"HOUR(T7)*3600+MINUTE(T7)*60+SECOND(T7)","v":"00:00:00"},{"$f":"IFERROR(500/W27*3.6,\"\")","v":""},{"$f":"HOUR(V7)*3600+MINUTE(V7)*60+SECOND(V7)","v":"00:00:00"},{"$f":"IFERROR(500/Y27*3.6,\"\")","v":""},{"$f":"HOUR(X7)*3600+MINUTE(X7)*60+SECOND(X7)","v":"00:00:00"},{"$f":"IFERROR(500/AA27*3.6,\"\")","v":""},{"$f":"HOUR(Z7)*3600+MINUTE(Z7)*60+SECOND(Z7)","v":"00:00:00"},{"$f":"IFERROR(500/AC27*3.6,\"\")","v":""},{"$f":"HOUR(AB7)*3600+MINUTE(AB7)*60+SECOND(AB7)","v":"00:00:00"},{"$f":"IFERROR(500/AE27*3.6,\"\")","v":""},{"$f":"HOUR(AD7)*3600+MINUTE(AD7)*60+SECOND(AD7)","v":"00:00:00"},{"$f":"IFERROR(500/AG27*3.6,\"\")","v":""},{"$f":"HOUR(AF7)*3600+MINUTE(AF7)*60+SECOND(AF7)","v":"00:00:00"},{"$f":"IFERROR(500/AI27*3.6,\"\")","v":""},{"$f":"HOUR(AH7)*3600+MINUTE(AH7)*60+SECOND(AH7)","v":"00:00:00"},{"$f":"IFERROR(500/AK27*3.6,\"\")","v":""},{"$f":"HOUR(AJ7)*3600+MINUTE(AJ7)*60+SECOND(AJ7)","v":"00:00:00"},{"$f":"IFERROR(500/AM27*3.6,\"\")","v":""},{"$f":"HOUR(AL7)*3600+MINUTE(AL7)*60+SECOND(AL7)","v":"00:00:00"},{"$f":"IFERROR(500/AO27*3.6,\"\")","v":""},{"$f":"HOUR(AN7)*3600+MINUTE(AN7)*60+SECOND(AN7)","v":"00:00:00"},{"$f":"IFERROR(500/AQ27*3.6,\"\")","v":""},{"$f":"HOUR(AP7)*3600+MINUTE(AP7)*60+SECOND(AP7)","v":"00:00:00"},{"$f":"IFERROR(500/AS27*3.6,\"\")","v":""},{"$f":"HOUR(AR7)*3600+MINUTE(AR7)*60+SECOND(AR7)","v":"00:00:00"},{"$f":"IFERROR(500/AU27*3.6,\"\")","v":""},{"$f":"HOUR(AT7)*3600+MINUTE(AT7)*60+SECOND(AT7)","v":"00:00:00"},{"$f":"IFERROR(500/AW27*3.6,\"\")","v":""},null,"Vitesse 1er 500",null,23,{"$f":"OFFSET(INDEX(eleves,MATCH(AZ27,numero,0),MATCH($BA$3,classe,0)),0,1)","v":"Thomas"},{"$f":"OFFSET(INDEX(eleves,MATCH(AZ27,numero,0),MATCH($BA$3,classe,0)),0,2)","v":"g"}]
["Vitesse 250",{"$f":"IFERROR(250/C28*3.6,\"\")","v":""},{"$f":"HOUR(B8)*3600+MINUTE(B8)*60+SECOND(B8)","v":"00:00:00"},{"$f":"IFERROR(250/E28*3.6,\"\")","v":""},{"$f":"HOUR(D8)*3600+MINUTE(D8)*60+SECOND(D8)","v":"00:00:00"},{"$f":"IFERROR(250/G28*3.6,\"\")","v":""},{"$f":"HOUR(F8)*3600+MINUTE(F8)*60+SECOND(F8)","v":"00:00:00"},{"$f":"IFERROR(250/I28*3.6,\"\")","v":""},{"$f":"HOUR(H8)*3600+MINUTE(H8)*60+SECOND(H8)","v":"00:00:00"},{"$f":"IFERROR(250/K28*3.6,\"\")","v":""},{"$f":"HOUR(J8)*3600+MINUTE(J8)*60+SECOND(J8)","v":"00:00:00"},{"$f":"IFERROR(250/M28*3.6,\"\")","v":""},{"$f":"HOUR(L8)*3600+MINUTE(L8)*60+SECOND(L8)","v":"00:00:00"},{"$f":"IFERROR(250/O28*3.6,\"\")","v":""},{"$f":"HOUR(N8)*3600+MINUTE(N8)*60+SECOND(N8)","v":"00:00:00"},{"$f":"IFERROR(250/Q28*3.6,\"\")","v":""},{"$f":"HOUR(P8)*3600+MINUTE(P8)*60+SECOND(P8)","v":"00:00:00"},{"$f":"IFERROR(250/S28*3.6,\"\")","v":""},{"$f":"HOUR(R8)*3600+MINUTE(R8)*60+SECOND(R8)","v":"00:00:00"},{"$f":"IFERROR(250/U28*3.6,\"\")","v":""},{"$f":"HOUR(T8)*3600+MINUTE(T8)*60+SECOND(T8)","v":"00:00:00"},{"$f":"IFERROR(250/W28*3.6,\"\")","v":""},{"$f":"HOUR(V8)*3600+MINUTE(V8)*60+SECOND(V8)","v":"00:00:00"},{"$f":"IFERROR(250/Y28*3.6,\"\")","v":""},{"$f":"HOUR(X8)*3600+MINUTE(X8)*60+SECOND(X8)","v":"00:00:00"},{"$f":"IFERROR(250/AA28*3.6,\"\")","v":""},{"$f":"HOUR(Z8)*3600+MINUTE(Z8)*60+SECOND(Z8)","v":"00:00:00"},{"$f":"IFERROR(250/AC28*3.6,\"\")","v":""},{"$f":"HOUR(AB8)*3600+MINUTE(AB8)*60+SECOND(AB8)","v":"00:00:00"},{"$f":"IFERROR(250/AE28*3.6,\"\")","v":""},{"$f":"HOUR(AD8)*3600+MINUTE(AD8)*60+SECOND(AD8)","v":"00:00:00"},{"$f":"IFERROR(250/AG28*3.6,\"\")","v":""},{"$f":"HOUR(AF8)*3600+MINUTE(AF8)*60+SECOND(AF8)","v":"00:00:00"},{"$f":"IFERROR(250/AI28*3.6,\"\")","v":""},{"$f":"HOUR(AH8)*3600+MINUTE(AH8)*60+SECOND(AH8)","v":"00:00:00"},{"$f":"IFERROR(250/AK28*3.6,\"\")","v":""},{"$f":"HOUR(AJ8)*3600+MINUTE(AJ8)*60+SECOND(AJ8)","v":"00:00:00"},{"$f":"IFERROR(250/AM28*3.6,\"\")","v":""},{"$f":"HOUR(AL8)*3600+MINUTE(AL8)*60+SECOND(AL8)","v":"00:00:00"},{"$f":"IFERROR(250/AO28*3.6,\"\")","v":""},{"$f":"HOUR(AN8)*3600+MINUTE(AN8)*60+SECOND(AN8)","v":"00:00:00"},{"$f":"IFERROR(250/AQ28*3.6,\"\")","v":""},{"$f":"HOUR(AP8)*3600+MINUTE(AP8)*60+SECOND(AP8)","v":"00:00:00"},{"$f":"IFERROR(250/AS28*3.6,\"\")","v":""},{"$f":"HOUR(AR8)*3600+MINUTE(AR8)*60+SECOND(AR8)","v":"00:00:00"},{"$f":"IFERROR(250/AU28*3.6,\"\")","v":""},{"$f":"HOUR(AT8)*3600+MINUTE(AT8)*60+SECOND(AT8)","v":"00:00:00"},{"$f":"IFERROR(250/AW28*3.6,\"\")","v":""},null,"Vitesse 250",null,24,{"$f":"OFFSET(INDEX(eleves,MATCH(AZ28,numero,0),MATCH($BA$3,classe,0)),0,1)","v":"Tristan"},{"$f":"OFFSET(INDEX(eleves,MATCH(AZ28,numero,0),MATCH($BA$3,classe,0)),0,2)","v":"g"}]
["Vitesse 250",{"$f":"IFERROR(250/C29*3.6,\"\")","v":""},{"$f":"ABS((HOUR(B9)*3600+MINUTE(B9)*60+SECOND(B9))-(HOUR(B8)*3600+MINUTE(B8)*60+SECOND(B8)))","v":0},{"$f":"IFERROR(250/E29*3.6,\"\")","v":""},{"$f":"ABS((HOUR(D9)*3600+MINUTE(D9)*60+SECOND(D9))-(HOUR(D8)*3600+MINUTE(D8)*60+SECOND(D8)))","v":0},{"$f":"IFERROR(250/G29*3.6,\"\")","v":""},{"$f":"ABS((HOUR(F9)*3600+MINUTE(F9)*60+SECOND(F9))-(HOUR(F8)*3600+MINUTE(F8)*60+SECOND(F8)))","v":0},{"$f":"IFERROR(250/I29*3.6,\"\")","v":""},{"$f":"ABS((HOUR(H9)*3600+MINUTE(H9)*60+SECOND(H9))-(HOUR(H8)*3600+MINUTE(H8)*60+SECOND(H8)))","v":0},{"$f":"IFERROR(250/K29*3.6,\"\")","v":""},{"$f":"ABS((HOUR(J9)*3600+MINUTE(J9)*60+SECOND(J9))-(HOUR(J8)*3600+MINUTE(J8)*60+SECOND(J8)))","v":0},{"$f":"IFERROR(250/M29*3.6,\"\")","v":""},{"$f":"ABS((HOUR(L9)*3600+MINUTE(L9)*60+SECOND(L9))-(HOUR(L8)*3600+MINUTE(L8)*60+SECOND(L8)))","v":0},{"$f":"IFERROR(250/O29*3.6,\"\")","v":""},{"$f":"ABS((HOUR(N9)*3600+MINUTE(N9)*60+SECOND(N9))-(HOUR(N8)*3600+MINUTE(N8)*60+SECOND(N8)))","v":0},{"$f":"IFERROR(250/Q29*3.6,\"\")","v":""},{"$f":"ABS((HOUR(P9)*3600+MINUTE(P9)*60+SECOND(P9))-(HOUR(P8)*3600+MINUTE(P8)*60+SECOND(P8)))","v":0},{"$f":"IFERROR(250/S29*3.6,\"\")","v":""},{"$f":"ABS((HOUR(R9)*3600+MINUTE(R9)*60+SECOND(R9))-(HOUR(R8)*3600+MINUTE(R8)*60+SECOND(R8)))","v":0},{"$f":"IFERROR(250/U29*3.6,\"\")","v":""},{"$f":"ABS((HOUR(T9)*3600+MINUTE(T9)*60+SECOND(T9))-(HOUR(T8)*3600+MINUTE(T8)*60+SECOND(T8)))","v":0},{"$f":"IFERROR(250/W29*3.6,\"\")","v":""},{"$f":"ABS((HOUR(V9)*3600+MINUTE(V9)*60+SECOND(V9))-(HOUR(V8)*3600+MINUTE(V8)*60+SECOND(V8)))","v":0},{"$f":"IFERROR(250/Y29*3.6,\"\")","v":""},{"$f":"ABS((HOUR(X9)*3600+MINUTE(X9)*60+SECOND(X9))-(HOUR(X8)*3600+MINUTE(X8)*60+SECOND(X8)))","v":0},{"$f":"IFERROR(250/AA29*3.6,\"\")","v":""},{"$f":"ABS((HOUR(Z9)*3600+MINUTE(Z9)*60+SECOND(Z9))-(HOUR(Z8)*3600+MINUTE(Z8)*60+SECOND(Z8)))","v":0},{"$f":"IFERROR(250/AC29*3.6,\"\")","v":""},{"$f":"ABS((HOUR(AB9)*3600+MINUTE(AB9)*60+SECOND(AB9))-(HOUR(AB8)*3600+MINUTE(AB8)*60+SECOND(AB8)))","v":0},{"$f":"IFERROR(250/AE29*3.6,\"\")","v":""},{"$f":"ABS((HOUR(AD9)*3600+MINUTE(AD9)*60+SECOND(AD9))-(HOUR(AD8)*3600+MINUTE(AD8)*60+SECOND(AD8)))","v":0},{"$f":"IFERROR(250/AG29*3.6,\"\")","v":""},{"$f":"ABS((HOUR(AF9)*3600+MINUTE(AF9)*60+SECOND(AF9))-(HOUR(AF8)*3600+MINUTE(AF8)*60+SECOND(AF8)))","v":0},{"$f":"IFERROR(250/AI29*3.6,\"\")","v":""},{"$f":"ABS((HOUR(AH9)*3600+MINUTE(AH9)*60+SECOND(AH9))-(HOUR(AH8)*3600+MINUTE(AH8)*60+SECOND(AH8)))","v":0},{"$f":"IFERROR(250/AK29*3.6,\"\")","v":""},{"$f":"ABS((HOUR(AJ9)*3600+MINUTE(AJ9)*60+SECOND(AJ9))-(HOUR(AJ8)*3600+MINUTE(AJ8)*60+SECOND(AJ8)))","v":0},{"$f":"IFERROR(250/AM29*3.6,\"\")","v":""},{"$f":"ABS((HOUR(AL9)*3600+MINUTE(AL9)*60+SECOND(AL9))-(HOUR(AL8)*3600+MINUTE(AL8)*60+SECOND(AL8)))","v":0},{"$f":"IFERROR(250/AO29*3.6,\"\")","v":""},{"$f":"ABS((HOUR(AN9)*3600+MINUTE(AN9)*60+SECOND(AN9))-(HOUR(AN8)*3600+MINUTE(AN8)*60+SECOND(AN8)))","v":0},{"$f":"IFERROR(250/AQ29*3.6,\"\")","v":""},{"$f":"ABS((HOUR(AP9)*3600+MINUTE(AP9)*60+SECOND(AP9))-(HOUR(AP8)*3600+MINUTE(AP8)*60+SECOND(AP8)))","v":0},{"$f":"IFERROR(250/AS29*3.6,\"\")","v":""},{"$f":"ABS((HOUR(AR9)*3600+MINUTE(AR9)*60+SECOND(AR9))-(HOUR(AR8)*3600+MINUTE(AR8)*60+SECOND(AR8)))","v":0},{"$f":"IFERROR(250/AU29*3.6,\"\")","v":""},{"$f":"ABS((HOUR(AT9)*3600+MINUTE(AT9)*60+SECOND(AT9))-(HOUR(AT8)*3600+MINUTE(AT8)*60+SECOND(AT8)))","v":0},{"$f":"IFERROR(250/AW29*3.6,\"\")","v":""},null,"Vitesse 250"]
["Vitesse \n2è 500",{"$f":"IFERROR(500/C30*3.6,\"\")","v":""},{"$f":"HOUR(B9)*3600+MINUTE(B9)*60+SECOND(B9)","v":"00:00:00"},{"$f":"IFERROR(500/E30*3.6,\"\")","v":""},{"$f":"HOUR(D9)*3600+MINUTE(D9)*60+SECOND(D9)","v":"00:00:00"},{"$f":"IFERROR(500/G30*3.6,\"\")","v":""},{"$f":"HOUR(F9)*3600+MINUTE(F9)*60+SECOND(F9)","v":"00:00:00"},{"$f":"IFERROR(500/I30*3.6,\"\")","v":""},{"$f":"HOUR(H9)*3600+MINUTE(H9)*60+SECOND(H9)","v":"00:00:00"},{"$f":"IFERROR(500/K30*3.6,\"\")","v":""},{"$f":"HOUR(J9)*3600+MINUTE(J9)*60+SECOND(J9)","v":"00:00:00"},{"$f":"IFERROR(500/M30*3.6,\"\")","v":""},{"$f":"HOUR(L9)*3600+MINUTE(L9)*60+SECOND(L9)","v":"00:00:00"},{"$f":"IFERROR(500/O30*3.6,\"\")","v":""},{"$f":"HOUR(N9)*3600+MINUTE(N9)*60+SECOND(N9)","v":"00:00:00"},{"$f":"IFERROR(500/Q30*3.6,\"\")","v":""},{"$f":"HOUR(P9)*3600+MINUTE(P9)*60+SECOND(P9)","v":"00:00:00"},{"$f":"IFERROR(500/S30*3.6,\"\")","v":""},{"$f":"HOUR(R9)*3600+MINUTE(R9)*60+SECOND(R9)","v":"00:00:00"},{"$f":"IFERROR(500/U30*3.6,\"\")","v":""},{"$f":"HOUR(T9)*3600+MINUTE(T9)*60+SECOND(T9)","v":"00:00:00"},{"$f":"IFERROR(500/W30*3.6,\"\")","v":""},{"$f":"HOUR(V9)*3600+MINUTE(V9)*60+SECOND(V9)","v":"00:00:00"},{"$f":"IFERROR(500/Y30*3.6,\"\")","v":""},{"$f":"HOUR(X9)*3600+MINUTE(X9)*60+SECOND(X9)","v":"00:00:00"},{"$f":"IFERROR(500/AA30*3.6,\"\")","v":""},{"$f":"HOUR(Z9)*3600+MINUTE(Z9)*60+SECOND(Z9)","v":"00:00:00"},{"$f":"IFERROR(500/AC30*3.6,\"\")","v":""},{"$f":"HOUR(AB9)*3600+MINUTE(AB9)*60+SECOND(AB9)","v":"00:00:00"},{"$f":"IFERROR(500/AE30*3.6,\"\")","v":""},{"$f":"HOUR(AD9)*3600+MINUTE(AD9)*60+SECOND(AD9)","v":"00:00:00"},{"$f":"IFERROR(500/AG30*3.6,\"\")","v":""},{"$f":"HOUR(AF9)*3600+MINUTE(AF9)*60+SECOND(AF9)","v":"00:00:00"},{"$f":"IFERROR(500/AI30*3.6,\"\")","v":""},{"$f":"HOUR(AH9)*3600+MINUTE(AH9)*60+SECOND(AH9)","v":"00:00:00"},{"$f":"IFERROR(500/AK30*3.6,\"\")","v":""},{"$f":"HOUR(AJ9)*3600+MINUTE(AJ9)*60+SECOND(AJ9)","v":"00:00:00"},{"$f":"IFERROR(500/AM30*3.6,\"\")","v":""},{"$f":"HOUR(AL9)*3600+MINUTE(AL9)*60+SECOND(AL9)","v":"00:00:00"},{"$f":"IFERROR(500/AO30*3.6,\"\")","v":""},{"$f":"HOUR(AN9)*3600+MINUTE(AN9)*60+SECOND(AN9)","v":"00:00:00"},{"$f":"IFERROR(500/AQ30*3.6,\"\")","v":""},{"$f":"HOUR(AP9)*3600+MINUTE(AP9)*60+SECOND(AP9)","v":"00:00:00"},{"$f":"IFERROR(500/AS30*3.6,\"\")","v":""},{"$f":"HOUR(AR9)*3600+MINUTE(AR9)*60+SECOND(AR9)","v":"00:00:00"},{"$f":"IFERROR(500/AU30*3.6,\"\")","v":""},{"$f":"HOUR(AT9)*3600+MINUTE(AT9)*60+SECOND(AT9)","v":"00:00:00"},{"$f":"IFERROR(500/AW30*3.6,\"\")","v":""},null,"Vitesse \n2è 500"]
["Vitesse 250",{"$f":"IFERROR(250/C31*3.6,\"\")","v":""},{"$f":"HOUR(B10)*3600+MINUTE(B10)*60+SECOND(B10)","v":"00:00:00"},{"$f":"IFERROR(250/E31*3.6,\"\")","v":""},{"$f":"HOUR(D10)*3600+MINUTE(D10)*60+SECOND(D10)","v":"00:00:00"},{"$f":"IFERROR(250/G31*3.6,\"\")","v":""},{"$f":"HOUR(F10)*3600+MINUTE(F10)*60+SECOND(F10)","v":"00:00:00"},{"$f":"IFERROR(250/I31*3.6,\"\")","v":""},{"$f":"HOUR(H10)*3600+MINUTE(H10)*60+SECOND(H10)","v":"00:00:00"},{"$f":"IFERROR(250/K31*3.6,\"\")","v":""},{"$f":"HOUR(J10)*3600+MINUTE(J10)*60+SECOND(J10)","v":"00:00:00"},{"$f":"IFERROR(250/M31*3.6,\"\")","v":""},{"$f":"HOUR(L10)*3600+MINUTE(L10)*60+SECOND(L10)","v":"00:00:00"},{"$f":"IFERROR(250/O31*3.6,\"\")","v":""},{"$f":"HOUR(N10)*3600+MINUTE(N10)*60+SECOND(N10)","v":"00:00:00"},{"$f":"IFERROR(250/Q31*3.6,\"\")","v":""},{"$f":"HOUR(P10)*3600+MINUTE(P10)*60+SECOND(P10)","v":"00:00:00"},{"$f":"IFERROR(250/S31*3.6,\"\")","v":""},{"$f":"HOUR(R10)*3600+MINUTE(R10)*60+SECOND(R10)","v":"00:00:00"},{"$f":"IFERROR(250/U31*3.6,\"\")","v":""},{"$f":"HOUR(T10)*3600+MINUTE(T10)*60+SECOND(T10)","v":"00:00:00"},{"$f":"IFERROR(250/W31*3.6,\"\")","v":""},{"$f":"HOUR(V10)*3600+MINUTE(V10)*60+SECOND(V10)","v":"00:00:00"},{"$f":"IFERROR(250/Y31*3.6,\"\")","v":""},{"$f":"HOUR(X10)*3600+MINUTE(X10)*60+SECOND(X10)","v":"00:00:00"},{"$f":"IFERROR(250/AA31*3.6,\"\")","v":""},{"$f":"HOUR(Z10)*3600+MINUTE(Z10)*60+SECOND(Z10)","v":"00:00:00"},{"$f":"IFERROR(250/AC31*3.6,\"\")","v":""},{"$f":"HOUR(AB10)*3600+MINUTE(AB10)*60+SECOND(AB10)","v":"00:00:00"},{"$f":"IFERROR(250/AE31*3.6,\"\")","v":""},{"$f":"HOUR(AD10)*3600+MINUTE(AD10)*60+SECOND(AD10)","v":"00:00:00"},{"$f":"IFERROR(250/AG31*3.6,\"\")","v":""},{"$f":"HOUR(AF10)*3600+MINUTE(AF10)*60+SECOND(AF10)","v":"00:00:00"},{"$f":"IFERROR(250/AI31*3.6,\"\")","v":""},{"$f":"HOUR(AH10)*3600+MINUTE(AH10)*60+SECOND(AH10)","v":"00:00:00"},{"$f":"IFERROR(250/AK31*3.6,\"\")","v":""},{"$f":"HOUR(AJ10)*3600+MINUTE(AJ10)*60+SECOND(AJ10)","v":"00:00:00"},{"$f":"IFERROR(250/AM31*3.6,\"\")","v":""},{"$f":"HOUR(AL10)*3600+MINUTE(AL10)*60+SECOND(AL10)","v":"00:00:00"},{"$f":"IFERROR(250/AO31*3.6,\"\")","v":""},{"$f":"HOUR(AN10)*3600+MINUTE(AN10)*60+SECOND(AN10)","v":"00:00:00"},{"$f":"IFERROR(250/AQ31*3.6,\"\")","v":""},{"$f":"HOUR(AP10)*3600+MINUTE(AP10)*60+SECOND(AP10)","v":"00:00:00"},{"$f":"IFERROR(250/AS31*3.6,\"\")","v":""},{"$f":"HOUR(AR10)*3600+MINUTE(AR10)*60+SECOND(AR10)","v":"00:00:00"},{"$f":"IFERROR(250/AU31*3.6,\"\")","v":""},{"$f":"HOUR(AT10)*3600+MINUTE(AT10)*60+SECOND(AT10)","v":"00:00:00"},{"$f":"IFERROR(250/AW31*3.6,\"\")","v":""},null,"Vitesse 250"]
["Vitesse 250",{"$f":"IFERROR(250/C32*3.6,\"\")","v":""},{"$f":"ABS((HOUR(B11)*3600+MINUTE(B11)*60+SECOND(B11))-(HOUR(B10)*3600+MINUTE(B10)*60+SECOND(B10)))","v":0},{"$f":"IFERROR(250/E32*3.6,\"\")","v":""},{"$f":"ABS((HOUR(D11)*3600+MINUTE(D11)*60+SECOND(D11))-(HOUR(D10)*3600+MINUTE(D10)*60+SECOND(D10)))","v":0},{"$f":"IFERROR(250/G32*3.6,\"\")","v":""},{"$f":"ABS((HOUR(F11)*3600+MINUTE(F11)*60+SECOND(F11))-(HOUR(F10)*3600+MINUTE(F10)*60+SECOND(F10)))","v":0},{"$f":"IFERROR(250/I32*3.6,\"\")","v":""},{"$f":"ABS((HOUR(H11)*3600+MINUTE(H11)*60+SECOND(H11))-(HOUR(H10)*3600+MINUTE(H10)*60+SECOND(H10)))","v":0},{"$f":"IFERROR(250/K32*3.6,\"\")","v":""},{"$f":"ABS((HOUR(J11)*3600+MINUTE(J11)*60+SECOND(J11))-(HOUR(J10)*3600+MINUTE(J10)*60+SECOND(J10)))","v":0},{"$f":"IFERROR(250/M32*3.6,\"\")","v":""},{"$f":"ABS((HOUR(L11)*3600+MINUTE(L11)*60+SECOND(L11))-(HOUR(L10)*3600+MINUTE(L10)*60+SECOND(L10)))","v":0},{"$f":"IFERROR(250/O32*3.6,\"\")","v":""},{"$f":"ABS((HOUR(N11)*3600+MINUTE(N11)*60+SECOND(N11))-(HOUR(N10)*3600+MINUTE(N10)*60+SECOND(N10)))","v":0},{"$f":"IFERROR(250/Q32*3.6,\"\")","v":""},{"$f":"ABS((HOUR(P11)*3600+MINUTE(P11)*60+SECOND(P11))-(HOUR(P10)*3600+MINUTE(P10)*60+SECOND(P10)))","v":0},{"$f":"IFERROR(250/S32*3.6,\"\")","v":""},{"$f":"ABS((HOUR(R11)*3600+MINUTE(R11)*60+SECOND(R11))-(HOUR(R10)*3600+MINUTE(R10)*60+SECOND(R10)))","v":0},{"$f":"IFERROR(250/U32*3.6,\"\")","v":""},{"$f":"ABS((HOUR(T11)*3600+MINUTE(T11)*60+SECOND(T11))-(HOUR(T10)*3600+MINUTE(T10)*60+SECOND(T10)))","v":0},{"$f":"IFERROR(250/W32*3.6,\"\")","v":""},{"$f":"ABS((HOUR(V11)*3600+MINUTE(V11)*60+SECOND(V11))-(HOUR(V10)*3600+MINUTE(V10)*60+SECOND(V10)))","v":0},{"$f":"IFERROR(250/Y32*3.6,\"\")","v":""},{"$f":"ABS((HOUR(X11)*3600+MINUTE(X11)*60+SECOND(X11))-(HOUR(X10)*3600+MINUTE(X10)*60+SECOND(X10)))","v":0},{"$f":"IFERROR(250/AA32*3.6,\"\")","v":""},{"$f":"ABS((HOUR(Z11)*3600+MINUTE(Z11)*60+SECOND(Z11))-(HOUR(Z10)*3600+MINUTE(Z10)*60+SECOND(Z10)))","v":0},{"$f":"IFERROR(250/AC32*3.6,\"\")","v":""},{"$f":"ABS((HOUR(AB11)*3600+MINUTE(AB11)*60+SECOND(AB11))-(HOUR(AB10)*3600+MINUTE(AB10)*60+SECOND(AB10)))","v":0},{"$f":"IFERROR(250/AE32*3.6,\"\")","v":""},{"$f":"ABS((HOUR(AD11)*3600+MINUTE(AD11)*60+SECOND(AD11))-(HOUR(AD10)*3600+MINUTE(AD10)*60+SECOND(AD10)))","v":0},{"$f":"IFERROR(250/AG32*3.6,\"\")","v":""},{"$f":"ABS((HOUR(AF11)*3600+MINUTE(AF11)*60+SECOND(AF11))-(HOUR(AF10)*3600+MINUTE(AF10)*60+SECOND(AF10)))","v":0},{"$f":"IFERROR(250/AI32*3.6,\"\")","v":""},{"$f":"ABS((HOUR(AH11)*3600+MINUTE(AH11)*60+SECOND(AH11))-(HOUR(AH10)*3600+MINUTE(AH10)*60+SECOND(AH10)))","v":0},{"$f":"IFERROR(250/AK32*3.6,\"\")","v":""},{"$f":"ABS((HOUR(AJ11)*3600+MINUTE(AJ11)*60+SECOND(AJ11))-(HOUR(AJ10)*3600+MINUTE(AJ10)*60+SECOND(AJ10)))","v":0},{"$f":"IFERROR(250/AM32*3.6,\"\")","v":""},{"$f":"ABS((HOUR(AL11)*3600+MINUTE(AL11)*60+SECOND(AL11))-(HOUR(AL10)*3600+MINUTE(AL10)*60+SECOND(AL10)))","v":0},{"$f":"IFERROR(250/AO32*3.6,\"\")","v":""},{"$f":"ABS((HOUR(AN11)*3600+MINUTE(AN11)*60+SECOND(AN11))-(HOUR(AN10)*3600+MINUTE(AN10)*60+SECOND(AN10)))","v":0},{"$f":"IFERROR(250/AQ32*3.6,\"\")","v":""},{"$f":"ABS((HOUR(AP11)*3600+MINUTE(AP11)*60+SECOND(AP11))-(HOUR(AP10)*3600+MINUTE(AP10)*60+SECOND(AP10)))","v":0},{"$f":"IFERROR(250/AS32*3.6,\"\")","v":""},{"$f":"ABS((HOUR(AR11)*3600+MINUTE(AR11)*60+SECOND(AR11))-(HOUR(AR10)*3600+MINUTE(AR10)*60+SECOND(AR10)))","v":0},{"$f":"IFERROR(250/AU32*3.6,\"\")","v":""},{"$f":"ABS((HOUR(AT11)*3600+MINUTE(AT11)*60+SECOND(AT11))-(HOUR(AT10)*3600+MINUTE(AT10)*60+SECOND(AT10)))","v":0},{"$f":"IFERROR(250/AW32*3.6,\"\")","v":""},null,"Vitesse 250"]
["Vitesse \n3è 500",{"$f":"IFERROR(500/C33*3.6,\"\")","v":""},{"$f":"HOUR(B11)*3600+MINUTE(B11)*60+SECOND(B11)","v":"00:00:00"},{"$f":"IFERROR(500/E33*3.6,\"\")","v":""},{"$f":"HOUR(D11)*3600+MINUTE(D11)*60+SECOND(D11)","v":"00:00:00"},{"$f":"IFERROR(500/G33*3.6,\"\")","v":""},{"$f":"HOUR(F11)*3600+MINUTE(F11)*60+SECOND(F11)","v":"00:00:00"},{"$f":"IFERROR(500/I33*3.6,\"\")","v":""},{"$f":"HOUR(H11)*3600+MINUTE(H11)*60+SECOND(H11)","v":"00:00:00"},{"$f":"IFERROR(500/K33*3.6,\"\")","v":""},{"$f":"HOUR(J11)*3600+MINUTE(J11)*60+SECOND(J11)","v":"00:00:00"},{"$f":"IFERROR(500/M33*3.6,\"\")","v":""},{"$f":"HOUR(L11)*3600+MINUTE(L11)*60+SECOND(L11)","v":"00:00:00"},{"$f":"IFERROR(500/O33*3.6,\"\")","v":""},{"$f":"HOUR(N11)*3600+MINUTE(N11)*60+SECOND(N11)","v":"00:00:00"},{"$f":"IFERROR(500/Q33*3.6,\"\")","v":""},{"$f":"HOUR(P11)*3600+MINUTE(P11)*60+SECOND(P11)","v":"00:00:00"},{"$f":"IFERROR(500/S33*3.6,\"\")","v":""},{"$f":"HOUR(R11)*3600+MINUTE(R11)*60+SECOND(R11)","v":"00:00:00"},{"$f":"IFERROR(500/U33*3.6,\"\")","v":""},{"$f":"HOUR(T11)*3600+MINUTE(T11)*60+SECOND(T11)","v":"00:00:00"},{"$f":"IFERROR(500/W33*3.6,\"\")","v":""},{"$f":"HOUR(V11)*3600+MINUTE(V11)*60+SECOND(V11)","v":"00:00:00"},{"$f":"IFERROR(500/Y33*3.6,\"\")","v":""},{"$f":"HOUR(X11)*3600+MINUTE(X11)*60+SECOND(X11)","v":"00:00:00"},{"$f":"IFERROR(500/AA33*3.6,\"\")","v":""},{"$f":"HOUR(Z11)*3600+MINUTE(Z11)*60+SECOND(Z11)","v":"00:00:00"},{"$f":"IFERROR(500/AC33*3.6,\"\")","v":""},{"$f":"HOUR(AB11)*3600+MINUTE(AB11)*60+SECOND(AB11)","v":"00:00:00"},{"$f":"IFERROR(500/AE33*3.6,\"\")","v":""},{"$f":"HOUR(AD11)*3600+MINUTE(AD11)*60+SECOND(AD11)","v":"00:00:00"},{"$f":"IFERROR(500/AG33*3.6,\"\")","v":""},{"$f":"HOUR(AF11)*3600+MINUTE(AF11)*60+SECOND(AF11)","v":"00:00:00"},{"$f":"IFERROR(500/AI33*3.6,\"\")","v":""},{"$f":"HOUR(AH11)*3600+MINUTE(AH11)*60+SECOND(AH11)","v":"00:00:00"},{"$f":"IFERROR(500/AK33*3.6,\"\")","v":""},{"$f":"HOUR(AJ11)*3600+MINUTE(AJ11)*60+SECOND(AJ11)","v":"00:00:00"},{"$f":"IFERROR(500/AM33*3.6,\"\")","v":""},{"$f":"HOUR(AL11)*3600+MINUTE(AL11)*60+SECOND(AL11)","v":"00:00:00"},{"$f":"IFERROR(500/AO33*3.6,\"\")","v":""},{"$f":"HOUR(AN11)*3600+MINUTE(AN11)*60+SECOND(AN11)","v":"00:00:00"},{"$f":"IFERROR(500/AQ33*3.6,\"\")","v":""},{"$f":"HOUR(AP11)*3600+MINUTE(AP11)*60+SECOND(AP11)","v":"00:00:00"},{"$f":"IFERROR(500/AS33*3.6,\"\")","v":""},{"$f":"HOUR(AR11)*3600+MINUTE(AR11)*60+SECOND(AR11)","v":"00:00:00"},{"$f":"IFERROR(500/AU33*3.6,\"\")","v":""},{"$f":"HOUR(AT11)*3600+MINUTE(AT11)*60+SECOND(AT11)","v":"00:00:00"},{"$f":"IFERROR(500/AW33*3.6,\"\")","v":""},null,"Vitesse \n3è 500"]
[]
[]
[null,"Alexandre"]

{"sheet":"REFERENTIELS","index":2,"n_rows":18,"n_cols":16,"rows_kept":18,"cut":false,"hidden":false,"merged":[[3,2,3,3],[3,4,3,15],[4,2,4,3],[4,4,4,15],[5,4,5,7],[5,8,5,15],[17,4,17,7],[17,8,17,11],[17,12,17,15],[6,2,15,2],[6,3,15,3],[12,12,15,15],[13,8,15,11],[16,4,16,7],[16,8,16,11],[16,12,16,15]]}
[]
[]
[null,null,"DEMI-FOND N3 CAP-BEP"]
[null,null,"COMPÉTENCES  ATTENDUES",null,"PRINCIPES D’ÉLABORATION DE L’ÉPREUVE"]
[null,null,"NIVEAU 3\nProduire la meilleure performance sur une série de courses, se préparer et répartir son effort grâce à une gestion raisonnée de ses ressources.",null,"En  demi-fond,  chaque  élève  réalise  3  courses  de  500m  (récupération  de10mn  maximum)  chronométrées  par  un enseignant  à  la  seconde.  Les  élèves  courent  sans  montre  ni  chronomètre  mais  un  temps  de  passage  leur  est communiqué aux 250m\nLe temps cumulé compte pour 75 % de la note.\nL’échauffement, la récupération et la gestion de l’effort  comptent pour 25%."]
[null,null,"POINTS À AFFECTER","ÉLÉMENTS À ÉVALUER","COMPETENCE DE NIVEAU 3 EN COURS D’ACQUISITION\nde 00 à 09 pts",null,null,null,"COMPETENCE DE NIVEAU 3 ACQUISE\nde 10 à 20 pts"]
[null,null,"15 Points","Temps cumulé pour les trois 500 m réalisés\n(barème différencié garçons - filles)\nExemple : une fille réalise  7mn01 Sa note est 9.75 / 15 (ou 13 / 20)","Note\n/ 20","Note\n/ 15","Temps Filles","Temps Garçons","Note\n/20","Note\n/15","Temps Filles","Temps Garçons","Note\n/20","Note\n/15","Temps Filles","Temps Garçons"]
[null,null,null,null,1,0.75,12,8.5,10,7.5,7.56,6,16,12,6.26,5.03]
[null,null,null,null,2,1.5,11.25,8.1999999999999993,11,8.25,7.38,5.49,17,12.75,6.21,4.58]
[null,null,null,null,3,2.25,10.5,7.5,12,9,7.2,5.38,18,13.5,6.16,4.53]
[null,null,null,null,4,3,10.199999999999999,7.2,13,9.75,7.03,5.27,19,14.25,6.11,4.4800000000000004]
[null,null,null,null,5,3.75,9.5,6.5,14,10.5,6.47,5.17,20,15,6.06,4.45]
[null,null,null,null,6,4.5,9.24,6.4,15,11.25,6.31,5.08]
[null,null,null,null,7,5.25,8.59,6.3]
[null,null,null,null,8,6,8.3699999999999992,6.2]
[null,null,null,null,9,6.75,8.15,6.1]
[null,null,"03 Points","Répartition de l’effort\nDifférence des deux temps extrêmes réalisés Exemple un élève réalise 2.18 - 2.21 – 2.23 : Les deux temps extrêmes sont compris dans une fourchette de 5’’ (2.18 et 2.23) = 2pt","La  fourchette des deux temps extrêmes est de 10’’ à 15’’.\n01pt",null,null,null,"La  fourchette des deux temps extrêmes est de 5’’ à 9’’.\n02 pts",null,null,null,"La  fourchette des deux temps extrêmes est de 00’’ à 4’’.\n03 pts"]
[null,null,"02 Points","Préparation  et récupération.","01 pt\n●     Mise en train désordonnée (courses rapides ou marche).\n●     Mobilisations articulaires incomplètes.",null,null,null,"1 ,5 pt\n●     Dans son 1er échauffement, Intègre des allures de son 500 m.\n●     Mise en train progressive.\n●      Mobilisation des articulations et des groupes musculaires prioritairement sollicités pour l’épreuve.\n●     Récupération active immédiatement après l’effort (marche).",null,null,null,"2 pts\n●     Vérification de l’allure sur plusieurs dizaines de m avant le 1er départ.\n●     Mise en train progressive et continue.\n●     Mobilisation des articulations et des groupes musculaires prioritairement sollicités pour l’épreuve.\n●     Récupération intégrant une mise en activité pour le 2nd et 3ème 500m."]

{"sheet":"DEBUT","index":3,"n_rows":231,"n_cols":18,"rows_kept":231,"cut":false,"hidden":false,"merged":[]}
[]
[]
[]
[null,"TEMPS TOUR",null,"DUREE","equivalent secondes","LONGUEUR PISTE","DISTANCE PLOTS","PTS /100m","Plots supp",null,"3x500 G","3x500 F","Note /15",null,"Ecart ","NOTE /3",null,"Echauffement"]
[null,null,null,"15\"",15,50,10,0.1,0,null,"00:00:01","00:00:01",15,null,0,3,null,0]
[null,"00:00:30",null,"30\"",30,100,15,0.2,1,null,"00:04:45","00:06:06",15,null,1,3,null,0.5]
[null,"00:00:31",null,"45\"",45,150,20,0.3,2,null,"00:04:48","00:06:11",14.25,null,2,3,null,1]
[null,"00:00:32",null,"1'",60,200,25,0.4,3,null,"00:04:53","00:06:16",13.5,null,3,3,null,1.5]
[null,"00:00:33",null,"1'30",90,250,50,0.5,4,null,"00:04:58","00:06:21",12.75,null,4,3,null,2]
[null,"00:00:34",null,"2'",120,300,100,0.6,5,null,"00:05:03","00:06:26",12,null,5,2]
[null,"00:00:35",null,"3'",180,350,null,0.7,6,null,"00:05:08","00:06:31",11.25,null,6,2]
[null,"00:00:36",null,"5'",300,400,null,0.8,null,null,"00:05:17","00:06:47",10.5,null,7,2]
[null,"00:00:37",null,"6'",360,450,null,0.9,null,null,"00:05:27","00:07:03",9.75,null,8,2]
[null,"00:00:38",null,"8'",480,500,null,1,null,null,"00:05:38","00:07:20",9,null,9,2]
[null,"00:00:39",null,"10'",600,null,null,1.1000000000000001,null,null,"00:05:49","00:07:38",8.25,null,10,1]
[null,"00:00:40",null,"12'",720,null,null,1.2,null,null,"00:06:00","00:07:56",7.5,null,11,1]
[null,"00:00:41",null,"15'",900,null,null,1.3,null,null,"00:06:10","00:08:15",6.75,null,12,1]
[null,"00:00:42",null,"18'",1080,null,null,1.4,null,null,"00:06:20","00:08:37",6,null,13,1]
[null,"00:00:43",null,"20'",1200,null,null,1.5,null,null,"00:06:30","00:08:59",5.25,null,14,1]
[null,"00:00:44",null,"25'",1500,null,null,1.6,null,null,"00:06:40","00:09:24",4.5,null,15,1]
[null,"00:00:45",null,"30'",1800,null,null,1.7,null,null,"00:06:50","00:09:50",3.75,null,16,0]
[null,"00:00:46",null,"35'",2100,null,null,1.8,null,null,"00:07:20","00:10:20",3,null,null,0]
[null,"00:00:47",null,"40'",2400,null,null,1.9,null,null,"00:07:50","00:10:50",2.25,null,null,0]
[null,"00:00:48",null,null,null,null,null,2,null,null,"00:08:20","00:11:25",1.5]
[null,"00:00:49",null,null,null,null,null,2.1,null,null,"00:08:50","00:12:00",0.75]
[null,"00:00:50",null,null,null,null,null,2.2000000000000002,null,null,"01:01:01","02:01:01",0]
[null,"00:00:51",null,null,null,null,null,2.2999999999999998]
[null,"00:00:52",null,null,null,null,null,2.4]
[null,"00:00:53",null,null,null,null,null,2.5]
[null,"00:00:54",null,null,null,null,null,2.6]
[null,"00:00:55",null,null,null,null,null,2.7]
[null,"00:00:56",null,null,null,null,null,2.8]
[null,"00:00:57",null,null,null,null,null,2.9]
[null,"00:00:58",null,null,null,null,null,3]
[null,"00:00:59",null,null,null,null,null,3.1]
[null,"00:01:00",null,null,null,null,null,3.2]
[null,"00:01:01",null,null,null,null,null,3.3]
[null,"00:01:02",null,null,null,null,null,3.4]
[null,"00:01:03",null,null,null,null,null,3.5]
[null,"00:01:04",null,null,null,null,null,3.6]
[null,"00:01:05",null,null,null,null,null,3.7]
[null,"00:01:06",null,null,null,null,null,3.8]
[null,"00:01:07",null,null,null,null,null,3.9]
[null,"00:01:08",null,null,null,null,null,4]
[null,"00:01:09",null,null,null,null,null,4.0999999999999996]
[null,"00:01:10",null,null,null,null,null,4.2]
[null,"00:01:11",null,null,null,null,null,4.3]
[null,"00:01:12",null,null,null,null,null,4.4000000000000004]
[null,"00:01:13",null,null,null,null,null,4.5]
[null,"00:01:14",null,null,null,null,null,4.5999999999999996]
[null,"00:01:15",null,null,null,null,null,4.7]
[null,"00:01:16",null,null,null,null,null,4.8]
[null,"00:01:17",null,null,null,null,null,4.9000000000000004]
[null,"00:01:18",null,null,null,null,null,5]
[null,"00:01:19",null,null,null,null,null,5.0999999999999996]
[null,"00:01:20",null,null,null,null,null,5.2]
[null,"00:01:21"]
[null,"00:01:22"]
[null,"00:01:23"]
[null,"00:01:24"]
[null,"00:01:25"]
[null,"00:01:26"]
[null,"00:01:27"]
[null,"00:01:28"]
[null,"00:01:29"]
[null,"00:01:30"]
[null,"00:01:31"]
[null,"00:01:32"]
[null,"00:01:33"]
[null,"00:01:34"]
[null,"00:01:35"]
[null,"00:01:36"]
[null,"00:01:37"]
[null,"00:01:38"]
[null,"00:01:39"]
[null,"00:01:40"]
[null,"00:01:41"]
[null,"00:01:42"]
[null,"00:01:43"]
[null,"00:01:44"]
[null,"00:01:45"]
[null,"00:01:46"]
[null,"00:01:47"]
[null,"00:01:48"]
[null,"00:01:49"]
[null,"00:01:50"]
[null,"00:01:51"]
[null,"00:01:52"]
[null,"00:01:53"]
[null,"00:01:54"]
[null,"00:01:55"]
[null,"00:01:56"]
[null,"00:01:57"]
[null,"00:01:58"]
[null,"00:01:59"]
[null,"00:02:00"]
[null,"00:02:01"]
[null,"00:02:02"]
[null,"00:02:03"]
[null,"00:02:04"]
[null,"00:02:05"]
[null,"00:02:06"]
[null,"00:02:07"]
[null,"00:02:08"]
[null,"00:02:09"]
[null,"00:02:10"]
[null,"00:02:11"]
[null,"00:02:12"]
[null,"00:02:13"]
[null,"00:02:14"]
[null,"00:02:15"]
[null,"00:02:16"]
[null,"00:02:17"]
[null,"00:02:18"]
[null,"00:02:19"]
[null,"00:02:20"]
[null,"00:02:21"]
[null,"00:02:22"]
[null,"00:02:23"]
[null,"00:02:24"]
[null,"00:02:25"]
[null,"00:02:26"]
[null,"00:02:27"]
[null,"00:02:28"]
[null,"00:02:29"]
[null,"00:02:30"]
[null,"00:02:31"]
[null,"00:02:32"]
[null,"00:02:33"]
[null,"00:02:34"]
[null,"00:02:35"]
[null,"00:02:36"]
[null,"00:02:37"]
[null,"00:02:38"]
[null,"00:02:39"]
[null,"00:02:40"]
[null,"00:02:41"]
[null,"00:02:42"]
[null,"00:02:43"]
[null,"00:02:44"]
[null,"00:02:45"]
[null,"00:02:46"]
[null,"00:02:47"]
[null,"00:02:48"]
[null,"00:02:49"]
[null,"00:02:50"]
[null,"00:02:51"]
[null,"00:02:52"]
[null,"00:02:53"]
[null,"00:02:54"]
[null,"00:02:55"]
[null,"00:02:56"]
[null,"00:02:57"]
[null,"00:02:58"]
[null,"00:02:59"]
[null,"00:03:00"]
[null,"00:03:01"]
[null,"00:03:02"]
[null,"00:03:03"]
[null,"00:03:04"]
[null,"00:03:05"]
[null,"00:03:06"]
[null,"00:03:07"]
[null,"00:03:08"]
[null,"00:03:09"]
[null,"00:03:10"]
[null,"00:03:11"]
[null,"00:03:12"]
[null,"00:03:13"]
[null,"00:03:14"]
[null,"00:03:15"]
[null,"00:03:16"]
[null,"00:03:17"]
[null,"00:03:18"]
[null,"00:03:19"]
[null,"00:03:20"]
[null,"00:03:21"]
[null,"00:03:22"]
[null,"00:03:23"]
[null,"00:03:24"]
[null,"00:03:25"]
[null,"00:03:26"]
[null,"00:03:27"]
[null,"00:03:28"]
[null,"00:03:29"]
[null,"00:03:30"]
[null,"00:03:31"]
[null,"00:03:32"]
[null,"00:03:33"]
[null,"00:03:34"]
[null,"00:03:35"]
[null,"00:03:36"]
[null,"00:03:37"]
[null,"00:03:38"]
[null,"00:03:39"]
[null,"00:03:40"]
[null,"00:03:41"]
[null,"00:03:42"]
[null,"00:03:43"]
[null,"00:03:44"]
[null,"00:03:45"]
[null,"00:03:46"]
[null,"00:03:47"]
[null,"00:03:48"]
[null,"00:03:49"]
[null,"00:03:50"]
[null,"00:03:51"]
[null,"00:03:52"]
[null,"00:03:53"]
[null,"00:03:54"]
[null,"00:03:55"]
[null,"00:03:56"]
[null,"00:03:57"]
[null,"00:03:58"]
[null,"00:03:59"]
[null,"00:04:00"]
[null,"00:04:01"]
[null,"00:04:02"]
[null,"00:04:03"]
[null,"00:04:04"]
[null,"00:04:05"]
[null,"00:04:06"]
[null,"00:04:07"]
[null,"00:04:08"]
[null,"00:04:09"]
[null,"00:04:10"]
[null,"00:04:11"]
[null,"00:04:12"]
[null,"00:04:13"]
[null,"00:04:14"]
[null,"00:04:15"]

{"sheet":"APPEL","index":4,"n_rows":38,"n_cols":28,"rows_kept":38,"cut":false,"hidden":false,"merged":[[0,19,0,20],[0,22,0,23],[0,25,0,26],[0,1,0,2],[0,4,0,5],[0,7,0,8],[0,10,0,11],[0,13,0,14],[0,16,0,17]]}
[null,"TELEC",null,null,"1PROE",null,null,"TGA",null,null,"1EVS",null,null,"1GA",null,null,"1TU",null,null,"STAGE"]
[null,"NOMS","PRENOMS","sexe","NOMS","PRENOMS","sexe","NOMS","PRENOMS","sexe","NOMS","PRENOMS","sexe","NOMS","PRENOMS","sexe","NOMS","PRENOMS","sexe","NOMS","PRENOMS","sexe","NOMS","PRENOMS","sexe","NOMS","PRENOMS","sexe"]
[1,"SAHLI","Abdelbasset","g","MAZIZ","Abdelwahid","g","KAMBABA","Bertile","f","AKARI","Abir","f","MARTINEZ","Camille","f","ALI ASSOUMANE","Amir","g",null,"Alexandre","g"]
[2,"DZANANOVIC","Alen","g","SAHLI","Ali","g","AGGOUNE","Chirine","f","SANI","Adama","g","SAULNIER","Emilie","f","MHADJI","Badrane","g",null,"Alexis F.","g"]
[3,"UGHANEM","Bilal","g","SAIDI","Fares","g","BERTIKIZI","Isma","f","MEMETI","Elfeta","f","TAGHNA","Gehna","f","BIRI","Emre","g",null,"Anthony","g"]
[4,"DUMENIL NGOULOU","Christian","g","DJAMEN MBEUFET","Gilles","g","HAMIDI","Jihenne","f","OUSSENI","Faiz","g","MRKALJ","Ismeta","f","MELAAB","Hedi","g",null,"Christian","g"]
[5,"ERBASLI","Halis","g","BOURIALA","Haykel","g","N'YACKHATE","Kandji","f","ROUANI","Fares","g","ALI","Janette","f","OMRANI","Mansour","g",null,"Claudine","f"]
[6,"CISSE","Laurent","g","BOUHANNA","Mohamed","g","BERKAT","Kenza","f","MEDDOUR","Hocine","g","NEKA","Jenna","f","LAKEHAL","Mounia","g",null,"Emmanuel","g"]
[7,"HOAREAU","Mickael","g","CAMARA","Mohamed","g","CHENDAR","Khayra","f","YAHYAOUI","Imen","f","ALMEIDA PINTO","Juliana","f","YORULMAZ","Mustafa","g",null,"vivien","g"]
[8,"REMADI","Salim","g","TOUIZRAT","Mohamed","g","ALLACHE","Liddia","f","ROS","Jenny","f","TOUTOUTE","Kelly","f","PEOU","Sombate rothanak","g",null,"Fred","g"]
[9,"NONGA KOUM","Willy","g","CAO","Phi tram","g","HAREK","Louiza","f","RIVIERE","Jennyline","f","BOUCAUD","Laura","f","BOUHAFS","Wail","g",null,"Gwen","g"]
[10,null,null,null,"ARGOUBI","Ryad","g","BOUDOUHA","Lydia","f","BIREM","Kévin","g","LICHA","Lea","f","RICHARD","Yohann","g",null,"Julien","g"]
[11,null,null,null,"GJOKA","Xhorxh","g","ADAMYAN","Margarita","f","MALARD","Melvine","f","BOUKARRA","Linda","f","MMADI","Zayd","g",null,"Laurent","g"]
[12,null,null,null,"FARHAT","Yassine","g","EZZINE","Mouna","f","GHEZALA","Nesrine","f","GUEFFAF","Maïssane","f",null,null,null,null,"Marc-Antoine","g"]
[13,null,null,null,null,null,null,"BRISSAUD","Nadia","f","KILUNGILA","Ruth","f","BEN HASSINE","Mélinda","f",null,null,null,null,"Marco","g"]
[14,null,null,null,null,null,null,"YOUSSOUF","Naila","f","LORION","Sabrina","f","KILIC","Meltem","f",null,null,null,null,"Morgane","f"]
[15,null,null,null,null,null,null,"TOUMI","Naoures","f","DOMINGOS MANUEL","Sandra","f","ATHLAN","Morgane","f",null,null,null,null,"Nathalie","f"]
[16,null,null,null,null,null,null,"DE CASTRO GUIMARES","Nessrine","f","YACOUBI","Siwar","f","IMAKO-BAFINDA","Naomie","f",null,null,null,null,"Nico Afriat","g"]
[17,null,null,null,null,null,null,"VIEIRA","Noemie","f","EROGLU","Suleyman","g","BOUTALEB","Nejma","f",null,null,null,null,"Nico Podu","g"]
[18,null,null,null,null,null,null,"BOUTAR","Sarinece","f",null,null,null,"BENABED","Nore-ymen","f",null,null,null,null,"Olivier","g"]
[19,null,null,null,null,null,null,"AGAGUENA","Sofia","f",null,null,null,"BERKAT","Rachda","f",null,null,null,null,"Pascal","g"]
[20,null,null,null,null,null,null,"TABET-BOUZERARI","Thais sirine","f",null,null,null,"ANGE","Sauraya","f",null,null,null,null,"Phil G.","g"]
[21,null,null,null,null,null,null,"THUILLIER","Victoria","f",null,null,null,"BIGAT","Sibel","f",null,null,null,null,"Philippe G.","g"]
[22,null,null,null,null,null,null,"ZOGHLAMI","Wiem","f",null,null,null,"BENZEGNOUN","Wacilla","f",null,null,null,null,"Stef","g"]
[23,null,null,null,null,null,null,"HABI","Ynès","f",null,null,null,"CHARRADI","Yosr","f",null,null,null,null,"Thomas","g"]
[24,null,null,null,null,null,null,"MENACERI","Zineb","f",null,null,null,"ONAY","Zekiye","f",null,null,null,null,"Tristan","g"]
[25,null,null,null,null,null,null,null,null,null,null,null,null,null,null,null,null,null,null,null,"eric","g"]
[26,null,null,null,null,null,null,null,null,null,null,null,null,null,null,null,null,null,null,null,"Xav","g"]
[27,null,null,null,null,null,null,null,null,null,null,null,null,null,null,null,null,null,null,null,"CC","f"]
[28,null,null,null,null,null,null,null,null,null,null,null,null,null,null,null,null,null,null,null,"Barby","f"]
[29,null,null,null,null,null,null,null,null,null,null,null,null,null,null,null,null,null,null,null,"Jo","g"]
[30,null,null,null,null,null,null,null,null,null,null,null,null,null,null,null,null,null,null,null,"Nico T.","g"]
[31,null,null,null,null,null,null,null,null,null,null,null,null,null,null,null,null,null,null,null,"Steven","g"]
[32,null,null,null,null,null,null,null,null,null,null,null,null,null,null,null,null,null,null,null,"Cyrilinou","g"]
[33,null,null,null,null,null,null,null,null,null,null,null,null,null,null,null,null,null,null,null,"Mick","g"]
[34]
[35]
[36]