{"text_format":"1","workbook":"xlsx","n_sheets":5,"sheets":["ACCUEIL","TPSTOUR","REFERENTIELS","DEBUT","APPEL"],"not_rendered":{"charts":0,"images":5,"macros":1,"external_links":0,"defined_names":14,"comments":0,"pivot_tables":0},"unopened":[],"bounds":{"document_bytes":16777216,"sheet_cells":100000,"rows_first":2000,"rows_last":500,"rows_between":2000,"halvings":0,"cell_chars":16384,"cell_head_chars":4096},"cells_cut":0,"cells_raw":0,"read":"whole","date_system":"1900"}

{"sheet":"ACCUEIL","index":0,"n_rows":16,"n_cols":3,"rows_kept":16,"cut":false,"hidden":false,"merged":[[15,2,15,5]]}
[]
[]
[]
[]
[]
[]
[]
[]
[]
[]
[]
[]
[]
[]
[]
{"$rows_left_out":2}
{"sheet":"TPSTOUR","index":1,"n_rows":36,"n_cols":55,"rows_kept":36,"cut":false,"hidden":false,"merged":[[1,13,1,47],[35,1,35,3],[1,1,1,5]]}
[]
[null,null,null,null,null,null,null,null,null,null,null,null,null,"CLIQUEZ SUR CHRONO (lancer un autre chrono en //) PUIS SUR LE NOM D'UN COUREUR AUX 250 et 500m. CLIQUEZ SUR RAZ A LA FIN DE CHAQUE 500 ",null,null,null,null,null,null,null,null,null,null,null,null,null,null,null,null,null,null,null,null,null,null,null,null,null,null,null,null,null,null,null,null,null,null,null,null,null,null,"Classe"]
[null,1,null,2,null,3,4,4,5,5,6,6,null,7,null,8,9,9,10,10,12,11,null,12,null,13,16,14,17,15,18,16,null,17,null,18,22,19,23,20,24,21,null,22,null,23,28,24,null,null,null,null,"STAGE"]
["Lancer un chrono en parallèle",{"$f":"BA5","v":"Alexandre"},null,{"$f":"BA6","v":"Alexis F."},null,{"$f":"BA7","v":"Anthony"},null,{"$f":"BA8","v":"Christian"},null,{"$f":"BA9","v":"Claudine"},null,{"$f":"BA10","v":"Emmanuel"},null,{"$f":"BA11","v":"vivien"},null,{"$f":"BA12","v":"Fred"},null,{"$f":"BA13","v":"Gwen"},null,{"$f":"BA14","v":"Julien"},null,{"$f":"BA15","v":"Laurent"},null,{"$f":"BA16","v":"Marc-Antoine"},null,{"$f":"BA17","v":"Marco"},null,{"$f":"BA18","v":"Morgane"},null,{"$f":"BA19","v":"Nathalie"},null,{"$f":"BA20","v":"Nico Afriat"},null,{"$f":"BA21","v":"Nico Podu"},null,{"$f":"BA22","v":"Olivier"},null,{"$f":"BA23","v":"Pascal"},null,{"$f":"BA24","v":"Phil G."},null,{"$f":"BA25","v":"Philippe G."},null,{"$f":"BA26","v":"Stef"},null,{"$f":"BA27","v":"Thomas"},null,{"$f":"BA28","v":"Tristan"},null,null,null,null,null,null,"Faire Ctrl+S après avoir renommer formes"]
[null,{"$f":"VLOOKUP(B4,$BA$5:$BB$28,2,FALSE)","v":"g"},{"$error":"#N/A"},"g",{"$error":"#N/A"},"g",{"$error":"#N/A"},"g",{"$error":"#N/A"},"f",{"$error":"#N/A"},"g",{"$error":"#N/A"},"g",{"$error":"#N/A"},"g",{"$error":"#N/A"},"g",{"$error":"#N/A"},"g",{"$error":"#N/A"},"g",{"$error":"#N/A"},"g",{"$error":"#N/A"},"g",{"$error":"#N/A"},"f",{"$error":"#N/A"},"f",{"$error":"#N/A"},"g",{"$error":"#N/A"},"g",{"$error":"#N/A"},"g",{"$error":"#N/A"},"g",{"$error":"#N/A"},"g",{"$error":"#N/A"},"g",{"$error":"#N/A"},"g",{"$error":"#N/A"},"g",{"$error":"#N/A"},"g",null,null,null,1,{"$f":"OFFSET(INDEX(eleves,MATCH(AZ5,numero,0),MATCH($BA$3,classe,0)),0,1)","v":"Alexandre"},{"$f":"OFFSET(INDEX(eleves,MATCH(AZ5,numero,0),MATCH($BA$3,classe,0)),0,2)","v":"g"}]
[250,null,null,null,null,null,null,null,null,null,null,null,null,null,null,null,null,null,null,null,null,null,null,null,null,null,null,null,null,null,null,null,null,null,null,null,null,null,null,null,null,null,null,null,null,null,null,null,null,250,null,2,"Alexis F.","g"]
["1er 500",null,null,null,null,null,null,null,null,null,null,null,null,null,null,null,null,null,null,null,null,null,null,null,null,null,null,null,null,null,null,null,null,null,null,null,null,null,null,null,null,null,null,null,null,null,null,null,null,"1er 500",null,3,"Anthony","g"]
[250,null,null,null,null,null,null,null,null,null,null,null,null,null,null,null,null,null,null,null,null,null,null,null,null,null,null,null,null,null,null,null,null,null,null,null,null,null,null,null,null,null,null,null,null,null,null,null,null,250,null,4,"Christian","g"]
["2è 500",null,null,null,null,null,null,null,null,null,null,null,null,null,null,null,null,null,null,null,null,null,null,null,null,null,null,null,null,null,null,null,null,null,null,null,null,null,null,null,null,null,null,null,null,null,null,null,null,"2è 500",null,5,"Claudine","f"]
[250,null,null,null,null,null,null,null,null,null,null,null,null,null,null,null,null,null,null,null,null,null,null,null,null,null,null,null,null,null,null,null,null,null,null,null,null,null,null,null,null,null,null,null,null,null,null,null,null,250,null,6,"Emmanuel","g"]
["3è 500",null,null,null,null,null,null,null,null,null,null,null,null,null,null,null,null,null,null,null,null,null,null,null,null,null,null,null,null,null,null,null,null,null,null,null,null,null,null,null,null,null,null,null,null,null,null,null,null,"3è 500",null,7,"vivien","g"]
[null,null,null,null,null,null,null,null,null,null,null,null,null,null,null,null,null,null,null,null,null,null,null,null,null,null,null,null,null,null,null,null,null,null,null,null,null,null,null,null,null,null,null,null,null,null,null,null,null,null,null,8,"Fred","g"]
["3x500",{"$f":"B11+B9+B7","v":"00:00:00"},{"$f":"C11+C9+C7","v":"00:00:00"},"00:00:00","00:00:00","00:00:00","00:00:00","00:00:00","00:00:00","00:00:00","00:00:00","00:00:00","00:00:00","00:00:00","00:00:00","00:00:00","00:00:00","00:00:00","00:00:00","00:00:00","00:00:00","00:00:00","00:00:00","00:00:00","00:00:00","00:00:00","00:00:00","00:00:00","00:00:00","00:00:00","00:00:00","00:00:00","00:00:00","00:00:00","00:00:00","00:00:00","00:00:00","00:00:00","00:00:00","00:00:00","00:00:00","00:00:00","00:00:00","00:00:00","00:00:00","00:00:00","00:00:00","00:00:00",null,"3x500",null,9,"Gwen","g"]
[null,null,null,null,null,null,null,null,null,null,null,null,null,null,null,null,null,null,null,null,null,null,null,null,null,null,null,null,null,null,null,null,null,null,null,null,null,null,null,null,null,null,null,null,null,null,null,null,null,null,null,10,"Julien","g"]
["NOTE/15",{"$f":"IFERROR(IF(B5=\"g\",VLOOKUP(B13,DEBUT!$K$5:$M$35,3,TRUE),VLOOKUP(B13,DEBUT!$L$5:$M$35,2,TRUE)),\"\")","v":""},{"$f":"IFERROR(IF(C5=\"g\",VLOOKUP(C13,DEBUT!$K$5:$M$35,3,TRUE),VLOOKUP(C13,DEBUT!$L$5:$M$35,2,TRUE)),\"\")","v":""},{"$f":"IFERROR(IF(D5=\"g\",VLOOKUP(D13,DEBUT!$K$5:$M$35,3,TRUE),VLOOKUP(D13,DEBUT!$L$5:$M$35,2,TRUE)),\"\")","v":""},{"$f":"IFERROR(IF(E5=\"g\",VLOOKUP(E13,DEBUT!$K$5:$M$35,3,TRUE),VLOOKUP(E13,DEBUT!$L$5:$M$35,2,TRUE)),\"\")","v":""},{"$f":"IFERROR(IF(F5=\"g\",VLOOKUP(F13,DEBUT!$K$5:$M$35,3,TRUE),VLOOKUP(F13,DEBUT!$L$5:$M$35,2,TRUE)),\"\")","v":""},{"$f":"IFERROR(IF(G5=\"g\",VLOOKUP(G13,DEBUT!$K$5:$M$35,3,TRUE),VLOOKUP(G13,DEBUT!$L$5:$M$35,2,TRUE)),\"\")","v":""},{"$f":"IFERROR(IF(H5=\"g\",VLOOKUP(H13,DEBUT!$K$5:$M$35,3,TRUE),VLOOKUP(H13,DEBUT!$L$5:$M$35,2,TRUE)),\"\")","v":""},{"$f":"IFERROR(IF(I5=\"g\",VLOOKUP(I13,DEBUT!$K$5:$M$35,3,TRUE),VLOOKUP(I13,DEBUT!$L$5:$M$35,2,TRUE)),\"\")","v":""},{"$f":"IFERROR(IF(J5=\"g\",VLOOKUP(J13,DEBUT!$K$5:$M$35,3,TRUE),VLOOKUP(J13,DEBUT!$L$5:$M$35,2,TRUE)),\"\")","v":""},{"$f":"IFERROR(IF(K5=\"g\",VLOOKUP(K13,DEBUT!$K$5:$M$35,3,TRUE),VLOOKUP(K13,DEBUT!$L$5:$M$35,2,TRUE)),\"\")","v":""},{"$f":"IFERROR(IF(L5=\"g\",VLOOKUP(L13,DEBUT!$K$5:$M$35,3,TRUE),VLOOKUP(L13,DEBUT!$L$5:$M$35,2,TRUE)),\"\")","v":""},{"$f":"IFERROR(IF(M5=\"g\",VLOOKUP(M13,DEBUT!$K$5:$M$35,3,TRUE),VLOOKUP(M13,DEBUT!$L$5:$M$35,2,TRUE)),\"\")","v":""},{"$f":"IFERROR(IF(N5=\"g\",VLOOKUP(N13,DEBUT!$K$5:$M$35,3,TRUE),VLOOKUP(N13,DEBUT!$L$5:$M$35,2,TRUE)),\"\")","v":""},{"$f":"IFERROR(IF(O5=\"g\",VLOOKUP(O13,DEBUT!$K$5:$M$35,3,TRUE),VLOOKUP(O13,DEBUT!$L$5:$M$35,2,TRUE)),\"\")","v":""},{"$f":"IFERROR(IF(P5=\"g\",VLOOKUP(P13,DEBUT!$K$5:$M$35,3,TRUE),VLOOKUP(P13,DEBUT!$L$5:$M$35,2,TRUE)),\"\")","v":""},{"$f":"IFERROR(IF(Q5=\"g\",VLOOKUP(Q13,DEBUT!$K$5:$M$35,3,TRUE),VLOOKUP(Q13,DEBUT!$L$5:$M$35,2,TRUE)),\"\")","v":""},{"$f":"IFERROR(IF(R5=\"g\",VLOOKUP(R13,DEBUT!$K$5:$M$35,3,TRUE),VLOOKUP(R13,DEBUT!$L$5:$M$35,2,TRUE)),\"\")","v":""},{"$f":"IFERROR(IF(S5=\"g\",VLOOKUP(S13,DEBUT!$K$5:$M$35,3,TRUE),VLOOKUP(S13,DEBUT!$L$5:$M$35,2,TRUE)),\"\")","v":""},{"$f":"IFERROR(IF(T5=\"g\",VLOOKUP(T13,DEBUT!$K$5:$M$35,3,TRUE),VLOOKUP(T13,DEBUT!$L$5:$M$35,2,TRUE)),\"\")","v":""},{"$f":"IFERROR(IF(U5=\"g\",VLOOKUP(U13,DEBUT!$K$5:$M$35,3,TRUE),VLOOKUP(U13,DEBUT!$L$5:$M$35,2,TRUE)),\"\")","v":""},{"$f":"IFERROR(IF(V5=\"g\",VLOOKUP(V13,DEBUT!$K$5:$M$35,3,TRUE),VLOOKUP(V13,DEBUT!$L$5:$M$35,2,TRUE)),\"\")","v":""},{"$f":"IFERROR(IF(W5=\"g\",VLOOKUP(W13,DEBUT!$K$5:$M$35,3,TRUE),VLOOKUP(W13,DEBUT!$L$5:$M$35,2,TRUE)),\"\")","v":""},{"$f":"IFERROR(IF(X5=\"g\",VLOOKUP(X13,DEBUT!$K$5:$M$35,3,TRUE),VLOOKUP(X13,DEBUT!$L$5:$M$35,2,TRUE)),\"\")","v":""},{"$f":"IFERROR(IF(Y5=\"g\",VLOOKUP(Y13,DEBUT!$K$5:$M$35,3,TRUE),VLOOKUP(Y13,DEBUT!$L$5:$M$35,2,TRUE)),\"\")","v":""},{"$f":"IFERROR(IF(Z5=\"g\",VLOOKUP(Z13,DEBUT!$K$5:$M$35,3,TRUE),VLOOKUP(Z13,DEBUT!$L$5:$M$35,2,TRUE)),\"\")","v":""},{"$f":"IFERROR(IF(AA5=\"g\",VLOOKUP(AA13,DEBUT!$K$5:$M$35,3,TRUE),VLOOKUP(AA13,DEBUT!$L$5:$M$35,2,TRUE)),\"\")","v":""},{"$f":"IFERROR(IF(AB5=\"g\",VLOOKUP(AB13,DEBUT!$K$5:$M$35,3,TRUE),VLOOKUP(AB13,DEBUT!$L$5:$M$35,2,TRUE)),\"\")","v":""},{"$f":"IFERROR(IF(AC5=\"g\",VLOOKUP(AC13,DEBUT!$K$5:$M$35,3,TRUE),VLOOKUP(AC13,DEBUT!$L$5:$M$35,2,TRUE)),\"\")","v":""},{"$f":"IFERROR(IF(AD5=\"g\",VLOOKUP(AD13,DEBUT!$K$5:$M$35,3,TRUE),VLOOKUP(AD13,DEBUT!$L$5:$M$35,2,TRUE)),\"\")","v":""},{"$f":"IFERROR(IF(AE5=\"g\",VLOOKUP(AE13,DEBUT!$K$5:$M$35,3,TRUE),VLOOKUP(AE13,DEBUT!$L$5:$M$35,2,TRUE)),\"\")","v":""},{"$f":"IFERROR(IF(AF5=\"g\",VLOOKUP(AF13,DEBUT!$K$5:$M$35,3,TRUE),VLOOKUP(AF13,DEBUT!$L$5:$M$35,2,TRUE)),\"\")","v":""},{"$f":"IFERROR(IF(AG5=\"g\",VLOOKUP(AG13,DEBUT!$K$5:$M$35,3,TRUE),VLOOKUP(AG13,DEBUT!$L$5:$M$35,2,TRUE)),\"\")","v":""},{"$f":"IFERROR(IF(AH5=\"g\",VLOOKUP(AH13,DEBUT!$K$5:$M$35,3,TRUE),VLOOKUP(AH13,DEBUT!$L$5:$M$35,2,TRUE)),\"\")","v":""},{"$f":"IFERROR(IF(AI5=\"g\",VLOOKUP(AI13,DEBUT!$K$5:$M$35,3,TRUE),VLOOKUP(AI13,DEBUT!$L$5:$M$35,2,TRUE)),\"\")","v":""},{"$f":"IFERROR(IF(AJ5=\"g\",VLOOKUP(AJ13,DEBUT!$K$5:$M$35,3,TRUE),VLOOKUP(AJ13,DEBUT!$L$5:$M$35,2,TRUE)),\"\")","v":""},{"$f":"IFERROR(IF(AK5=\"g\",VLOOKUP(AK13,DEBUT!$K$5:$M$35,3,TRUE),VLOOKUP(AK13,DEBUT!$L$5:$M$35,2,TRUE)),\"\")","v":""},{"$f":"IFERROR(IF(AL5=\"g\",VLOOKUP(AL13,DEBUT!$K$5:$M$35,3,TRUE),VLOOKUP(AL13,DEBUT!$L$5:$M$35,2,TRUE)),\"\")","v":""},{"$f":"IFERROR(IF(AM5=\"g\",VLOOKUP(AM13,DEBUT!$K$5:$M$35,3,TRUE),VLOOKUP(AM13,DEBUT!$L$5:$M$35,2,TRUE)),\"\")","v":""},{"$f":"IFERROR(IF(AN5=\"g\",VLOOKUP(AN13,DEBUT!$K$5:$M$35,3,TRUE),VLOOKUP(AN13,DEBUT!$L$5:$M$35,2,TRUE)),\"\")","v":""},{"$f":"IFERROR(IF(AO5=\"g\",VLOOKUP(AO13,DEBUT!$K$5:$M$35,3,TRUE),VLOOKUP(AO13,DEBUT!$L$5:$M$35,2,TRUE)),\"\")","v":""},{"$f":"IFERROR(IF(AP5=\"g\",VLOOKUP(AP13,DEBUT!$K$5:$M$35,3,TRUE),VLOOKUP(AP13,DEBUT!$L$5:$M$35,2,TRUE)),\"\")","v":""},{"$f":"IFERROR(IF(AQ5=\"g\",VLOOKUP(AQ13,DEBUT!$K$5:$M$35,3,TRUE),VLOOKUP(AQ13,DEBUT!$L$5:$M$35,2,TRUE)),\"\")","v":""},{"$f":"IFERROR(IF(AR5=\"g\",VLOOKUP(AR13,DEBUT!$K$5:$M$35,3,TRUE),VLOOKUP(AR13,DEBUT!$L$5:$M$35,2,TRUE)),\"\")","v":""},{"$f":"IFERROR(IF(AS5=\"g\",VLOOKUP(AS13,DEBUT!$K$5:$M$35,3,TRUE),VLOOKUP(AS13,DEBUT!$L$5:$M$35,2,TRUE)),\"\")","v":""},{"$f":"IFERROR(IF(AT5=\"g\",VLOOKUP(AT13,DEBUT!$K$5:$M$35,3,TRUE),VLOOKUP(AT13,DEBUT!$L$5:$M$35,2,TRUE)),\"\")","v":""},{"$f":"IFERROR(IF(AU5=\"g\",VLOOKUP(AU13,DEBUT!$K$5:$M$35,3,TRUE),VLOOKUP(AU13,DEBUT!$L$5:$M$35,2,TRUE)),\"\")","v":""},{"$f":"IFERROR(IF(AV5=\"g\",VLOOKUP(AV13,DEBUT!$K$5:$M$35,3,TRUE),VLOOKUP(AV13,DEBUT!$L$5:$M$35,2,TRUE)),\"\")","v":""},null,"NOTE/15",null,11,"Laurent","g"]
{"$rows_left_out":22}
{"sheet":"REFERENTIELS","index":2,"n_rows":18,"n_cols":16,"rows_kept":18,"cut":false,"hidden":false,"merged":[[3,2,3,3],[3,4,3,15],[4,2,4,3],[4,4,4,15],[5,4,5,7],[5,8,5,15],[17,4,17,7],[17,8,17,11],[17,12,17,15],[6,2,15,2],[6,3,15,3],[12,12,15,15],[13,8,15,11],[16,4,16,7],[16,8,16,11],[16,12,16,15]]}
[]
[]
[null,null,"DEMI-FOND N3 CAP-BEP"]
[null,null,"COMPÉTENCES  ATTENDUES",null,"PRINCIPES D’ÉLABORATION DE L’ÉPREUVE"]
[null,null,"NIVEAU 3\nProduire la meilleure performance sur une série de courses, se préparer et répartir son effort grâce à une gestion raisonnée de ses ressources.",null,"En  demi-fond,  chaque  élève  réalise  3  courses  de  500m  (récupération  de10mn  maximum)  chronométrées  par  un enseignant  à  la  seconde.  Les  élèves  courent  sans  montre  ni  chronomètre  mais  un  temps  de  passage  leur  est communiqué aux 250m\nLe temps cumulé compte pour 75 % de la note.\nL’échauffement, la récupération et la gestion de l’effort  comptent pour 25%."]
[null,null,"POINTS À AFFECTER","ÉLÉMENTS À ÉVALUER","COMPETENCE DE NIVEAU 3 EN COURS D’ACQUISITION\nde 00 à 09 pts",null,null,null,"COMPETENCE DE NIVEAU 3 ACQUISE\nde 10 à 20 pts"]
[null,null,"15 Points","Temps cumulé pour les trois 500 m réalisés\n(barème différencié garçons - filles)\nExemple : une fille réalise  7mn01 Sa note est 9.75 / 15 (ou 13 / 20)","Note\n/ 20","Note\n/ 15","Temps Filles","Temps Garçons","Note\n/20","Note\n/15","Temps Filles","Temps Garçons","Note\n/20","Note\n/15","Temps Filles","Temps Garçons"]
[null,null,null,null,1,0.75,12,8.5,10,7.5,7.56,6,16,12,6.26,5.03]
[null,null,null,null,2,1.5,11.25,8.1999999999999993,11,8.25,7.38,5.49,17,12.75,6.21,4.58]
[null,null,null,null,3,2.25,10.5,7.5,12,9,7.2,5.38,18,13.5,6.16,4.53]
[null,null,null,null,4,3,10.199999999999999,7.2,13,9.75,7.03,5.27,19,14.25,6.11,4.4800000000000004]
[null,null,null,null,5,3.75,9.5,6.5,14,10.5,6.47,5.17,20,15,6.06,4.45]
[null,null,null,null,6,4.5,9.24,6.4,15,11.25,6.31,5.08]
[null,null,null,null,7,5.25,8.59,6.3]
[null,null,null,null,8,6,8.3699999999999992,6.2]
{"$rows_left_out":4}
{"sheet":"DEBUT","index":3,"n_rows":231,"n_cols":18,"rows_kept":231,"cut":false,"hidden":false,"merged":[]}
[]
[]
[]
[null,"TEMPS TOUR",null,"DUREE","equivalent secondes","LONGUEUR PISTE","DISTANCE PLOTS","PTS /100m","Plots supp",null,"3x500 G","3x500 F","Note /15",null,"Ecart ","NOTE /3",null,"Echauffement"]
[null,null,null,"15\"",15,50,10,0.1,0,null,"00:00:01","00:00:01",15,null,0,3,null,0]
[null,"00:00:30",null,"30\"",30,100,15,0.2,1,null,"00:04:45","00:06:06",15,null,1,3,null,0.5]
[null,"00:00:31",null,"45\"",45,150,20,0.3,2,null,"00:04:48","00:06:11",14.25,null,2,3,null,1]
[null,"00:00:32",null,"1'",60,200,25,0.4,3,null,"00:04:53","00:06:16",13.5,null,3,3,null,1.5]
[null,"00:00:33",null,"1'30",90,250,50,0.5,4,null,"00:04:58","00:06:21",12.75,null,4,3,null,2]
[null,"00:00:34",null,"2'",120,300,100,0.6,5,null,"00:05:03","00:06:26",12,null,5,2]
[null,"00:00:35",null,"3'",180,350,null,0.7,6,null,"00:05:08","00:06:31",11.25,null,6,2]
[null,"00:00:36",null,"5'",300,400,null,0.8,null,null,"00:05:17","00:06:47",10.5,null,7,2]
[null,"00:00:37",null,"6'",360,450,null,0.9,null,null,"00:05:27","00:07:03",9.75,null,8,2]
[null,"00:00:38",null,"8'",480,500,null,1,null,null,"00:05:38","00:07:20",9,null,9,2]
[null,"00:00:39",null,"10'",600,null,null,1.1000000000000001,null,null,"00:05:49","00:07:38",8.25,null,10,1]
{"$rows_left_out":217}
{"sheet":"APPEL","index":4,"n_rows":38,"n_cols":28,"rows_kept":38,"cut":false,"hidden":false,"merged":[[0,19,0,20],[0,22,0,23],[0,25,0,26],[0,1,0,2],[0,4,0,5],[0,7,0,8],[0,10,0,11],[0,13,0,14],[0,16,0,17]]}
[null,"TELEC",null,null,"1PROE",null,null,"TGA",null,null,"1EVS",null,null,"1GA",null,null,"1TU",null,null,"STAGE"]
[null,"NOMS","PRENOMS","sexe","NOMS","PRENOMS","sexe","NOMS","PRENOMS","sexe","NOMS","PRENOMS","sexe","NOMS","PRENOMS","sexe","NOMS","PRENOMS","sexe","NOMS","PRENOMS","sexe","NOMS","PRENOMS","sexe","NOMS","PRENOMS","sexe"]
[1,"SAHLI","Abdelbasset","g","MAZIZ","Abdelwahid","g","KAMBABA","Bertile","f","AKARI","Abir","f","MARTINEZ","Camille","f","ALI ASSOUMANE","Amir","g",null,"Alexandre","g"]
[2,"DZANANOVIC","Alen","g","SAHLI","Ali","g","AGGOUNE","Chirine","f","SANI","Adama","g","SAULNIER","Emilie","f","MHADJI","Badrane","g",null,"Alexis F.","g"]
[3,"UGHANEM","Bilal","g","SAIDI","Fares","g","BERTIKIZI","Isma","f","MEMETI","Elfeta","f","TAGHNA","Gehna","f","BIRI","Emre","g",null,"Anthony","g"]
[4,"DUMENIL NGOULOU","Christian","g","DJAMEN MBEUFET","Gilles","g","HAMIDI","Jihenne","f","OUSSENI","Faiz","g","MRKALJ","Ismeta","f","MELAAB","Hedi","g",null,"Christian","g"]
[5,"ERBASLI","Halis","g","BOURIALA","Haykel","g","N'YACKHATE","Kandji","f","ROUANI","Fares","g","ALI","Janette","f","OMRANI","Mansour","g",null,"Claudine","f"]
[6,"CISSE","Laurent","g","BOUHANNA","Mohamed","g","BERKAT","Kenza","f","MEDDOUR","Hocine","g","NEKA","Jenna","f","LAKEHAL","Mounia","g",null,"Emmanuel","g"]
[7,"HOAREAU","Mickael","g","CAMARA","Mohamed","g","CHENDAR","Khayra","f","YAHYAOUI","Imen","f","ALMEIDA PINTO","Juliana","f","YORULMAZ","Mustafa","g",null,"vivien","g"]
[8,"REMADI","Salim","g","TOUIZRAT","Mohamed","g","ALLACHE","Liddia","f","ROS","Jenny","f","TOUTOUTE","Kelly","f","PEOU","Sombate rothanak","g",null,"Fred","g"]
[9,"NONGA KOUM","Willy","g","CAO","Phi tram","g","HAREK","Louiza","f","RIVIERE","Jennyline","f","BOUCAUD","Laura","f","BOUHAFS","Wail","g",null,"Gwen","g"]
[10,null,null,null,"ARGOUBI","Ryad","g","BOUDOUHA","Lydia","f","BIREM","Kévin","g","LICHA","Lea","f","RICHARD","Yohann","g",null,"Julien","g"]
[11,null,null,null,"GJOKA","Xhorxh","g","ADAMYAN","Margarita","f","MALARD","Melvine","f","BOUKARRA","Linda","f","MMADI","Zayd","g",null,"Laurent","g"]
[12,null,null,null,"FARHAT","Yassine","g","EZZINE","Mouna","f","GHEZALA","Nesrine","f","GUEFFAF","Maïssane","f",null,null,null,null,"Marc-Antoine","g"]
[13,null,null,null,null,null,null,"BRISSAUD","Nadia","f","KILUNGILA","Ruth","f","BEN HASSINE","Mélinda","f",null,null,null,null,"Marco","g"]
{"$rows_left_out":23}