{"text_format":"1","workbook":"xlsx","n_sheets":4,"sheets":["ACCUEIL","TPSTOUR","DEBUT","APPEL"],"not_rendered":{"charts":0,"images":5,"macros":1,"external_links":0,"defined_names":9,"comments":0,"pivot_tables":0},"unopened":[],"bounds":{"document_bytes":16777216,"sheet_cells":100000,"rows_first":2000,"rows_last":500,"rows_between":2000,"halvings":0,"cell_chars":16384,"cell_head_chars":4096},"cells_cut":0,"cells_raw":0,"read":"whole","date_system":"1900"}

{"sheet":"ACCUEIL","index":0,"n_rows":16,"n_cols":3,"rows_kept":16,"cut":false,"hidden":false,"merged":[]}
[]
[]
[]
[]
[]
[]
[]
[]
[]
[]
[]
[]
[]
[]
[]
[null,null,"CHRONO TOURS"]

{"sheet":"TPSTOUR","index":1,"n_rows":56,"n_cols":55,"rows_kept":56,"cut":false,"hidden":false,"merged":[[36,1,37,47],[35,1,35,47],[1,1,1,5],[1,14,1,16],[1,20,1,22],[1,26,1,28],[1,32,1,34],[31,1,31,11],[31,13,31,23],[31,25,31,35],[31,37,31,47],[32,1,32,11],[32,13,32,23],[32,25,32,35],[32,37,32,47]]}
[]
[null,"08:40:44",null,null,null,null,null,null,null,null,null,null,null,"DUREE","1'",null,null,{"$f":"VLOOKUP(O2,DEBUT!D5:E99,2,FALSE)","v":60},null,"PISTE",50,null,null,"m",null,"PLOTS",20,null,null,"m",null,"Point/\n100m",0.75,null,null,"pts",null,null,null,null,null,null,null,null,null,null,null,null,null,null,null,null,"Classe"]
[null,1,null,2,null,3,4,4,5,5,6,6,null,7,null,8,9,9,10,10,12,11,null,12,null,13,16,14,17,15,18,16,null,17,null,18,22,19,23,20,24,21,null,22,null,23,28,24,null,null,null,null,"STAGE"]
["Lancer un chrono en parallèle",null,null,null,null,null,null,null,null,null,null,null,null,null,null,null,null,null,null,null,null,null,null,null,null,null,null,null,null,null,null,null,null,null,null,null,null,null,null,null,null,null,null,null,null,null,null,null,null,null,null,null,null,null,"Faire Ctrl+S après avoir renommer formes"]
["TEMPS PASSAGE",null,null,null,null,null,null,null,null,null,null,null,null,null,null,null,null,null,null,null,null,null,null,null,null,null,null,null,null,null,null,null,null,null,null,null,null,null,null,null,null,null,null,null,null,null,null,null,null,null,null,1,{"$f":"IF($BA$3=APPEL!$B$1,APPEL!C3,IF($BA$3=APPEL!$E$1,APPEL!F3,IF($BA$3=APPEL!$H$1,APPEL!I3,IF($BA$3=APPEL!$K$1,APPEL!L3,IF($BA$3=APPEL!$N$1,APPEL!O4,IF($BA$3=APPEL!$Q$1,APPEL!R3,IF($BA$3=APPEL!$T$1,APPEL!U3,IF($BA$3=APPEL!$W$1,APPEL!X3,IF($BA$3=APPEL!$Z$1,APPEL!AA3)))))))))","v":"Alexandre"}]
["TOUR 1","00:00:14",null,"00:00:24",null,"00:00:26",null,null,null,null,null,null,null,null,null,null,null,null,null,null,null,null,null,null,null,null,null,null,null,null,null,null,null,null,null,null,null,null,null,null,null,null,null,null,null,null,null,null,null,"TOUR 1",null,2,{"$f":"IF($BA$3=APPEL!$B$1,APPEL!C4,IF($BA$3=APPEL!$E$1,APPEL!F4,IF($BA$3=APPEL!$H$1,APPEL!I4,IF($BA$3=APPEL!$K$1,APPEL!L4,IF($BA$3=APPEL!$N$1,APPEL!O5,IF($BA$3=APPEL!$Q$1,APPEL!R4,IF($BA$3=APPEL!$T$1,APPEL!U4,IF($BA$3=APPEL!$W$1,APPEL!X4,IF($BA$3=APPEL!$Z$1,APPEL!AA4)))))))))","v":"Alexis F."}]
["TOUR 2",null,null,null,null,"00:00:30",null,null,null,null,null,null,null,null,null,null,null,null,null,null,null,null,null,null,null,null,null,null,null,null,null,null,null,null,null,null,null,null,null,null,null,null,null,null,null,null,null,null,null,"TOUR 2",null,3,{"$f":"IF($BA$3=APPEL!$B$1,APPEL!C5,IF($BA$3=APPEL!$E$1,APPEL!F5,IF($BA$3=APPEL!$H$1,APPEL!I5,IF($BA$3=APPEL!$K$1,APPEL!L5,IF($BA$3=APPEL!$N$1,APPEL!O6,IF($BA$3=APPEL!$Q$1,APPEL!R5,IF($BA$3=APPEL!$T$1,APPEL!U5,IF($BA$3=APPEL!$W$1,APPEL!X5,IF($BA$3=APPEL!$Z$1,APPEL!AA5)))))))))","v":"Anthony"}]
["TOUR 3",null,null,null,null,"00:00:31",null,null,null,null,null,null,null,null,null,null,null,null,null,null,null,null,null,null,null,null,null,null,null,null,null,null,null,null,null,null,null,null,null,null,null,null,null,null,null,null,null,null,null,"TOUR 3",null,4,{"$f":"IF($BA$3=APPEL!$B$1,APPEL!C6,IF($BA$3=APPEL!$E$1,APPEL!F6,IF($BA$3=APPEL!$H$1,APPEL!I6,IF($BA$3=APPEL!$K$1,APPEL!L6,IF($BA$3=APPEL!$N$1,APPEL!O7,IF($BA$3=APPEL!$Q$1,APPEL!R6,IF($BA$3=APPEL!$T$1,APPEL!U6,IF($BA$3=APPEL!$W$1,APPEL!X6,IF($BA$3=APPEL!$Z$1,APPEL!AA6)))))))))","v":"Christian"}]
["TOUR 4",null,null,null,null,null,null,null,null,null,null,null,null,null,null,null,null,null,null,null,null,null,null,null,null,null,null,null,null,null,null,null,null,null,null,null,null,null,null,null,null,null,null,null,null,null,null,null,null,"TOUR 4",null,5,{"$f":"IF($BA$3=APPEL!$B$1,APPEL!C7,IF($BA$3=APPEL!$E$1,APPEL!F7,IF($BA$3=APPEL!$H$1,APPEL!I7,IF($BA$3=APPEL!$K$1,APPEL!L7,IF($BA$3=APPEL!$N$1,APPEL!O8,IF($BA$3=APPEL!$Q$1,APPEL!R7,IF($BA$3=APPEL!$T$1,APPEL!U7,IF($BA$3=APPEL!$W$1,APPEL!X7,IF($BA$3=APPEL!$Z$1,APPEL!AA7)))))))))","v":"Claudine"}]
["TOUR 5",null,null,null,null,null,null,null,null,null,null,null,null,null,null,null,null,null,null,null,null,null,null,null,null,null,null,null,null,null,null,null,null,null,null,null,null,null,null,null,null,null,null,null,null,null,null,null,null,"TOUR 5",null,6,{"$f":"IF($BA$3=APPEL!$B$1,APPEL!C8,IF($BA$3=APPEL!$E$1,APPEL!F8,IF($BA$3=APPEL!$H$1,APPEL!I8,IF($BA$3=APPEL!$K$1,APPEL!L8,IF($BA$3=APPEL!$N$1,APPEL!O9,IF($BA$3=APPEL!$Q$1,APPEL!R8,IF($BA$3=APPEL!$T$1,APPEL!U8,IF($BA$3=APPEL!$W$1,APPEL!X8,IF($BA$3=APPEL!$Z$1,APPEL!AA8)))))))))","v":"Emmanuel"}]
["TOUR 6",null,null,null,null,null,null,null,null,null,null,null,null,null,null,null,null,null,null,null,null,null,null,null,null,null,null,null,null,null,null,null,null,null,null,null,null,null,null,null,null,null,null,null,null,null,null,null,null,"TOUR 6",null,7,{"$f":"IF($BA$3=APPEL!$B$1,APPEL!C9,IF($BA$3=APPEL!$E$1,APPEL!F9,IF($BA$3=APPEL!$H$1,APPEL!I9,IF($BA$3=APPEL!$K$1,APPEL!L9,IF($BA$3=APPEL!$N$1,APPEL!O10,IF($BA$3=APPEL!$Q$1,APPEL!R9,IF($BA$3=APPEL!$T$1,APPEL!U9,IF($BA$3=APPEL!$W$1,APPEL!X9,IF($BA$3=APPEL!$Z$1,APPEL!AA9)))))))))","v":"vivien"}]
["TOUR 7",null,null,null,null,null,null,null,null,null,null,null,null,null,null,null,null,null,null,null,null,null,null,null,null,null,null,null,null,null,null,null,null,null,null,null,null,null,null,null,null,null,null,null,null,null,null,null,null,"TOUR 7",null,8,{"$f":"IF($BA$3=APPEL!$B$1,APPEL!C10,IF($BA$3=APPEL!$E$1,APPEL!F10,IF($BA$3=APPEL!$H$1,APPEL!I10,IF($BA$3=APPEL!$K$1,APPEL!L10,IF($BA$3=APPEL!$N$1,APPEL!O11,IF($BA$3=APPEL!$Q$1,APPEL!R10,IF($BA$3=APPEL!$T$1,APPEL!U10,IF($BA$3=APPEL!$W$1,APPEL!X10,IF($BA$3=APPEL!$Z$1,APPEL!AA10)))))))))","v":"Fred"}]
["TOUR 8",null,null,null,null,null,null,null,null,null,null,null,null,null,null,null,null,null,null,null,null,null,null,null,null,null,null,null,null,null,null,null,null,null,null,null,null,null,null,null,null,null,null,null,null,null,null,null,null,"TOUR 8",null,9,{"$f":"IF($BA$3=APPEL!$B$1,APPEL!C11,IF($BA$3=APPEL!$E$1,APPEL!F11,IF($BA$3=APPEL!$H$1,APPEL!I11,IF($BA$3=APPEL!$K$1,APPEL!L11,IF($BA$3=APPEL!$N$1,APPEL!O12,IF($BA$3=APPEL!$Q$1,APPEL!R11,IF($BA$3=APPEL!$T$1,APPEL!U11,IF($BA$3=APPEL!$W$1,APPEL!X11,IF($BA$3=APPEL!$Z$1,APPEL!AA11)))))))))","v":"Gwen"}]
["TOUR 9",null,null,null,null,null,null,null,null,null,null,null,null,null,null,null,null,null,null,null,null,null,null,null,null,null,null,null,null,null,null,null,null,null,null,null,null,null,null,null,null,null,null,null,null,null,null,null,null,"TOUR 9",null,10,{"$f":"IF($BA$3=APPEL!$B$1,APPEL!C12,IF($BA$3=APPEL!$E$1,APPEL!F12,IF($BA$3=APPEL!$H$1,APPEL!I12,IF($BA$3=APPEL!$K$1,APPEL!L12,IF($BA$3=APPEL!$N$1,APPEL!O13,IF($BA$3=APPEL!$Q$1,APPEL!R12,IF($BA$3=APPEL!$T$1,APPEL!U12,IF($BA$3=APPEL!$W$1,APPEL!X12,IF($BA$3=APPEL!$Z$1,APPEL!AA12)))))))))","v":"Julien"}]
["TOUR 10",null,null,null,null,null,null,null,null,null,null,null,null,null,null,null,null,null,null,null,null,null,null,null,null,null,null,null,null,null,null,null,null,null,null,null,null,null,null,null,null,null,null,null,null,null,null,null,null,"TOUR 10",null,11,{"$f":"IF($BA$3=APPEL!$B$1,APPEL!C13,IF($BA$3=APPEL!$E$1,APPEL!F13,IF($BA$3=APPEL!$H$1,APPEL!I13,IF($BA$3=APPEL!$K$1,APPEL!L13,IF($BA$3=APPEL!$N$1,APPEL!O14,IF($BA$3=APPEL!$Q$1,APPEL!R13,IF($BA$3=APPEL!$T$1,APPEL!U13,IF($BA$3=APPEL!$W$1,APPEL!X13,IF($BA$3=APPEL!$Z$1,APPEL!AA13)))))))))","v":"Laurent"}]
["TOUR 11",null,null,null,null,null,null,null,null,null,null,null,null,null,null,null,null,null,null,null,null,null,null,null,null,null,null,null,null,null,null,null,null,null,null,null,null,null,null,null,null,null,null,null,null,null,null,null,null,"TOUR 11",null,12,{"$f":"IF($BA$3=APPEL!$B$1,APPEL!C14,IF($BA$3=APPEL!$E$1,APPEL!F14,IF($BA$3=APPEL!$H$1,APPEL!I14,IF($BA$3=APPEL!$K$1,APPEL!L14,IF($BA$3=APPEL!$N$1,APPEL!O15,IF($BA$3=APPEL!$Q$1,APPEL!R14,IF($BA$3=APPEL!$T$1,APPEL!U14,IF($BA$3=APPEL!$W$1,APPEL!X14,IF($BA$3=APPEL!$Z$1,APPEL!AA14)))))))))","v":"Marc-Antoine"}]
["TOUR 12",null,null,null,null,null,null,null,null,null,null,null,null,null,null,null,null,null,null,null,null,null,null,null,null,null,null,null,null,null,null,null,null,null,null,null,null,null,null,null,null,null,null,null,null,null,null,null,null,"TOUR 12",null,13,{"$f":"IF($BA$3=APPEL!$B$1,APPEL!C15,IF($BA$3=APPEL!$E$1,APPEL!F15,IF($BA$3=APPEL!$H$1,APPEL!I15,IF($BA$3=APPEL!$K$1,APPEL!L15,IF($BA$3=APPEL!$N$1,APPEL!O16,IF($BA$3=APPEL!$Q$1,APPEL!R15,IF($BA$3=APPEL!$T$1,APPEL!U15,IF($BA$3=APPEL!$W$1,APPEL!X15,IF($BA$3=APPEL!$Z$1,APPEL!AA15)))))))))","v":"Marco"}]
["TOUR 13",null,null,null,null,null,null,null,null,null,null,null,null,null,null,null,null,null,null,null,null,null,null,null,null,null,null,null,null,null,null,null,null,null,null,null,null,null,null,null,null,null,null,null,null,null,null,null,null,"TOUR 13",null,14,{"$f":"IF($BA$3=APPEL!$B$1,APPEL!C16,IF($BA$3=APPEL!$E$1,APPEL!F16,IF($BA$3=APPEL!$H$1,APPEL!I16,IF($BA$3=APPEL!$K$1,APPEL!L16,IF($BA$3=APPEL!$N$1,APPEL!O17,IF($BA$3=APPEL!$Q$1,APPEL!R16,IF($BA$3=APPEL!$T$1,APPEL!U16,IF($BA$3=APPEL!$W$1,APPEL!X16,IF($BA$3=APPEL!$Z$1,APPEL!AA16)))))))))","v":"Morgane"}]
["TOUR 14",null,null,null,null,null,null,null,null,null,null,null,null,null,null,null,null,null,null,null,null,null,null,null,null,null,null,null,null,null,null,null,null,null,null,null,null,null,null,null,null,null,null,null,null,null,null,null,null,"TOUR 14",null,15,{"$f":"IF($BA$3=APPEL!$B$1,APPEL!C17,IF($BA$3=APPEL!$E$1,APPEL!F17,IF($BA$3=APPEL!$H$1,APPEL!I17,IF($BA$3=APPEL!$K$1,APPEL!L17,IF($BA$3=APPEL!$N$1,APPEL!O18,IF($BA$3=APPEL!$Q$1,APPEL!R17,IF($BA$3=APPEL!$T$1,APPEL!U17,IF($BA$3=APPEL!$W$1,APPEL!X17,IF($BA$3=APPEL!$Z$1,APPEL!AA17)))))))))","v":"Nathalie"}]
["TOUR 15",null,null,null,null,null,null,null,null,null,null,null,null,null,null,null,null,null,null,null,null,null,null,null,null,null,null,null,null,null,null,null,null,null,null,null,null,null,null,null,null,null,null,null,null,null,null,null,null,"TOUR 15",null,16,{"$f":"IF($BA$3=APPEL!$B$1,APPEL!C18,IF($BA$3=APPEL!$E$1,APPEL!F18,IF($BA$3=APPEL!$H$1,APPEL!I18,IF($BA$3=APPEL!$K$1,APPEL!L18,IF($BA$3=APPEL!$N$1,APPEL!O19,IF($BA$3=APPEL!$Q$1,APPEL!R18,IF($BA$3=APPEL!$T$1,APPEL!U18,IF($BA$3=APPEL!$W$1,APPEL!X18,IF($BA$3=APPEL!$Z$1,APPEL!AA18)))))))))","v":"Nico Afriat"}]
[null,null,null,null,null,null,null,null,null,null,null,null,null,null,null,null,null,null,null,null,null,null,null,null,null,null,null,null,null,null,null,null,null,null,null,null,null,null,null,null,null,null,null,null,null,null,null,null,null,"MAX",null,17,{"$f":"IF($BA$3=APPEL!$B$1,APPEL!C19,IF($BA$3=APPEL!$E$1,APPEL!F19,IF($BA$3=APPEL!$H$1,APPEL!I19,IF($BA$3=APPEL!$K$1,APPEL!L19,IF($BA$3=APPEL!$N$1,APPEL!O20,IF($BA$3=APPEL!$Q$1,APPEL!R19,IF($BA$3=APPEL!$T$1,APPEL!U19,IF($BA$3=APPEL!$W$1,APPEL!X19,IF($BA$3=APPEL!$Z$1,APPEL!AA19)))))))))","v":"Nico Podu"}]
["TOURS",{"$f":"(SUMPRODUCT(N(ISNUMBER(B6:B20))))","v":1},{"$f":"(SUMPRODUCT(N(ISNUMBER(C6:C20))))","v":0},1,0,3,0,0,0,0,0,0,0,0,0,0,0,0,0,0,0,0,0,0,0,0,0,0,0,0,0,0,0,0,0,0,0,0,0,0,0,0,0,0,0,0,0,0,null,{"$f":"SUM(B22:AV22)","v":5},"TOURS",18,{"$f":"IF($BA$3=APPEL!$B$1,APPEL!C20,IF($BA$3=APPEL!$E$1,APPEL!F20,IF($BA$3=APPEL!$H$1,APPEL!I20,IF($BA$3=APPEL!$K$1,APPEL!L20,IF($BA$3=APPEL!$N$1,APPEL!O21,IF($BA$3=APPEL!$Q$1,APPEL!R20,IF($BA$3=APPEL!$T$1,APPEL!U20,IF($BA$3=APPEL!$W$1,APPEL!X20,IF($BA$3=APPEL!$Z$1,APPEL!AA20)))))))))","v":"Olivier"}]
["PLOTS SUP",null,null,null,null,null,null,null,null,null,null,null,null,null,null,null,null,null,null,null,null,null,null,null,null,null,null,null,null,null,null,null,null,null,null,null,null,null,null,null,null,null,null,null,null,null,null,null,null,null,"PLOTS SUP",19,{"$f":"IF($BA$3=APPEL!$B$1,APPEL!C21,IF($BA$3=APPEL!$E$1,APPEL!F21,IF($BA$3=APPEL!$H$1,APPEL!I21,IF($BA$3=APPEL!$K$1,APPEL!L21,IF($BA$3=APPEL!$N$1,APPEL!O22,IF($BA$3=APPEL!$Q$1,APPEL!R21,IF($BA$3=APPEL!$T$1,APPEL!U21,IF($BA$3=APPEL!$W$1,APPEL!X21,IF($BA$3=APPEL!$Z$1,APPEL!AA21)))))))))","v":"Pascal"}]
["DISTANCE",{"$f":"B22*$U$2+B23*$AA$2","v":50},{"$f":"C22*$U$2","v":0},50,0,150,0,0,0,0,0,0,0,0,0,0,0,0,0,0,0,0,0,0,0,0,0,0,0,0,0,0,0,0,0,0,0,0,0,0,0,0,0,0,0,0,0,0,0,{"$f":"SUM(B24:AV24)","v":250},"DISTANCE",20,{"$f":"IF($BA$3=APPEL!$B$1,APPEL!C22,IF($BA$3=APPEL!$E$1,APPEL!F22,IF($BA$3=APPEL!$H$1,APPEL!I22,IF($BA$3=APPEL!$K$1,APPEL!L22,IF($BA$3=APPEL!$N$1,APPEL!O23,IF($BA$3=APPEL!$Q$1,APPEL!R22,IF($BA$3=APPEL!$T$1,APPEL!U22,IF($BA$3=APPEL!$W$1,APPEL!X22,IF($BA$3=APPEL!$Z$1,APPEL!AA22)))))))))","v":"Phil G."}]
["Vitesse moyenne (Km/h)",{"$f":"B24/$R$2*3.6","v":3},{"$f":"C24/$R$2*3.6","v":0},3,null,9,null,0,null,0,null,0,null,0,null,0,null,0,null,0,null,0,null,0,null,0,null,0,null,0,null,0,null,0,null,0,null,0,null,0,null,0,null,0,null,0,null,0,null,{"$f":"LARGE(B25:AV25,1)","v":9},"Vitesse moyenne",21,{"$f":"IF($BA$3=APPEL!$B$1,APPEL!C23,IF($BA$3=APPEL!$E$1,APPEL!F23,IF($BA$3=APPEL!$H$1,APPEL!I23,IF($BA$3=APPEL!$K$1,APPEL!L23,IF($BA$3=APPEL!$N$1,APPEL!O24,IF($BA$3=APPEL!$Q$1,APPEL!R23,IF($BA$3=APPEL!$T$1,APPEL!U23,IF($BA$3=APPEL!$W$1,APPEL!X23,IF($BA$3=APPEL!$Z$1,APPEL!AA23)))))))))","v":"Philippe G."}]
["Arrêts",null,null,null,null,null,null,null,null,null,null,null,null,null,null,null,null,null,null,null,null,null,null,null,null,null,null,null,null,null,null,null,null,null,null,null,null,null,null,null,null,null,null,null,null,null,null,null,null,{"$f":"SUM(B26:AV26)","v":0},"Arrêts",22,{"$f":"IF($BA$3=APPEL!$B$1,APPEL!C24,IF($BA$3=APPEL!$E$1,APPEL!F24,IF($BA$3=APPEL!$H$1,APPEL!I24,IF($BA$3=APPEL!$K$1,APPEL!L24,IF($BA$3=APPEL!$N$1,APPEL!O25,IF($BA$3=APPEL!$Q$1,APPEL!R24,IF($BA$3=APPEL!$T$1,APPEL!U24,IF($BA$3=APPEL!$W$1,APPEL!X24,IF($BA$3=APPEL!$Z$1,APPEL!AA24)))))))))","v":"Stef"}]
[null,null,null,null,null,null,null,null,null,null,null,null,null,null,null,null,null,null,null,null,null,null,null,null,null,null,null,null,null,null,null,null,null,null,null,null,null,null,null,null,null,null,null,null,null,null,null,null,null,null,null,23,{"$f":"IF($BA$3=APPEL!$B$1,APPEL!C25,IF($BA$3=APPEL!$E$1,APPEL!F25,IF($BA$3=APPEL!$H$1,APPEL!I25,IF($BA$3=APPEL!$K$1,APPEL!L25,IF($BA$3=APPEL!$N$1,APPEL!O26,IF($BA$3=APPEL!$Q$1,APPEL!R25,IF($BA$3=APPEL!$T$1,APPEL!U25,IF($BA$3=APPEL!$W$1,APPEL!X25,IF($BA$3=APPEL!$Z$1,APPEL!AA25)))))))))","v":"Thomas"}]
[null,null,null,null,null,null,null,null,null,null,null,null,null,null,null,null,null,null,null,null,null,null,null,null,null,null,null,null,null,null,null,null,null,null,null,null,null,null,null,null,null,null,null,null,null,null,null,null,null,null,null,24,{"$f":"IF($BA$3=APPEL!$B$1,APPEL!C26,IF($BA$3=APPEL!$E$1,APPEL!F26,IF($BA$3=APPEL!$H$1,APPEL!I26,IF($BA$3=APPEL!$K$1,APPEL!L26,IF($BA$3=APPEL!$N$1,APPEL!O27,IF($BA$3=APPEL!$Q$1,APPEL!R26,IF($BA$3=APPEL!$T$1,APPEL!U26,IF($BA$3=APPEL!$W$1,APPEL!X26,IF($BA$3=APPEL!$Z$1,APPEL!AA26)))))))))","v":"Tristan"}]
[null,null,null,null,null,null,null,null,null,null,null,null,null,null,null,null,null,null,null,null,null,null,null,null,null,null,null,null,null,null,null,null,null,null,null,null,null,null,null,null,null,null,null,null,null,null,null,null,null,null,null,25]
[null,null,null,null,null,null,null,null,null,null,null,null,null,null,null,null,null,null,null,null,null,null,null,null,null,null,null,null,null,null,null,null,null,null,null,null,null,null,null,null,null,null,null,null,null,null,null,null,null,null,null,26]
["BONUS COUREUR",{"$f":"IF(B24=$AX$24,1,0)","v":0},0,0,0,0,0,0,0,0,0,0,0,0,0,0,0,0,0,0,0,0,0,0,0,0,0,0,0,0,0,0,0,0,0,0,0,0,0,0,0,0,0,0,0,0,0,0,null,null,"BONUS COUREUR",27]
["DISTANCE EQUIPE",{"$f":"SUM(B24:L24)","v":250},null,null,null,null,null,null,null,null,null,null,null,{"$f":"SUM(N24:X24)","v":0},null,null,null,null,null,null,null,null,null,null,null,{"$f":"SUM(Z24:AJ24)","v":0},null,null,null,null,null,null,null,null,null,null,null,{"$f":"SUM(AL24:AV24)","v":0},null,null,null,null,null,null,null,null,null,null,null,{"$f":"SUM(B32:AV32)","v":250},"DISTANCE EQUIPE",28]
["BONUS EQUIPE",{"$f":"IF($B$32=$AX$32,1,0)","v":1},null,null,null,null,null,null,null,null,null,null,null,{"$f":"IF(N32=$AX$32,1,0)","v":0},null,null,null,null,null,null,null,null,null,null,null,{"$f":"IF(Z32=$AX$32,1,0)","v":0},null,null,null,null,null,null,null,null,null,null,null,{"$f":"IF(AL32=$AX$32,1,0)","v":0},null,null,null,null,null,null,null,null,null,null,null,null,"BONUS EQUIPE",29]
[null,null,null,null,null,null,null,null,null,null,null,null,null,null,null,null,null,null,null,null,null,null,null,null,null,null,null,null,null,null,null,null,null,null,null,null,null,null,null,null,null,null,null,null,null,null,null,null,null,null,null,30]
["NOTE",{"$f":"B24/100*$AG$2+B31+$B$33-B26","v":1.375},null,{"$f":"D24/100*$AG$2+D31+$B$33-D26","v":1.375},null,{"$f":"F24/100*$AG$2+F31+$B$33-F26","v":2.125},null,{"$f":"H24/100*$AG$2+H31+$B$33-H26","v":1},null,{"$f":"J24/100*$AG$2+J31+$B$33-J26","v":1},null,{"$f":"L24/100*$AG$2+L31+$B$33-L26","v":1},null,{"$f":"N24/100*$AG$2+N31+$N$33-N26","v":0},null,{"$f":"P24/100*$AG$2+P31+$N$33-P26","v":0},null,{"$f":"R24/100*$AG$2+R31+$N$33-R26","v":0},null,{"$f":"T24/100*$AG$2+T31+$N$33-T26","v":0},null,{"$f":"V24/100*$AG$2+V31+$N$33-V26","v":0},null,{"$f":"X24/100*$AG$2+X31+$N$33-X26","v":0},null,{"$f":"Z24/100*$AG$2+Z31+$Z$33-Z26","v":0},null,{"$f":"AB24/100*$AG$2+AB31+$Z$33-AB26","v":0},null,{"$f":"AD24/100*$AG$2+AD31+$Z$33-AD26","v":0},null,{"$f":"AF24/100*$AG$2+AF31+$Z$33-AF26","v":0},null,{"$f":"AH24/100*$AG$2+AH31+$Z$33-AH26","v":0},null,{"$f":"AJ24/100*$AG$2+AJ31+$Z$33-AJ26","v":0},null,{"$f":"AL24/100*$AG$2+AL31+$AL$33-AL26","v":0},null,{"$f":"AN24/100*$AG$2+AN31+$AL$33-AN26","v":0},null,{"$f":"AP24/100*$AG$2+AP31+$AL$33-AP26","v":0},null,{"$f":"AR24/100*$AG$2+AR31+$AL$33-AR26","v":0},null,{"$f":"AT24/100*$AG$2+AT31+$AL$33-AT26","v":0},null,{"$f":"AV24/100*$AG$2+AV31+$AL$33-AV26","v":0},null,{"$f":"AVERAGE(B35:AV35)","v":0.328125},"NOTE"]
[null,"Note=Distance /100m*(Coeff pt/100m)+ Bonus coureur + Bonus équipe - nb d'arrêts"]
[null,"ARRIVEE"]
[]
["TEMPS au tour"]
[1,{"$f":"IF(B6=\"\",\"\",B6)","v":"00:00:14"},"","00:00:24","","00:00:26","","","","","","","","","","","","","","","","","","","","","","","","","","","","","","","","","","","","","","","","","",""]
[2,{"$f":"IF(B7=\"\",\"\",B7-B6)","v":""},"","","","00:00:04","","","","","","","","","","","","","","","","","","","","","","","","","","","","","","","","","","","","","","","","","",""]
[3,{"$f":"IF(B8=\"\",\"\",B8-B7)","v":""},"","","","00:00:01","","","","","","","","","","","","","","","","","","","","","","","","","","","","","","","","","","","","","","","","","",""]
[4,{"$f":"IF(B9=\"\",\"\",B9-B8)","v":""},"","","","","","","","","","","","","","","","","","","","","","","","","","","","","","","","","","","","","","","","","","","","","",""]
[5,{"$f":"IF(B10=\"\",\"\",B10-B9)","v":""},"","","","","","","","","","","","","","","","","","","","","","","","","","","","","","","","","","","","","","","","","","","","","",""]
[6,{"$f":"IF(B11=\"\",\"\",B11-B10)","v":""},"","","","","","","","","","","","","","","","","","","","","","","","","","","","","","","","","","","","","","","","","","","","","",""]
[7,{"$f":"IF(B12=\"\",\"\",B12-B11)","v":""},"","","","","","","","","","","","","","","","","","","","","","","","","","","","","","","","","","","","","","","","","","","","","",""]
[8,{"$f":"IF(B13=\"\",\"\",B13-B12)","v":""},"","","","","","","","","","","","","","","","","","","","","","","","","","","","","","","","","","","","","","","","","","","","","",""]
[9,{"$f":"IF(B14=\"\",\"\",B14-B13)","v":""},"","","","","","","","","","","","","","","","","","","","","","","","","","","","","","","","","","","","","","","","","","","","","",""]
[10,{"$f":"IF(B15=\"\",\"\",B15-B14)","v":""},"","","","","","","","","","","","","","","","","","","","","","","","","","","","","","","","","","","","","","","","","","","","","",""]
[11,{"$f":"IF(B16=\"\",\"\",B16-B15)","v":""},"","","","","","","","","","","","","","","","","","","","","","","","","","","","","","","","","","","","","","","","","","","","","",""]
[12,{"$f":"IF(B17=\"\",\"\",B17-B16)","v":""},"","","","","","","","","","","","","","","","","","","","","","","","","","","","","","","","","","","","","","","","","","","","","",""]
[13,{"$f":"IF(B18=\"\",\"\",B18-B17)","v":""},"","","","","","","","","","","","","","","","","","","","","","","","","","","","","","","","","","","","","","","","","","","","","",""]
[14,{"$f":"IF(B19=\"\",\"\",B19-B18)","v":""},"","","","","","","","","","","","","","","","","","","","","","","","","","","","","","","","","","","","","","","","","","","","","",""]
[15,{"$f":"IF(B20=\"\",\"\",B20-B19)","v":""},"","","","","","","","","","","","","","","","","","","","","","","","","","","","","","","","","","","","","","","","","","","","","",""]
["MEILLEUR TOUR",{"$f":"IFERROR(SMALL(B40:B54,1),\"\")","v":"00:00:14"},{"$f":"IFERROR(SMALL(C40:C54,1),\"\")","v":""},"00:00:24","","00:00:01","","","","","","","","","","","","","","","","","","","","","","","","","","","","","","","","","","","","","","","","","","",{"$f":"SMALL(AW40:AW54,1)","v":{"$error":"#NUM!"}},{"$f":"SMALL(B55:AV55,1)","v":"00:00:01"}]
["TOUR LE + LENT",{"$f":"IFERROR(LARGE(B40:B54,1),\"\")","v":"00:00:14"},{"$f":"IFERROR(LARGE(C40:C54,1),\"\")","v":""},"00:00:24","","00:00:26","","","","","","","","","","","","","","","","","","","","","","","","","","","","","","","","","","","","","","","","","","",{"$f":"LARGE(AW40:AW54,1)","v":{"$error":"#NUM!"}},{"$f":"LARGE(B56:AV56,1)","v":"00:00:26"}]

{"sheet":"DEBUT","index":2,"n_rows":364,"n_cols":11,"rows_kept":364,"cut":false,"hidden":false,"merged":[]}
[]
[]
[]
[null,"TEMPS TOUR",null,"DUREE","equivalent secondes","LONGUEUR PISTE","DISTANCE PLOTS","PTS /100m","Plots supp",null,"Arrêts"]
[null,null,null,"15\"",15,50,10,0.1]
[null,"00:00:10",null,"30\"",30,100,15,0.2,0,null,1]
[null,"01:00:11",null,"45\"",45,150,20,0.3,1,null,2]
[null,"02:00:12",null,"1'",60,200,25,0.4,2,null,3]
[null,"03:00:13",null,"1'30",90,250,50,0.5,3,null,4]
[null,"04:00:14",null,"2'",120,300,100,0.6,4,null,5]
[null,"05:00:15",null,"3'",180,350,null,0.7,5,null,6]
[null,"06:00:16",null,"5'",300,400,null,0.8,6,null,7]
[null,"07:00:17",null,"6'",360,450,null,0.9,7,null,8]
[null,"08:00:18",null,"8'",480,500,null,1,8,null,9]
[null,"09:00:19",null,"10'",600,null,null,1.1000000000000001,9,null,10]
[null,"10:00:20",null,"12'",720,null,null,1.2,10,null,11]
[null,"11:00:21",null,"15'",900,null,null,1.3,null,null,12]
[null,"12:00:22",null,"18'",1080,null,null,1.4,null,null,13]
[null,"13:00:23",null,"20'",1200,null,null,1.5,null,null,14]
[null,"14:00:24",null,"25'",1500,null,null,1.6,null,null,15]
[null,"15:00:25",null,"30'",1800,null,null,1.7,null,null,16]
[null,"16:00:26",null,"35'",2100,null,null,1.8,null,null,17]
[null,"17:00:27",null,"40'",2400,null,null,1.9,null,null,18]
[null,"18:00:28",null,null,null,null,null,2,null,null,19]
[null,"19:00:29",null,null,null,null,null,2.1,null,null,20]
[null,"20:00:30",null,null,null,null,null,2.2000000000000002,null,null,21]
[null,"21:00:31",null,null,null,null,null,2.2999999999999998,null,null,22]
[null,"22:00:32",null,null,null,null,null,2.4,null,null,23]
[null,"23:00:33",null,null,null,null,null,2.5,null,null,24]
[null,1.00039351851852,null,null,null,null,null,2.6]
[null,1.0420717592592601,null,null,null,null,null,2.7]
[null,1.08375,null,null,null,null,null,2.8]
[null,1.1254282407407401,null,null,null,null,null,2.9]
[null,1.16710648148148,null,null,null,null,null,3]
[null,1.2087847222222201,null,null,null,null,null,3.1]
[null,1.25046296296296,null,null,null,null,null,3.2]
[null,1.2921412037036999,null,null,null,null,null,3.3]
[null,1.33381944444444,null,null,null,null,null,3.4]
[null,1.3754976851851799,null,null,null,null,null,3.5]
[null,1.41717592592593,null,null,null,null,null,3.6]
[null,1.4588541666666699,null,null,null,null,null,3.7]
[null,1.50053240740741,null,null,null,null,null,3.8]
[null,1.5422106481481499,null,null,null,null,null,3.9]
[null,1.58388888888889,null,null,null,null,null,4]
[null,1.6255671296296299,null,null,null,null,null,4.0999999999999996]
[null,1.66724537037037,null,null,null,null,null,4.2]
[null,1.7089236111111099,null,null,null,null,null,4.3]
[null,1.75060185185185,null,null,null,null,null,4.4000000000000004]
[null,1.7922800925925899,null,null,null,null,null,4.5]
[null,1.83395833333333,null,null,null,null,null,4.5999999999999996]
[null,1.8756365740740699,null,null,null,null,null,4.7]
[null,1.91731481481481,null,null,null,null,null,4.8]
[null,1.9589930555555499,null,null,null,null,null,4.9000000000000004]
[null,2.0006712962963,null,null,null,null,null,5]
[null,2.0423495370370399,null,null,null,null,null,5.0999999999999996]
[null,2.0840277777777798,null,null,null,null,null,5.2]
[null,2.1257060185185201]
[null,2.16738425925926]
[null,2.2090624999999999]
[null,2.2507407407407398]
[null,2.2924189814814802]
[null,2.33409722222222]
[null,2.3757754629629599]
[null,2.4174537037036998]
[null,2.4591319444444402]
[null,2.5008101851851801]
[null,2.5424884259259199]
[null,2.5841666666666701]
[null,2.6258449074074099]
[null,2.6675231481481498]
[null,2.7092013888888902]
[null,2.7508796296296301]
[null,2.79255787037037]
[null,2.8342361111111098]
[null,2.8759143518518502]
[null,2.9175925925925901]
[null,2.95927083333333]
[null,3.0009490740740699]
[null,3.0426273148148102]
[null,3.0843055555555501]
[null,3.1259837962963002]
[null,3.1676620370370401]
[null,3.20934027777778]
[null,3.2510185185185199]
[null,3.2926967592592602]
[null,3.3343750000000001]
[null,3.37605324074074]
[null,3.4177314814814799]
[null,3.4594097222222202]
[null,3.5010879629629601]
[null,3.5427662037037]
[null,3.5844444444444399]
[null,3.6261226851851802]
[null,3.6678009259259299]
[null,3.7094791666666702]
[null,3.7511574074074101]
[null,3.79283564814815]
[null,3.8345138888888899]
[null,3.8761921296296298]
[null,3.9178703703703701]
[null,3.95954861111111]
[null,4.0012268518518503]
[null,4.0429050925925898]
[null,4.0845833333333301]
[null,4.1262615740740696]
[null,4.1679398148148099]
[null,4.2096180555555502]
[null,4.2512962962963003]
[null,4.2929745370370398]
[null,4.3346527777777801]
[null,4.3763310185185196]
[null,4.4180092592592599]
[null,4.4596875000000002]
[null,4.5013657407407397]
[null,4.54304398148148]
[null,4.5847222222222204]
[null,4.6264004629629598]
[null,4.6680787037037001]
[null,4.7097569444444396]
[null,4.7514351851851799]
[null,4.7931134259259203]
[null,4.8347916666666704]
[null,4.8764699074074098]
[null,4.9181481481481502]
[null,4.9598263888888896]
[null,5.0015046296296299]
[null,5.0431828703703703]
[null,5.0848611111111097]
[null,5.1265393518518501]
[null,5.1682175925925904]
[null,5.2098958333333298]
[null,5.2515740740740702]
[null,5.2932523148148096]
[null,5.33493055555555]
[null,5.3766087962962903]
[null,5.4182870370370404]
[null,5.4599652777777798]
[null,5.5016435185185202]
[null,5.5433217592592596]
[null,5.585]
[null,5.6266782407407403]
[null,5.6683564814814797]
[null,5.7100347222222201]
[null,5.7517129629629604]
[null,5.7933912037036999]
[null,5.8350694444444402]
[null,5.8767476851851796]
[null,5.91842592592592]
[null,5.9601041666666701]
[null,6.0017824074074104]
[null,6.0434606481481499]
[null,6.0851388888888902]
[null,6.1268171296296297]
[null,6.16849537037037]
[null,6.2101736111111103]
[null,6.2518518518518498]
[null,6.2935300925925901]
[null,6.3352083333333304]
[null,6.3768865740740699]
[null,6.4185648148148102]
[null,6.4602430555555497]
[null,6.5019212962962998]
[null,6.5435995370370401]
[null,6.5852777777777796]
[null,6.6269560185185199]
[null,6.6686342592592602]
[null,6.7103124999999997]
[null,6.75199074074074]
[null,6.7936689814814804]
[null,6.8353472222222198]
[null,6.8770254629629601]
[null,6.9187037037036996]
[null,6.9603819444444399]
[null,7.0020601851851803]
[null,7.0437384259259304]
[null,7.0854166666666698]
[null,7.1270949074074101]
[null,7.1687731481481496]
[null,7.2104513888888899]
[null,7.2521296296296303]
[null,7.2938078703703697]
[null,7.33548611111111]
[null,7.3771643518518504]
[null,7.4188425925925898]
[null,7.4605208333333302]
[null,7.5021990740740696]
[null,7.5438773148148099]
[null,7.5855555555555503]
[null,7.6272337962963004]
[null,7.6689120370370398]
[null,7.7105902777777802]
[null,7.7522685185185196]
[null,7.7939467592592599]
[null,7.8356250000000003]
[null,7.8773032407407397]
[null,7.9189814814814801]
[null,7.9606597222222204]
[null,8.0023379629629598]
[null,8.0440162037037002]
[null,8.0856944444444405]
[null,8.1273726851851809]
[null,8.1690509259259194]
[null,8.2107291666666704]
[null,8.2524074074074107]
[null,8.2940856481481493]
[null,8.3357638888888896]
[null,8.37744212962963]
[null,8.4191203703703703]
[null,8.4607986111111106]
[null,8.5024768518518492]
[null,8.5441550925925895]
[null,8.5858333333333299]
[null,8.6275115740740702]
[null,8.6691898148148105]
[null,8.7108680555555509]
[null,8.7525462962963001]
[null,8.7942245370370404]
[null,8.8359027777777808]
[null,8.8775810185185193]
[null,8.9192592592592597]
[null,8.9609375]
[null,9.0026157407407403]
[null,9.0442939814814807]
[null,9.0859722222222192]
[null,9.1276504629629596]
[null,9.1693287037036999]
[null,9.2110069444444402]
[null,9.2526851851851806]
[null,9.2943634259259298]
[null,9.3360416666666701]
[null,9.3777199074074105]
[null,9.4193981481481508]
[null,9.4610763888888894]
[null,9.5027546296296297]
[null,9.54443287037037]
[null,9.5861111111111104]
[null,9.6277893518518507]
[null,9.6694675925925893]
[null,9.7111458333333296]
[null,9.7528240740740699]
[null,9.7945023148148103]
[null,9.8361805555555506]
[null,9.8778587962962998]
[null,9.9195370370370402]
[null,9.9612152777777805]
[null,10.0028935185185]
[null,10.044571759259201]
[null,10.08625]
[null,10.127928240740699]
[null,10.1696064814814]
[null,10.211284722222199]
[null,10.252962962962901]
[null,10.2946412037037]
[null,10.336319444444401]
[null,10.3779976851851]
[null,10.419675925925899]
[null,10.461354166666601]
[null,10.5030324074074]
[null,10.544710648148101]
[null,10.5863888888888]
[null,10.628067129629599]
[null,10.6697453703703]
[null,10.711423611111099]
[null,10.753101851851801]
[null,10.7947800925926]
[null,10.836458333333301]
[null,10.878136574074]
[null,10.919814814814799]
[null,10.961493055555501]
[null,11.0031712962963]
[null,11.044849537037001]
[null,11.0865277777777]
[null,11.128206018518499]
[null,11.1698842592592]
[null,11.211562499999999]
[null,11.253240740740701]
[null,11.2949189814814]
[null,11.336597222222199]
[null,11.3782754629629]
[null,11.419953703703699]
[null,11.461631944444401]
[null,11.5033101851851]
[null,11.544988425925901]
[null,11.5866666666666]
[null,11.628344907407399]
[null,11.6700231481481]
[null,11.7117013888888]
[null,11.753379629629601]
[null,11.7950578703703]
[null,11.836736111111099]
[null,11.8784143518518]
[null,11.920092592592599]
[null,11.961770833333301]
[null,12.003449074074]
[null,12.045127314814801]
[null,12.0868055555555]
[null,12.128483796296299]
[null,12.170162037037001]
[null,12.2118402777777]
[null,12.253518518518501]
[null,12.2951967592592]
[null,12.336874999999999]
[null,12.3785532407407]
[null,12.4202314814814]
[null,12.461909722222201]
[null,12.5035879629629]
[null,12.545266203703701]
[null,12.5869444444444]
[null,12.6286226851851]
[null,12.670300925925901]
[null,12.7119791666666]
[null,12.753657407407401]
[null,12.7953356481481]
[null,12.8370138888888]
[null,12.8786921296296]
[null,12.9203703703703]
[null,12.962048611111101]
[null,13.0037268518518]
[null,13.045405092592601]
[null,13.0870833333333]
[null,13.128761574074]
[null,13.170439814814801]
[null,13.2121180555555]
[null,13.253796296296301]
[null,13.295474537037]
[null,13.3371527777777]
[null,13.3788310185185]
[null,13.4205092592592]
[null,13.462187500000001]
[null,13.5038657407407]
[null,13.5455439814814]
[null,13.5872222222222]
[null,13.6289004629629]
[null,13.670578703703701]
[null,13.7122569444444]
[null,13.753935185185099]
[null,13.7956134259259]
[null,13.8372916666666]
[null,13.8789699074074]
[null,13.9206481481481]
[null,13.962326388888799]
[null,14.0040046296296]
[null,14.0456828703703]
[null,14.0873611111111]
[null,14.1290393518518]
[null,14.170717592592601]
[null,14.2123958333333]
[null,14.254074074074]
[null,14.2957523148148]
[null,14.3374305555555]
[null,14.3791087962963]
[null,14.420787037037]
[null,14.462465277777699]
[null,14.5041435185185]
[null,14.5458217592592]
[null,14.5875]
[null,14.6291782407407]
[null,14.670856481481399]
[null,14.7125347222222]
[null,14.7542129629629]
[null,14.7958912037037]
[null,14.8375694444444]
[null,14.879247685185099]
[null,14.9209259259259]

{"sheet":"APPEL","index":3,"n_rows":38,"n_cols":28,"rows_kept":38,"cut":false,"hidden":false,"merged":[[0,19,0,20],[0,22,0,23],[0,25,0,26],[0,1,0,2],[0,4,0,5],[0,7,0,8],[0,10,0,11],[0,13,0,14],[0,16,0,17]]}
[null,"TELEC",null,null,"1PROE",null,null,"TGA",null,null,"1EVS",null,null,"1GA",null,null,"1TU",null,null,"STAGE"]
[null,"NOMS","PRENOMS","sexe","NOMS","PRENOMS","sexe","NOMS","PRENOMS","sexe","NOMS","PRENOMS","sexe","NOMS","PRENOMS","sexe","NOMS","PRENOMS","sexe","NOMS","PRENOMS","sexe","NOMS","PRENOMS","sexe","NOMS","PRENOMS","sexe"]
[1,"SAHLI","Abdelbasset","g","MAZIZ","Abdelwahid","g","KAMBABA","Bertile","f","AKARI","Abir","f","MARTINEZ","Camille","f","ALI ASSOUMANE","Amir","g",null,"Alexandre","g"]
[2,"DZANANOVIC","Alen","g","SAHLI","Ali","g","AGGOUNE","Chirine","f","SANI","Adama","g","SAULNIER","Emilie","f","MHADJI","Badrane","g",null,"Alexis F.","g"]
[3,"UGHANEM","Bilal","g","SAIDI","Fares","g","BERTIKIZI","Isma","f","MEMETI","Elfeta","f","TAGHNA","Gehna","f","BIRI","Emre","g",null,"Anthony","g"]
[4,"DUMENIL NGOULOU","Christian","g","DJAMEN MBEUFET","Gilles","g","HAMIDI","Jihenne","f","OUSSENI","Faiz","g","MRKALJ","Ismeta","f","MELAAB","Hedi","g",null,"Christian","g"]
[5,"ERBASLI","Halis","g","BOURIALA","Haykel","g","N'YACKHATE","Kandji","f","ROUANI","Fares","g","ALI","Janette","f","OMRANI","Mansour","g",null,"Claudine","f"]
[6,"CISSE","Laurent","g","BOUHANNA","Mohamed","g","BERKAT","Kenza","f","MEDDOUR","Hocine","g","NEKA","Jenna","f","LAKEHAL","Mounia","g",null,"Emmanuel","g"]
[7,"HOAREAU","Mickael","g","CAMARA","Mohamed","g","CHENDAR","Khayra","f","YAHYAOUI","Imen","f","ALMEIDA PINTO","Juliana","f","YORULMAZ","Mustafa","g",null,"vivien","g"]
[8,"REMADI","Salim","g","TOUIZRAT","Mohamed","g","ALLACHE","Liddia","f","ROS","Jenny","f","TOUTOUTE","Kelly","f","PEOU","Sombate rothanak","g",null,"Fred","g"]
[9,"NONGA KOUM","Willy","g","CAO","Phi tram","g","HAREK","Louiza","f","RIVIERE","Jennyline","f","BOUCAUD","Laura","f","BOUHAFS","Wail","g",null,"Gwen","g"]
[10,null,null,null,"ARGOUBI","Ryad","g","BOUDOUHA","Lydia","f","BIREM","Kévin","g","LICHA","Lea","f","RICHARD","Yohann","g",null,"Julien","g"]
[11,null,null,null,"GJOKA","Xhorxh","g","ADAMYAN","Margarita","f","MALARD","Melvine","f","BOUKARRA","Linda","f","MMADI","Zayd","g",null,"Laurent","g"]
[12,null,null,null,"FARHAT","Yassine","g","EZZINE","Mouna","f","GHEZALA","Nesrine","f","GUEFFAF","Maïssane","f",null,null,null,null,"Marc-Antoine","g"]
[13,null,null,null,null,null,null,"BRISSAUD","Nadia","f","KILUNGILA","Ruth","f","BEN HASSINE","Mélinda","f",null,null,null,null,"Marco","g"]
[14,null,null,null,null,null,null,"YOUSSOUF","Naila","f","LORION","Sabrina","f","KILIC","Meltem","f",null,null,null,null,"Morgane","f"]
[15,null,null,null,null,null,null,"TOUMI","Naoures","f","DOMINGOS MANUEL","Sandra","f","ATHLAN","Morgane","f",null,null,null,null,"Nathalie","f"]
[16,null,null,null,null,null,null,"DE CASTRO GUIMARES","Nessrine","f","YACOUBI","Siwar","f","IMAKO-BAFINDA","Naomie","f",null,null,null,null,"Nico Afriat","g"]
[17,null,null,null,null,null,null,"VIEIRA","Noemie","f","EROGLU","Suleyman","g","BOUTALEB","Nejma","f",null,null,null,null,"Nico Podu","g"]
[18,null,null,null,null,null,null,"BOUTAR","Sarinece","f",null,null,null,"BENABED","Nore-ymen","f",null,null,null,null,"Olivier","g"]
[19,null,null,null,null,null,null,"AGAGUENA","Sofia","f",null,null,null,"BERKAT","Rachda","f",null,null,null,null,"Pascal","g"]
[20,null,null,null,null,null,null,"TABET-BOUZERARI","Thais sirine","f",null,null,null,"ANGE","Sauraya","f",null,null,null,null,"Phil G.","g"]
[21,null,null,null,null,null,null,"THUILLIER","Victoria","f",null,null,null,"BIGAT","Sibel","f",null,null,null,null,"Philippe G.","g"]
[22,null,null,null,null,null,null,"ZOGHLAMI","Wiem","f",null,null,null,"BENZEGNOUN","Wacilla","f",null,null,null,null,"Stef","g"]
[23,null,null,null,null,null,null,"HABI","Ynès","f",null,null,null,"CHARRADI","Yosr","f",null,null,null,null,"Thomas","g"]
[24,null,null,null,null,null,null,"MENACERI","Zineb","f",null,null,null,"ONAY","Zekiye","f",null,null,null,null,"Tristan","g"]
[25,null,null,null,null,null,null,null,null,null,null,null,null,null,null,null,null,null,null,null,"eric","g"]
[26,null,null,null,null,null,null,null,null,null,null,null,null,null,null,null,null,null,null,null,"Xav","g"]
[27,null,null,null,null,null,null,null,null,null,null,null,null,null,null,null,null,null,null,null,"CC","f"]
[28,null,null,null,null,null,null,null,null,null,null,null,null,null,null,null,null,null,null,null,"Barby","f"]
[29,null,null,null,null,null,null,null,null,null,null,null,null,null,null,null,null,null,null,null,"Jo","g"]
[30,null,null,null,null,null,null,null,null,null,null,null,null,null,null,null,null,null,null,null,"Nico T.","g"]
[31,null,null,null,null,null,null,null,null,null,null,null,null,null,null,null,null,null,null,null,"Steven","g"]
[32,null,null,null,null,null,null,null,null,null,null,null,null,null,null,null,null,null,null,null,"Cyrilinou","g"]
[33,null,null,null,null,null,null,null,null,null,null,null,null,null,null,null,null,null,null,null,"Mick","g"]
[34]
[35]
[36]