{"text_format":"1","workbook":"xlsx","n_sheets":4,"sheets":["ACCUEIL","TPSTOUR","DEBUT","APPEL"],"not_rendered":{"charts":0,"images":5,"macros":1,"external_links":0,"defined_names":9,"comments":0,"pivot_tables":0},"unopened":[],"bounds":{"document_bytes":16777216,"sheet_cells":100000,"rows_first":2000,"rows_last":500,"rows_between":2000,"halvings":0,"cell_chars":16384,"cell_head_chars":4096},"cells_cut":0,"cells_raw":0,"read":"whole","date_system":"1900"}

{"sheet":"ACCUEIL","index":0,"n_rows":16,"n_cols":3,"rows_kept":16,"cut":false,"hidden":false,"merged":[]}
[]
[]
[]
[]
[]
[]
[]
[]
[]
[]
[]
[]
[]
[]
[]
[null,null,"CHRONO TOURS"]

{"sheet":"TPSTOUR","index":1,"n_rows":56,"n_cols":55,"rows_kept":56,"cut":false,"hidden":false,"merged":[[36,1,37,47],[35,1,35,47],[1,1,1,5],[1,14,1,16],[1,20,1,22],[1,26,1,28],[1,32,1,34],[31,1,31,11],[31,13,31,23],[31,25,31,35],[31,37,31,47],[32,1,32,11],[32,13,32,23],[32,25,32,35],[32,37,32,47]]}
[]
[null,"08:40:44",null,null,null,null,null,null,null,null,null,null,null,"DUREE","1'",null,null,{"$f":"VLOOKUP(O2,DEBUT!D5:E99,2,FALSE)","v":60},null,"PISTE",50,null,null,"m",null,"PLOTS",20,null,null,"m",null,"Point/\n100m",0.75,null,null,"pts",null,null,null,null,null,null,null,null,null,null,null,null,null,null,null,null,"Classe"]
[null,1,null,2,null,3,4,4,5,5,6,6,null,7,null,8,9,9,10,10,12,11,null,12,null,13,16,14,17,15,18,16,null,17,null,18,22,19,23,20,24,21,null,22,null,23,28,24,null,null,null,null,"STAGE"]
["Lancer un chrono en parallèle",null,null,null,null,null,null,null,null,null,null,null,null,null,null,null,null,null,null,null,null,null,null,null,null,null,null,null,null,null,null,null,null,null,null,null,null,null,null,null,null,null,null,null,null,null,null,null,null,null,null,null,null,null,"Faire Ctrl+S après avoir renommer formes"]
["TEMPS PASSAGE",null,null,null,null,null,null,null,null,null,null,null,null,null,null,null,null,null,null,null,null,null,null,null,null,null,null,null,null,null,null,null,null,null,null,null,null,null,null,null,null,null,null,null,null,null,null,null,null,null,null,1,{"$f":"IF($BA$3=APPEL!$B$1,APPEL!C3,IF($BA$3=APPEL!$E$1,APPEL!F3,IF($BA$3=APPEL!$H$1,APPEL!I3,IF($BA$3=APPEL!$K$1,APPEL!L3,IF($BA$3=APPEL!$N$1,APPEL!O4,IF($BA$3=APPEL!$Q$1,APPEL!R3,IF($BA$3=APPEL!$T$1,APPEL!U3,IF($BA$3=APPEL!$W$1,APPEL!X3,IF($BA$3=APPEL!$Z$1,APPEL!AA3)))))))))","v":"Alexandre"}]
["TOUR 1","00:00:14",null,"00:00:24",null,"00:00:26",null,null,null,null,null,null,null,null,null,null,null,null,null,null,null,null,null,null,null,null,null,null,null,null,null,null,null,null,null,null,null,null,null,null,null,null,null,null,null,null,null,null,null,"TOUR 1",null,2,{"$f":"IF($BA$3=APPEL!$B$1,APPEL!C4,IF($BA$3=APPEL!$E$1,APPEL!F4,IF($BA$3=APPEL!$H$1,APPEL!I4,IF($BA$3=APPEL!$K$1,APPEL!L4,IF($BA$3=APPEL!$N$1,APPEL!O5,IF($BA$3=APPEL!$Q$1,APPEL!R4,IF($BA$3=APPEL!$T$1,APPEL!U4,IF($BA$3=APPEL!$W$1,APPEL!X4,IF($BA$3=APPEL!$Z$1,APPEL!AA4)))))))))","v":"Alexis F."}]
["TOUR 2",null,null,null,null,"00:00:30",null,null,null,null,null,null,null,null,null,null,null,null,null,null,null,null,null,null,null,null,null,null,null,null,null,null,null,null,null,null,null,null,null,null,null,null,null,null,null,null,null,null,null,"TOUR 2",null,3,{"$f":"IF($BA$3=APPEL!$B$1,APPEL!C5,IF($BA$3=APPEL!$E$1,APPEL!F5,IF($BA$3=APPEL!$H$1,APPEL!I5,IF($BA$3=APPEL!$K$1,APPEL!L5,IF($BA$3=APPEL!$N$1,APPEL!O6,IF($BA$3=APPEL!$Q$1,APPEL!R5,IF($BA$3=APPEL!$T$1,APPEL!U5,IF($BA$3=APPEL!$W$1,APPEL!X5,IF($BA$3=APPEL!$Z$1,APPEL!AA5)))))))))","v":"Anthony"}]
["TOUR 3",null,null,null,null,"00:00:31",null,null,null,null,null,null,null,null,null,null,null,null,null,null,null,null,null,null,null,null,null,null,null,null,null,null,null,null,null,null,null,null,null,null,null,null,null,null,null,null,null,null,null,"TOUR 3",null,4,{"$f":"IF($BA$3=APPEL!$B$1,APPEL!C6,IF($BA$3=APPEL!$E$1,APPEL!F6,IF($BA$3=APPEL!$H$1,APPEL!I6,IF($BA$3=APPEL!$K$1,APPEL!L6,IF($BA$3=APPEL!$N$1,APPEL!O7,IF($BA$3=APPEL!$Q$1,APPEL!R6,IF($BA$3=APPEL!$T$1,APPEL!U6,IF($BA$3=APPEL!$W$1,APPEL!X6,IF($BA$3=APPEL!$Z$1,APPEL!AA6)))))))))","v":"Christian"}]
["TOUR 4",null,null,null,null,null,null,null,null,null,null,null,null,null,null,null,null,null,null,null,null,null,null,null,null,null,null,null,null,null,null,null,null,null,null,null,null,null,null,null,null,null,null,null,null,null,null,null,null,"TOUR 4",null,5,{"$f":"IF($BA$3=APPEL!$B$1,APPEL!C7,IF($BA$3=APPEL!$E$1,APPEL!F7,IF($BA$3=APPEL!$H$1,APPEL!I7,IF($BA$3=APPEL!$K$1,APPEL!L7,IF($BA$3=APPEL!$N$1,APPEL!O8,IF($BA$3=APPEL!$Q$1,APPEL!R7,IF($BA$3=APPEL!$T$1,APPEL!U7,IF($BA$3=APPEL!$W$1,APPEL!X7,IF($BA$3=APPEL!$Z$1,APPEL!AA7)))))))))","v":"Claudine"}]
["TOUR 5",null,null,null,null,null,null,null,null,null,null,null,null,null,null,null,null,null,null,null,null,null,null,null,null,null,null,null,null,null,null,null,null,null,null,null,null,null,null,null,null,null,null,null,null,null,null,null,null,"TOUR 5",null,6,{"$f":"IF($BA$3=APPEL!$B$1,APPEL!C8,IF($BA$3=APPEL!$E$1,APPEL!F8,IF($BA$3=APPEL!$H$1,APPEL!I8,IF($BA$3=APPEL!$K$1,APPEL!L8,IF($BA$3=APPEL!$N$1,APPEL!O9,IF($BA$3=APPEL!$Q$1,APPEL!R8,IF($BA$3=APPEL!$T$1,APPEL!U8,IF($BA$3=APPEL!$W$1,APPEL!X8,IF($BA$3=APPEL!$Z$1,APPEL!AA8)))))))))","v":"Emmanuel"}]
["TOUR 6",null,null,null,null,null,null,null,null,null,null,null,null,null,null,null,null,null,null,null,null,null,null,null,null,null,null,null,null,null,null,null,null,null,null,null,null,null,null,null,null,null,null,null,null,null,null,null,null,"TOUR 6",null,7,{"$f":"IF($BA$3=APPEL!$B$1,APPEL!C9,IF($BA$3=APPEL!$E$1,APPEL!F9,IF($BA$3=APPEL!$H$1,APPEL!I9,IF($BA$3=APPEL!$K$1,APPEL!L9,IF($BA$3=APPEL!$N$1,APPEL!O10,IF($BA$3=APPEL!$Q$1,APPEL!R9,IF($BA$3=APPEL!$T$1,APPEL!U9,IF($BA$3=APPEL!$W$1,APPEL!X9,IF($BA$3=APPEL!$Z$1,APPEL!AA9)))))))))","v":"vivien"}]
["TOUR 7",null,null,null,null,null,null,null,null,null,null,null,null,null,null,null,null,null,null,null,null,null,null,null,null,null,null,null,null,null,null,null,null,null,null,null,null,null,null,null,null,null,null,null,null,null,null,null,null,"TOUR 7",null,8,{"$f":"IF($BA$3=APPEL!$B$1,APPEL!C10,IF($BA$3=APPEL!$E$1,APPEL!F10,IF($BA$3=APPEL!$H$1,APPEL!I10,IF($BA$3=APPEL!$K$1,APPEL!L10,IF($BA$3=APPEL!$N$1,APPEL!O11,IF($BA$3=APPEL!$Q$1,APPEL!R10,IF($BA$3=APPEL!$T$1,APPEL!U10,IF($BA$3=APPEL!$W$1,APPEL!X10,IF($BA$3=APPEL!$Z$1,APPEL!AA10)))))))))","v":"Fred"}]
["TOUR 8",null,null,null,null,null,null,null,null,null,null,null,null,null,null,null,null,null,null,null,null,null,null,null,null,null,null,null,null,null,null,null,null,null,null,null,null,null,null,null,null,null,null,null,null,null,null,null,null,"TOUR 8",null,9,{"$f":"IF($BA$3=APPEL!$B$1,APPEL!C11,IF($BA$3=APPEL!$E$1,APPEL!F11,IF($BA$3=APPEL!$H$1,APPEL!I11,IF($BA$3=APPEL!$K$1,APPEL!L11,IF($BA$3=APPEL!$N$1,APPEL!O12,IF($BA$3=APPEL!$Q$1,APPEL!R11,IF($BA$3=APPEL!$T$1,APPEL!U11,IF($BA$3=APPEL!$W$1,APPEL!X11,IF($BA$3=APPEL!$Z$1,APPEL!AA11)))))))))","v":"Gwen"}]
["TOUR 9",null,null,null,null,null,null,null,null,null,null,null,null,null,null,null,null,null,null,null,null,null,null,null,null,null,null,null,null,null,null,null,null,null,null,null,null,null,null,null,null,null,null,null,null,null,null,null,null,"TOUR 9",null,10,{"$f":"IF($BA$3=APPEL!$B$1,APPEL!C12,IF($BA$3=APPEL!$E$1,APPEL!F12,IF($BA$3=APPEL!$H$1,APPEL!I12,IF($BA$3=APPEL!$K$1,APPEL!L12,IF($BA$3=APPEL!$N$1,APPEL!O13,IF($BA$3=APPEL!$Q$1,APPEL!R12,IF($BA$3=APPEL!$T$1,APPEL!U12,IF($BA$3=APPEL!$W$1,APPEL!X12,IF($BA$3=APPEL!$Z$1,APPEL!AA12)))))))))","v":"Julien"}]
["TOUR 10",null,null,null,null,null,null,null,null,null,null,null,null,null,null,null,null,null,null,null,null,null,null,null,null,null,null,null,null,null,null,null,null,null,null,null,null,null,null,null,null,null,null,null,null,null,null,null,null,"TOUR 10",null,11,{"$f":"IF($BA$3=APPEL!$B$1,APPEL!C13,IF($BA$3=APPEL!$E$1,APPEL!F13,IF($BA$3=APPEL!$H$1,APPEL!I13,IF($BA$3=APPEL!$K$1,APPEL!L13,IF($BA$3=APPEL!$N$1,APPEL!O14,IF($BA$3=APPEL!$Q$1,APPEL!R13,IF($BA$3=APPEL!$T$1,APPEL!U13,IF($BA$3=APPEL!$W$1,APPEL!X13,IF($BA$3=APPEL!$Z$1,APPEL!AA13)))))))))","v":"Laurent"}]
["TOUR 11",null,null,null,null,null,null,null,null,null,null,null,null,null,null,null,null,null,null,null,null,null,null,null,null,null,null,null,null,null,null,null,null,null,null,null,null,null,null,null,null,null,null,null,null,null,null,null,null,"TOUR 11",null,12,{"$f":"IF($BA$3=APPEL!$B$1,APPEL!C14,IF($BA$3=APPEL!$E$1,APPEL!F14,IF($BA$3=APPEL!$H$1,APPEL!I14,IF($BA$3=APPEL!$K$1,APPEL!L14,IF($BA$3=APPEL!$N$1,APPEL!O15,IF($BA$3=APPEL!$Q$1,APPEL!R14,IF($BA$3=APPEL!$T$1,APPEL!U14,IF($BA$3=APPEL!$W$1,APPEL!X14,IF($BA$3=APPEL!$Z$1,APPEL!AA14)))))))))","v":"Marc-Antoine"}]
["TOUR 12",null,null,null,null,null,null,null,null,null,null,null,null,null,null,null,null,null,null,null,null,null,null,null,null,null,null,null,null,null,null,null,null,null,null,null,null,null,null,null,null,null,null,null,null,null,null,null,null,"TOUR 12",null,13,{"$f":"IF($BA$3=APPEL!$B$1,APPEL!C15,IF($BA$3=APPEL!$E$1,APPEL!F15,IF($BA$3=APPEL!$H$1,APPEL!I15,IF($BA$3=APPEL!$K$1,APPEL!L15,IF($BA$3=APPEL!$N$1,APPEL!O16,IF($BA$3=APPEL!$Q$1,APPEL!R15,IF($BA$3=APPEL!$T$1,APPEL!U15,IF($BA$3=APPEL!$W$1,APPEL!X15,IF($BA$3=APPEL!$Z$1,APPEL!AA15)))))))))","v":"Marco"}]
["TOUR 13",null,null,null,null,null,null,null,null,null,null,null,null,null,null,null,null,null,null,null,null,null,null,null,null,null,null,null,null,null,null,null,null,null,null,null,null,null,null,null,null,null,null,null,null,null,null,null,null,"TOUR 13",null,14,{"$f":"IF($BA$3=APPEL!$B$1,APPEL!C16,IF($BA$3=APPEL!$E$1,APPEL!F16,IF($BA$3=APPEL!$H$1,APPEL!I16,IF($BA$3=APPEL!$K$1,APPEL!L16,IF($BA$3=APPEL!$N$1,APPEL!O17,IF($BA$3=APPEL!$Q$1,APPEL!R16,IF($BA$3=APPEL!$T$1,APPEL!U16,IF($BA$3=APPEL!$W$1,APPEL!X16,IF($BA$3=APPEL!$Z$1,APPEL!AA16)))))))))","v":"Morgane"}]
["TOUR 14",null,null,null,null,null,null,null,null,null,null,null,null,null,null,null,null,null,null,null,null,null,null,null,null,null,null,null,null,null,null,null,null,null,null,null,null,null,null,null,null,null,null,null,null,null,null,null,null,"TOUR 14",null,15,{"$f":"IF($BA$3=APPEL!$B$1,APPEL!C17,IF($BA$3=APPEL!$E$1,APPEL!F17,IF($BA$3=APPEL!$H$1,APPEL!I17,IF($BA$3=APPEL!$K$1,APPEL!L17,IF($BA$3=APPEL!$N$1,APPEL!O18,IF($BA$3=APPEL!$Q$1,APPEL!R17,IF($BA$3=APPEL!$T$1,APPEL!U17,IF($BA$3=APPEL!$W$1,APPEL!X17,IF($BA$3=APPEL!$Z$1,APPEL!AA17)))))))))","v":"Nathalie"}]
["TOUR 15",null,null,null,null,null,null,null,null,null,null,null,null,null,null,null,null,null,null,null,null,null,null,null,null,null,null,null,null,null,null,null,null,null,null,null,null,null,null,null,null,null,null,null,null,null,null,null,null,"TOUR 15",null,16,{"$f":"IF($BA$3=APPEL!$B$1,APPEL!C18,IF($BA$3=APPEL!$E$1,APPEL!F18,IF($BA$3=APPEL!$H$1,APPEL!I18,IF($BA$3=APPEL!$K$1,APPEL!L18,IF($BA$3=APPEL!$N$1,APPEL!O19,IF($BA$3=APPEL!$Q$1,APPEL!R18,IF($BA$3=APPEL!$T$1,APPEL!U18,IF($BA$3=APPEL!$W$1,APPEL!X18,IF($BA$3=APPEL!$Z$1,APPEL!AA18)))))))))","v":"Nico Afriat"}]
[null,null,null,null,null,null,null,null,null,null,null,null,null,null,null,null,null,null,null,null,null,null,null,null,null,null,null,null,null,null,null,null,null,null,null,null,null,null,null,null,null,null,null,null,null,null,null,null,null,"MAX",null,17,{"$f":"IF($BA$3=APPEL!$B$1,APPEL!C19,IF($BA$3=APPEL!$E$1,APPEL!F19,IF($BA$3=APPEL!$H$1,APPEL!I19,IF($BA$3=APPEL!$K$1,APPEL!L19,IF($BA$3=APPEL!$N$1,APPEL!O20,IF($BA$3=APPEL!$Q$1,APPEL!R19,IF($BA$3=APPEL!$T$1,APPEL!U19,IF($BA$3=APPEL!$W$1,APPEL!X19,IF($BA$3=APPEL!$Z$1,APPEL!AA19)))))))))","v":"Nico Podu"}]
["TOURS",{"$f":"(SUMPRODUCT(N(ISNUMBER(B6:B20))))","v":1},{"$f":"(SUMPRODUCT(N(ISNUMBER(C6:C20))))","v":0},1,0,3,0,0,0,0,0,0,0,0,0,0,0,0,0,0,0,0,0,0,0,0,0,0,0,0,0,0,0,0,0,0,0,0,0,0,0,0,0,0,0,0,0,0,null,{"$f":"SUM(B22:AV22)","v":5},"TOURS",18,{"$f":"IF($BA$3=APPEL!$B$1,APPEL!C20,IF($BA$3=APPEL!$E$1,APPEL!F20,IF($BA$3=APPEL!$H$1,APPEL!I20,IF($BA$3=APPEL!$K$1,APPEL!L20,IF($BA$3=APPEL!$N$1,APPEL!O21,IF($BA$3=APPEL!$Q$1,APPEL!R20,IF($BA$3=APPEL!$T$1,APPEL!U20,IF($BA$3=APPEL!$W$1,APPEL!X20,IF($BA$3=APPEL!$Z$1,APPEL!AA20)))))))))","v":"Olivier"}]
["PLOTS SUP",null,null,null,null,null,null,null,null,null,null,null,null,null,null,null,null,null,null,null,null,null,null,null,null,null,null,null,null,null,null,null,null,null,null,null,null,null,null,null,null,null,null,null,null,null,null,null,null,null,"PLOTS SUP",19,{"$f":"IF($BA$3=APPEL!$B$1,APPEL!C21,IF($BA$3=APPEL!$E$1,APPEL!F21,IF($BA$3=APPEL!$H$1,APPEL!I21,IF($BA$3=APPEL!$K$1,APPEL!L21,IF($BA$3=APPEL!$N$1,APPEL!O22,IF($BA$3=APPEL!$Q$1,APPEL!R21,IF($BA$3=APPEL!$T$1,APPEL!U21,IF($BA$3=APPEL!$W$1,APPEL!X21,IF($BA$3=APPEL!$Z$1,APPEL!AA21)))))))))","v":"Pascal"}]
["DISTANCE",{"$f":"B22*$U$2+B23*$AA$2","v":50},{"$f":"C22*$U$2","v":0},50,0,150,0,0,0,0,0,0,0,0,0,0,0,0,0,0,0,0,0,0,0,0,0,0,0,0,0,0,0,0,0,0,0,0,0,0,0,0,0,0,0,0,0,0,0,{"$f":"SUM(B24:AV24)","v":250},"DISTANCE",20,{"$f":"IF($BA$3=APPEL!$B$1,APPEL!C22,IF($BA$3=APPEL!$E$1,APPEL!F22,IF($BA$3=APPEL!$H$1,APPEL!I22,IF($BA$3=APPEL!$K$1,APPEL!L22,IF($BA$3=APPEL!$N$1,APPEL!O23,IF($BA$3=APPEL!$Q$1,APPEL!R22,IF($BA$3=APPEL!$T$1,APPEL!U22,IF($BA$3=APPEL!$W$1,APPEL!X22,IF($BA$3=APPEL!$Z$1,APPEL!AA22)))))))))","v":"Phil G."}]
["Vitesse moyenne (Km/h)",{"$f":"B24/$R$2*3.6","v":3},{"$f":"C24/$R$2*3.6","v":0},3,null,9,null,0,null,0,null,0,null,0,null,0,null,0,null,0,null,0,null,0,null,0,null,0,null,0,null,0,null,0,null,0,null,0,null,0,null,0,null,0,null,0,null,0,null,{"$f":"LARGE(B25:AV25,1)","v":9},"Vitesse moyenne",21,{"$f":"IF($BA$3=APPEL!$B$1,APPEL!C23,IF($BA$3=APPEL!$E$1,APPEL!F23,IF($BA$3=APPEL!$H$1,APPEL!I23,IF($BA$3=APPEL!$K$1,APPEL!L23,IF($BA$3=APPEL!$N$1,APPEL!O24,IF($BA$3=APPEL!$Q$1,APPEL!R23,IF($BA$3=APPEL!$T$1,APPEL!U23,IF($BA$3=APPEL!$W$1,APPEL!X23,IF($BA$3=APPEL!$Z$1,APPEL!AA23)))))))))","v":"Philippe G."}]
["Arrêts",null,null,null,null,null,null,null,null,null,null,null,null,null,null,null,null,null,null,null,null,null,null,null,null,null,null,null,null,null,null,null,null,null,null,null,null,null,null,null,null,null,null,null,null,null,null,null,null,{"$f":"SUM(B26:AV26)","v":0},"Arrêts",22,{"$f":"IF($BA$3=APPEL!$B$1,APPEL!C24,IF($BA$3=APPEL!$E$1,APPEL!F24,IF($BA$3=APPEL!$H$1,APPEL!I24,IF($BA$3=APPEL!$K$1,APPEL!L24,IF($BA$3=APPEL!$N$1,APPEL!O25,IF($BA$3=APPEL!$Q$1,APPEL!R24,IF($BA$3=APPEL!$T$1,APPEL!U24,IF($BA$3=APPEL!$W$1,APPEL!X24,IF($BA$3=APPEL!$Z$1,APPEL!AA24)))))))))","v":"Stef"}]
[null,null,null,null,null,null,null,null,null,null,null,null,null,null,null,null,null,null,null,null,null,null,null,null,null,null,null,null,null,null,null,null,null,null,null,null,null,null,null,null,null,null,null,null,null,null,null,null,null,null,null,23,{"$f":"IF($BA$3=APPEL!$B$1,APPEL!C25,IF($BA$3=APPEL!$E$1,APPEL!F25,IF($BA$3=APPEL!$H$1,APPEL!I25,IF($BA$3=APPEL!$K$1,APPEL!L25,IF($BA$3=APPEL!$N$1,APPEL!O26,IF($BA$3=APPEL!$Q$1,APPEL!R25,IF($BA$3=APPEL!$T$1,APPEL!U25,IF($BA$3=APPEL!$W$1,APPEL!X25,IF($BA$3=APPEL!$Z$1,APPEL!AA25)))))))))","v":"Thomas"}]
[null,null,null,null,null,null,null,null,null,null,null,null,null,null,null,null,null,null,null,null,null,null,null,null,null,null,null,null,null,null,null,null,null,null,null,null,null,null,null,null,null,null,null,null,null,null,null,null,null,null,null,24,{"$f":"IF($BA$3=APPEL!$B$1,APPEL!C26,IF($BA$3=APPEL!$E$1,APPEL!F26,IF($BA$3=APPEL!$H$1,APPEL!I26,IF($BA$3=APPEL!$K$1,APPEL!L26,IF($BA$3=APPEL!$N$1,APPEL!O27,IF($BA$3=APPEL!$Q$1,APPEL!R26,IF($BA$3=APPEL!$T$1,APPEL!U26,IF($BA$3=APPEL!$W$1,APPEL!X26,IF($BA$3=APPEL!$Z$1,APPEL!AA26)))))))))","v":"Tristan"}]
[null,null,null,null,null,null,null,null,null,null,null,null,null,null,null,null,null,null,null,null,null,null,null,null,null,null,null,null,null,null,null,null,null,null,null,null,null,null,null,null,null,null,null,null,null,null,null,null,null,null,null,25]
[null,null,null,null,null,null,null,null,null,null,null,null,null,null,null,null,null,null,null,null,null,null,null,null,null,null,null,null,null,null,null,null,null,null,null,null,null,null,null,null,null,null,null,null,null,null,null,null,null,null,null,26]
{"$rows_left_out":27}
{"sheet":"DEBUT","index":2,"n_rows":364,"n_cols":11,"rows_kept":364,"cut":false,"hidden":false,"merged":[]}
[]
[]
[]
[null,"TEMPS TOUR",null,"DUREE","equivalent secondes","LONGUEUR PISTE","DISTANCE PLOTS","PTS /100m","Plots supp",null,"Arrêts"]
[null,null,null,"15\"",15,50,10,0.1]
[null,"00:00:10",null,"30\"",30,100,15,0.2,0,null,1]
[null,"01:00:11",null,"45\"",45,150,20,0.3,1,null,2]
[null,"02:00:12",null,"1'",60,200,25,0.4,2,null,3]
[null,"03:00:13",null,"1'30",90,250,50,0.5,3,null,4]
[null,"04:00:14",null,"2'",120,300,100,0.6,4,null,5]
[null,"05:00:15",null,"3'",180,350,null,0.7,5,null,6]
[null,"06:00:16",null,"5'",300,400,null,0.8,6,null,7]
[null,"07:00:17",null,"6'",360,450,null,0.9,7,null,8]
[null,"08:00:18",null,"8'",480,500,null,1,8,null,9]
[null,"09:00:19",null,"10'",600,null,null,1.1000000000000001,9,null,10]
[null,"10:00:20",null,"12'",720,null,null,1.2,10,null,11]
[null,"11:00:21",null,"15'",900,null,null,1.3,null,null,12]
[null,"12:00:22",null,"18'",1080,null,null,1.4,null,null,13]
[null,"13:00:23",null,"20'",1200,null,null,1.5,null,null,14]
[null,"14:00:24",null,"25'",1500,null,null,1.6,null,null,15]
[null,"15:00:25",null,"30'",1800,null,null,1.7,null,null,16]
[null,"16:00:26",null,"35'",2100,null,null,1.8,null,null,17]
[null,"17:00:27",null,"40'",2400,null,null,1.9,null,null,18]
[null,"18:00:28",null,null,null,null,null,2,null,null,19]
[null,"19:00:29",null,null,null,null,null,2.1,null,null,20]
[null,"20:00:30",null,null,null,null,null,2.2000000000000002,null,null,21]
[null,"21:00:31",null,null,null,null,null,2.2999999999999998,null,null,22]
[null,"22:00:32",null,null,null,null,null,2.4,null,null,23]
[null,"23:00:33",null,null,null,null,null,2.5,null,null,24]
[null,1.00039351851852,null,null,null,null,null,2.6]
{"$rows_left_out":335}
{"sheet":"APPEL","index":3,"n_rows":38,"n_cols":28,"rows_kept":38,"cut":false,"hidden":false,"merged":[[0,19,0,20],[0,22,0,23],[0,25,0,26],[0,1,0,2],[0,4,0,5],[0,7,0,8],[0,10,0,11],[0,13,0,14],[0,16,0,17]]}
[null,"TELEC",null,null,"1PROE",null,null,"TGA",null,null,"1EVS",null,null,"1GA",null,null,"1TU",null,null,"STAGE"]
[null,"NOMS","PRENOMS","sexe","NOMS","PRENOMS","sexe","NOMS","PRENOMS","sexe","NOMS","PRENOMS","sexe","NOMS","PRENOMS","sexe","NOMS","PRENOMS","sexe","NOMS","PRENOMS","sexe","NOMS","PRENOMS","sexe","NOMS","PRENOMS","sexe"]
[1,"SAHLI","Abdelbasset","g","MAZIZ","Abdelwahid","g","KAMBABA","Bertile","f","AKARI","Abir","f","MARTINEZ","Camille","f","ALI ASSOUMANE","Amir","g",null,"Alexandre","g"]
[2,"DZANANOVIC","Alen","g","SAHLI","Ali","g","AGGOUNE","Chirine","f","SANI","Adama","g","SAULNIER","Emilie","f","MHADJI","Badrane","g",null,"Alexis F.","g"]
[3,"UGHANEM","Bilal","g","SAIDI","Fares","g","BERTIKIZI","Isma","f","MEMETI","Elfeta","f","TAGHNA","Gehna","f","BIRI","Emre","g",null,"Anthony","g"]
[4,"DUMENIL NGOULOU","Christian","g","DJAMEN MBEUFET","Gilles","g","HAMIDI","Jihenne","f","OUSSENI","Faiz","g","MRKALJ","Ismeta","f","MELAAB","Hedi","g",null,"Christian","g"]
[5,"ERBASLI","Halis","g","BOURIALA","Haykel","g","N'YACKHATE","Kandji","f","ROUANI","Fares","g","ALI","Janette","f","OMRANI","Mansour","g",null,"Claudine","f"]
[6,"CISSE","Laurent","g","BOUHANNA","Mohamed","g","BERKAT","Kenza","f","MEDDOUR","Hocine","g","NEKA","Jenna","f","LAKEHAL","Mounia","g",null,"Emmanuel","g"]
[7,"HOAREAU","Mickael","g","CAMARA","Mohamed","g","CHENDAR","Khayra","f","YAHYAOUI","Imen","f","ALMEIDA PINTO","Juliana","f","YORULMAZ","Mustafa","g",null,"vivien","g"]
[8,"REMADI","Salim","g","TOUIZRAT","Mohamed","g","ALLACHE","Liddia","f","ROS","Jenny","f","TOUTOUTE","Kelly","f","PEOU","Sombate rothanak","g",null,"Fred","g"]
[9,"NONGA KOUM","Willy","g","CAO","Phi tram","g","HAREK","Louiza","f","RIVIERE","Jennyline","f","BOUCAUD","Laura","f","BOUHAFS","Wail","g",null,"Gwen","g"]
[10,null,null,null,"ARGOUBI","Ryad","g","BOUDOUHA","Lydia","f","BIREM","Kévin","g","LICHA","Lea","f","RICHARD","Yohann","g",null,"Julien","g"]
[11,null,null,null,"GJOKA","Xhorxh","g","ADAMYAN","Margarita","f","MALARD","Melvine","f","BOUKARRA","Linda","f","MMADI","Zayd","g",null,"Laurent","g"]
[12,null,null,null,"FARHAT","Yassine","g","EZZINE","Mouna","f","GHEZALA","Nesrine","f","GUEFFAF","Maïssane","f",null,null,null,null,"Marc-Antoine","g"]
[13,null,null,null,null,null,null,"BRISSAUD","Nadia","f","KILUNGILA","Ruth","f","BEN HASSINE","Mélinda","f",null,null,null,null,"Marco","g"]
[14,null,null,null,null,null,null,"YOUSSOUF","Naila","f","LORION","Sabrina","f","KILIC","Meltem","f",null,null,null,null,"Morgane","f"]
[15,null,null,null,null,null,null,"TOUMI","Naoures","f","DOMINGOS MANUEL","Sandra","f","ATHLAN","Morgane","f",null,null,null,null,"Nathalie","f"]
[16,null,null,null,null,null,null,"DE CASTRO GUIMARES","Nessrine","f","YACOUBI","Siwar","f","IMAKO-BAFINDA","Naomie","f",null,null,null,null,"Nico Afriat","g"]
[17,null,null,null,null,null,null,"VIEIRA","Noemie","f","EROGLU","Suleyman","g","BOUTALEB","Nejma","f",null,null,null,null,"Nico Podu","g"]
[18,null,null,null,null,null,null,"BOUTAR","Sarinece","f",null,null,null,"BENABED","Nore-ymen","f",null,null,null,null,"Olivier","g"]
[19,null,null,null,null,null,null,"AGAGUENA","Sofia","f",null,null,null,"BERKAT","Rachda","f",null,null,null,null,"Pascal","g"]
[20,null,null,null,null,null,null,"TABET-BOUZERARI","Thais sirine","f",null,null,null,"ANGE","Sauraya","f",null,null,null,null,"Phil G.","g"]
[21,null,null,null,null,null,null,"THUILLIER","Victoria","f",null,null,null,"BIGAT","Sibel","f",null,null,null,null,"Philippe G.","g"]
[22,null,null,null,null,null,null,"ZOGHLAMI","Wiem","f",null,null,null,"BENZEGNOUN","Wacilla","f",null,null,null,null,"Stef","g"]
[23,null,null,null,null,null,null,"HABI","Ynès","f",null,null,null,"CHARRADI","Yosr","f",null,null,null,null,"Thomas","g"]
[24,null,null,null,null,null,null,"MENACERI","Zineb","f",null,null,null,"ONAY","Zekiye","f",null,null,null,null,"Tristan","g"]
[25,null,null,null,null,null,null,null,null,null,null,null,null,null,null,null,null,null,null,null,"eric","g"]
[26,null,null,null,null,null,null,null,null,null,null,null,null,null,null,null,null,null,null,null,"Xav","g"]
[27,null,null,null,null,null,null,null,null,null,null,null,null,null,null,null,null,null,null,null,"CC","f"]
[28,null,null,null,null,null,null,null,null,null,null,null,null,null,null,null,null,null,null,null,"Barby","f"]
{"$rows_left_out":8}