{"text_format":"1","workbook":"xlsx","n_sheets":6,"sheets":["ACCUEIL","TPSTOUR","ENREGISTRER","REFERENTIELS","DEBUT","APPEL"],"not_rendered":{"charts":0,"images":8,"macros":1,"external_links":0,"defined_names":17,"comments":1,"pivot_tables":0},"unopened":[],"bounds":{"document_bytes":16777216,"sheet_cells":100000,"rows_first":2000,"rows_last":500,"rows_between":2000,"halvings":0,"cell_chars":16384,"cell_head_chars":4096},"cells_cut":0,"cells_raw":0,"read":"whole","date_system":"1900"}

{"sheet":"ACCUEIL","index":0,"n_rows":16,"n_cols":3,"rows_kept":16,"cut":false,"hidden":false,"merged":[[15,2,15,5]]}
[]
[]
[]
[]
[]
[]
[]
[]
[]
[]
[]
[]
[]
[]
[]
[null,null,"3x500"]

{"sheet":"TPSTOUR","index":1,"n_rows":64,"n_cols":64,"rows_kept":64,"cut":false,"hidden":false,"merged":[[38,31,38,35],[38,37,38,41],[38,43,38,47],[38,1,38,5],[38,7,38,11],[38,13,38,17],[38,19,38,23],[38,25,38,29],[1,13,1,47],[1,1,1,5],[15,1,15,5],[15,7,15,11],[15,13,15,17],[15,19,15,23],[15,25,15,29],[15,31,15,35],[15,37,15,41],[15,43,15,47]]}
[]
[null,null,null,null,null,null,null,null,null,null,null,null,null,null,null,null,null,null,null,null,null,null,null,null,null,null,null,null,null,null,null,null,null,null,null,null,null,null,null,null,null,null,null,null,null,null,null,null,null,null,null,null,"Classe"]
[null,1,null,2,null,3,4,4,5,5,6,6,null,7,null,8,9,9,10,10,12,11,null,12,null,13,16,14,17,15,18,16,null,17,null,18,22,19,23,20,24,21,null,22,null,23,28,24,null,null,null,null,"TELEC"]
[null,{"$f":"BA5","v":"Abdelbasset"},null,{"$f":"BA6","v":"Alen"},null,{"$f":"BA7","v":"Bilal"},null,{"$f":"BA8","v":"Christian"},null,{"$f":"BA9","v":"Halis"},null,{"$f":"BA10","v":"Laurent"},null,{"$f":"BA11","v":"Mickael"},null,{"$f":"BA12","v":"Salim"},null,{"$f":"BA13","v":"Willy"},null,{"$f":"BA14","v":"mickael"},null,{"$f":"BA15","v":"mika"},null,{"$f":"BA16","v":0},null,{"$f":"BA17","v":0},null,{"$f":"BA18","v":0},null,{"$f":"BA19","v":0},null,{"$f":"BA20","v":0},null,{"$f":"BA21","v":0},null,{"$f":"BA22","v":0},null,{"$f":"BA23","v":0},null,{"$f":"BA24","v":0},null,{"$f":"BA25","v":0},null,{"$f":"BA26","v":0},null,{"$f":"BA27","v":0},null,{"$f":"BA28","v":0},null,null,null,null,"Modifier les élèves (équipes) si besoin"]
[null,{"$f":"VLOOKUP(B4,$BA$5:$BB$28,2,FALSE)","v":"g"},0,"g",0,"g",0,"g",0,"g",0,"g",0,"g",0,"g",0,"g",0,"g",0,0,0,0,0,0,0,0,0,0,0,0,0,0,0,0,0,0,0,0,0,0,0,0,0,0,0,0,null,null,null,1,{"$f":"OFFSET(INDEX(eleves,MATCH(AZ5,numero,0),MATCH($BA$3,classe,0)),0,1)","v":"Abdelbasset"},{"$f":"OFFSET(INDEX(eleves,MATCH(AZ5,numero,0),MATCH($BA$3,classe,0)),0,2)","v":"g"}]
[250,null,null,null,null,null,null,null,null,null,null,null,null,null,null,null,null,null,null,null,null,null,null,null,null,null,null,null,null,null,null,null,null,null,null,null,null,null,null,null,null,null,null,null,null,null,null,null,null,250,null,2,"Alen","g"]
["1er 500",null,null,null,null,null,null,null,null,null,null,null,null,null,null,null,null,null,null,null,null,null,null,null,null,null,null,null,null,null,null,null,null,null,null,null,null,null,null,null,null,null,null,null,null,null,null,null,null,"1er 500",null,3,"Bilal","g"]
[250,null,null,null,null,null,null,null,null,null,null,null,null,null,null,null,null,null,null,null,null,null,null,null,null,null,null,null,null,null,null,null,null,null,null,null,null,null,null,null,null,null,null,null,null,null,null,null,null,250,null,4,"Christian","g"]
["2è 500",null,null,null,null,null,null,null,null,null,null,null,null,null,null,null,null,null,null,null,null,null,null,null,null,null,null,null,null,null,null,null,null,null,null,null,null,null,null,null,null,null,null,null,null,null,null,null,null,"2è 500",null,5,"Halis","g"]
[250,null,null,null,null,null,null,null,null,null,null,null,null,null,null,null,null,null,null,null,null,null,null,null,null,null,null,null,null,null,null,null,null,null,null,null,null,null,null,null,null,null,null,null,null,null,null,null,null,250,null,6,"Laurent","g"]
["3è 500",null,null,null,null,null,null,null,null,null,null,null,null,null,null,null,null,null,null,null,null,null,null,null,null,null,null,null,null,null,null,null,null,null,null,null,null,null,null,null,null,null,null,null,null,null,null,null,null,"3è 500",null,7,"Mickael","g"]
["3x500",{"$f":"B11+B9+B7","v":"00:00:00"},null,{"$f":"D11+D9+D7","v":"00:00:00"},null,{"$f":"F11+F9+F7","v":"00:00:00"},null,{"$f":"H11+H9+H7","v":"00:00:00"},null,{"$f":"J11+J9+J7","v":"00:00:00"},null,{"$f":"L11+L9+L7","v":"00:00:00"},null,{"$f":"N11+N9+N7","v":"00:00:00"},null,{"$f":"P11+P9+P7","v":"00:00:00"},null,{"$f":"R11+R9+R7","v":"00:00:00"},null,{"$f":"T11+T9+T7","v":"00:00:00"},null,{"$f":"V11+V9+V7","v":"00:00:00"},null,{"$f":"X11+X9+X7","v":"00:00:00"},null,{"$f":"Z11+Z9+Z7","v":"00:00:00"},null,{"$f":"AB11+AB9+AB7","v":"00:00:00"},null,{"$f":"AD11+AD9+AD7","v":"00:00:00"},null,{"$f":"AF11+AF9+AF7","v":"00:00:00"},null,{"$f":"AH11+AH9+AH7","v":"00:00:00"},null,{"$f":"AJ11+AJ9+AJ7","v":"00:00:00"},null,{"$f":"AL11+AL9+AL7","v":"00:00:00"},null,{"$f":"AN11+AN9+AN7","v":"00:00:00"},null,{"$f":"AP11+AP9+AP7","v":"00:00:00"},null,{"$f":"AR11+AR9+AR7","v":"00:00:00"},null,{"$f":"AT11+AT9+AT7","v":"00:00:00"},null,{"$f":"AV11+AV9+AV7","v":"00:00:00"},null,"3x500",null,8,"Salim","g"]
["Projet 3x500",null,null,null,null,null,null,null,null,null,null,null,null,null,null,null,null,null,null,null,null,null,null,null,null,null,null,null,null,null,null,null,null,null,null,null,null,null,null,null,null,null,null,null,null,null,null,null,null,"Projet 3x500",null,9,"Willy","g"]
["Facultatif",null,null,null,null,null,null,null,null,null,null,null,null,null,null,null,null,null,null,null,null,null,null,null,null,null,null,null,null,null,null,null,null,null,null,null,null,null,null,null,null,null,null,null,null,null,null,null,null,"FACULTATIF",null,10,"mickael",0]
["NOTE/14",{"$f":"IFERROR(IF(B5=\"g\",VLOOKUP(B12,DEBUT!$K$5:$M$35,3,TRUE),VLOOKUP(B12,DEBUT!$L$5:$M$35,2,TRUE)),\"\")","v":""},null,{"$f":"IFERROR(IF(D5=\"g\",VLOOKUP(D12,DEBUT!$K$5:$M$35,3,TRUE),VLOOKUP(D12,DEBUT!$L$5:$M$35,2,TRUE)),\"\")","v":""},null,{"$f":"IFERROR(IF(F5=\"g\",VLOOKUP(F12,DEBUT!$K$5:$M$35,3,TRUE),VLOOKUP(F12,DEBUT!$L$5:$M$35,2,TRUE)),\"\")","v":""},null,{"$f":"IFERROR(IF(H5=\"g\",VLOOKUP(H12,DEBUT!$K$5:$M$35,3,TRUE),VLOOKUP(H12,DEBUT!$L$5:$M$35,2,TRUE)),\"\")","v":""},null,{"$f":"IFERROR(IF(J5=\"g\",VLOOKUP(J12,DEBUT!$K$5:$M$35,3,TRUE),VLOOKUP(J12,DEBUT!$L$5:$M$35,2,TRUE)),\"\")","v":""},null,{"$f":"IFERROR(IF(L5=\"g\",VLOOKUP(L12,DEBUT!$K$5:$M$35,3,TRUE),VLOOKUP(L12,DEBUT!$L$5:$M$35,2,TRUE)),\"\")","v":""},null,{"$f":"IFERROR(IF(N5=\"g\",VLOOKUP(N12,DEBUT!$K$5:$M$35,3,TRUE),VLOOKUP(N12,DEBUT!$L$5:$M$35,2,TRUE)),\"\")","v":""},null,{"$f":"IFERROR(IF(P5=\"g\",VLOOKUP(P12,DEBUT!$K$5:$M$35,3,TRUE),VLOOKUP(P12,DEBUT!$L$5:$M$35,2,TRUE)),\"\")","v":""},null,{"$f":"IFERROR(IF(R5=\"g\",VLOOKUP(R12,DEBUT!$K$5:$M$35,3,TRUE),VLOOKUP(R12,DEBUT!$L$5:$M$35,2,TRUE)),\"\")","v":""},null,{"$f":"IFERROR(IF(T5=\"g\",VLOOKUP(T12,DEBUT!$K$5:$M$35,3,TRUE),VLOOKUP(T12,DEBUT!$L$5:$M$35,2,TRUE)),\"\")","v":""},null,{"$f":"IFERROR(IF(V5=\"g\",VLOOKUP(V12,DEBUT!$K$5:$M$35,3,TRUE),VLOOKUP(V12,DEBUT!$L$5:$M$35,2,TRUE)),\"\")","v":""},null,{"$f":"IFERROR(IF(X5=\"g\",VLOOKUP(X12,DEBUT!$K$5:$M$35,3,TRUE),VLOOKUP(X12,DEBUT!$L$5:$M$35,2,TRUE)),\"\")","v":""},null,{"$f":"IFERROR(IF(Z5=\"g\",VLOOKUP(Z12,DEBUT!$K$5:$M$35,3,TRUE),VLOOKUP(Z12,DEBUT!$L$5:$M$35,2,TRUE)),\"\")","v":""},null,{"$f":"IFERROR(IF(AB5=\"g\",VLOOKUP(AB12,DEBUT!$K$5:$M$35,3,TRUE),VLOOKUP(AB12,DEBUT!$L$5:$M$35,2,TRUE)),\"\")","v":""},null,{"$f":"IFERROR(IF(AD5=\"g\",VLOOKUP(AD12,DEBUT!$K$5:$M$35,3,TRUE),VLOOKUP(AD12,DEBUT!$L$5:$M$35,2,TRUE)),\"\")","v":""},null,{"$f":"IFERROR(IF(AF5=\"g\",VLOOKUP(AF12,DEBUT!$K$5:$M$35,3,TRUE),VLOOKUP(AF12,DEBUT!$L$5:$M$35,2,TRUE)),\"\")","v":""},null,{"$f":"IFERROR(IF(AH5=\"g\",VLOOKUP(AH12,DEBUT!$K$5:$M$35,3,TRUE),VLOOKUP(AH12,DEBUT!$L$5:$M$35,2,TRUE)),\"\")","v":""},null,{"$f":"IFERROR(IF(AJ5=\"g\",VLOOKUP(AJ12,DEBUT!$K$5:$M$35,3,TRUE),VLOOKUP(AJ12,DEBUT!$L$5:$M$35,2,TRUE)),\"\")","v":""},null,{"$f":"IFERROR(IF(AL5=\"g\",VLOOKUP(AL12,DEBUT!$K$5:$M$35,3,TRUE),VLOOKUP(AL12,DEBUT!$L$5:$M$35,2,TRUE)),\"\")","v":""},null,{"$f":"IFERROR(IF(AN5=\"g\",VLOOKUP(AN12,DEBUT!$K$5:$M$35,3,TRUE),VLOOKUP(AN12,DEBUT!$L$5:$M$35,2,TRUE)),\"\")","v":""},null,{"$f":"IFERROR(IF(AP5=\"g\",VLOOKUP(AP12,DEBUT!$K$5:$M$35,3,TRUE),VLOOKUP(AP12,DEBUT!$L$5:$M$35,2,TRUE)),\"\")","v":""},null,{"$f":"IFERROR(IF(AR5=\"g\",VLOOKUP(AR12,DEBUT!$K$5:$M$35,3,TRUE),VLOOKUP(AR12,DEBUT!$L$5:$M$35,2,TRUE)),\"\")","v":""},null,{"$f":"IFERROR(IF(AT5=\"g\",VLOOKUP(AT12,DEBUT!$K$5:$M$35,3,TRUE),VLOOKUP(AT12,DEBUT!$L$5:$M$35,2,TRUE)),\"\")","v":""},null,{"$f":"IFERROR(IF(AV5=\"g\",VLOOKUP(AV12,DEBUT!$K$5:$M$35,3,TRUE),VLOOKUP(AV12,DEBUT!$L$5:$M$35,2,TRUE)),\"\")","v":""},null,"NOTE/14",null,11,"mika",0]
[null,1,null,null,null,null,null,2,null,null,null,null,null,3,null,null,null,null,null,4,null,null,null,null,null,5,null,null,null,null,null,6,null,null,null,null,null,7,null,null,null,null,null,8,null,null,null,null,null,null,null,12,0,0]
["En temps","C1=C3",null,"C2<C3",null,"C3=C1",null,"C1=C2","C2=C3","C2=C3",null,"C3=C1",null,"C1>C2",null,"C2<C1",null,"C3<C2",null,"C1<C2",null,"C2=C3",null,"C3=C2",null,"C1=C2",null,"C2=C1",null,"C3>C1",null,"C1=C3",null,"C2>C3",null,"C3=C1",null,"C1>C2",null,"C2=C3",null,"C3=C2",null,"C1=C2",null,"C2=C1",null,"C3<C1",null,null,null,13,0,0]
["STRATEGIE CHOISIE",null,null,null,null,null,null,null,null,null,null,null,null,null,null,null,null,null,null,null,null,null,null,null,null,null,null,null,null,null,null,null,null,null,null,null,null,null,null,null,null,null,null,null,null,null,null,null,null,"STRATEGIE CHOISIE",null,14,0,0]
["REGULATION (même si identique)",null,null,null,null,null,null,null,null,null,null,null,null,null,null,null,null,null,null,null,null,null,null,null,null,null,null,null,null,null,null,null,null,null,null,null,null,null,null,null,null,null,null,null,null,null,null,null,null,"REGULATION (même si identique)",null,15,0,0]
["RESPECT",{"$f":"IFERROR(IF($BL41=0,\"\",$BL41),\"??\")","v":"??"},null,{"$f":"IFERROR(IF($BL42=0,\"\",$BL42),\"??\")","v":"??"},null,{"$f":"IFERROR(IF($BL43=0,\"\",$BL43),\"??\")","v":"??"},null,{"$f":"IFERROR(IF($BL44=0,\"\",$BL44),\"??\")","v":"??"},null,{"$f":"IFERROR(IF($BL45=0,\"\",$BL45),\"??\")","v":"??"},null,{"$f":"IFERROR(IF($BL46=0,\"\",$BL46),\"??\")","v":"??"},null,{"$f":"IFERROR(IF($BL47=0,\"\",$BL47),\"??\")","v":"??"},null,{"$f":"IFERROR(IF($BL48=0,\"\",$BL48),\"??\")","v":"??"},null,{"$f":"IFERROR(IF($BL49=0,\"\",$BL49),\"??\")","v":"??"},null,{"$f":"IFERROR(IF($BL50=0,\"\",$BL50),\"??\")","v":"??"},null,{"$f":"IFERROR(IF($BL51=0,\"\",$BL51),\"??\")","v":"??"},null,{"$f":"IFERROR(IF($BL52=0,\"\",$BL52),\"??\")","v":"??"},null,{"$f":"IFERROR(IF($BL53=0,\"\",$BL53),\"??\")","v":"??"},null,{"$f":"IFERROR(IF($BL54=0,\"\",$BL54),\"??\")","v":"??"},null,{"$f":"IFERROR(IF($BL55=0,\"\",$BL55),\"??\")","v":"??"},null,{"$f":"IFERROR(IF($BL56=0,\"\",$BL56),\"??\")","v":"??"},null,{"$f":"IFERROR(IF($BL57=0,\"\",$BL57),\"??\")","v":"??"},null,{"$f":"IFERROR(IF($BL58=0,\"\",$BL58),\"??\")","v":"??"},null,{"$f":"IFERROR(IF($BL59=0,\"\",$BL59),\"??\")","v":"??"},null,{"$f":"IFERROR(IF($BL60=0,\"\",$BL60),\"??\")","v":"??"},null,{"$f":"IFERROR(IF($BL61=0,\"\",$BL61),\"??\")","v":"??"},null,{"$f":"IFERROR(IF($BL62=0,\"\",$BL62),\"??\")","v":"??"},null,{"$f":"IFERROR(IF($BL63=0,\"\",$BL63),\"??\")","v":"??"},null,{"$f":"IFERROR(IF($BL64=0,\"\",$BL64),\"??\")","v":"??"},null,"RESPECT",null,16,0,0]
{"$rows_left_out":45}
{"sheet":"ENREGISTRER","index":2,"n_rows":0,"n_cols":0,"rows_kept":0,"cut":false,"hidden":false,"merged":[]}

{"sheet":"REFERENTIELS","index":3,"n_rows":21,"n_cols":16,"rows_kept":21,"cut":false,"hidden":false,"merged":[[3,2,3,3],[3,4,3,15],[4,2,4,3],[4,4,4,15],[5,4,5,7],[5,8,5,15],[19,4,19,7],[19,8,19,11],[19,12,19,15],[6,3,15,3],[6,2,15,2],[18,4,18,5],[18,6,18,8],[18,9,18,10],[16,4,16,15],[16,2,18,2],[18,11,18,13],[18,14,18,15],[17,4,17,15]]}
[]
[]
[null,null,"DEMI-FOND N4 BAC PRO"]
[null,null,"COMPÉTENCES  ATTENDUES",null,"PRINCIPES D’ÉLABORATION DE L’ÉPREUVE"]
[null,null,"Pour produire la meilleure performance, se préparer et récupérer efficacement de l’effort sur une série de courses dont l’allure est anticipée.",null,"Le candidat réalise 3 courses (C1, C2, C3) de 500m (récupération de 10mn maximum entre chaque 500 mètres) chronométrées par un enseignant à la seconde. Le candidat annonce avant son départ sa stratégie de course parmi celles proposées ci-dessous. ll peut réguler sa stratégie uniquement après C1.\nLes candidats courent sans montre ni chronomètre mais un temps de passage leur est communiqué aux 250m.\nLe temps cumulé compte pour 70 % de la note.\nL’échauffement, la récupération et la gestion de l’effort comptent pour 15%. Le respect et la régulation de la stratégie de course comptent pour 15%"]
[null,null,"POINTS À AFFECTER","ÉLÉMENTS À ÉVALUER","COMPETENCE DE NIVEAU 3 EN COURS D’ACQUISITION\nde 00 à 09 pts",null,null,null,"COMPETENCE DE NIVEAU 3 ACQUISE\nde 10 à 20 pts"]
[null,null,14,"Temps cumulé pour les trois 500 m réalisés",null,4,"00:06:41","00:09:40",null,9,"00:05:13","00:06:58",null,14,"00:04:18","00:05:41"]
[null,null,null,null,null,3.5,"00:06:49","00:10:00",null,8.5,"00:05:23","00:07:09",null,13.5,"00:04:21","00:05:47"]
[null,null,null,null,null,3,"00:07:06","00:10:20",null,8,"00:05:33","00:07:20",null,13,"00:04:25","00:05:54"]
[null,null,null,null,null,2.5,"00:07:24","00:10:40",null,7.5,"00:05:43","00:07:31",null,12.5,"00:04:29","00:06:00"]
[null,null,null,null,null,2,"00:07:42","00:11:00",null,7,"00:05:53","00:07:42",null,12,"00:04:33","00:06:07"]
[null,null,null,null,null,1.5,"00:08:00","00:11:20",null,6.5,"00:06:01","00:08:01",null,11.5,"00:04:37","00:06:14"]
[null,null,null,null,null,1,"00:08:17","00:11:40",null,6,"00:06:09","00:08:20",null,11,"00:04:41","00:06:21"]
[null,null,null,null,null,0.5,"00:08:35","00:12:00",null,5.5,"00:06:17","00:08:40",null,10.5,"00:04:45","00:06:28"]
[null,null,null,null,null,0,null,null,null,5,"00:06:25","00:09:00",null,10,"00:04:54","00:06:36"]
[null,null,null,null,null,null,null,null,null,4.5,"00:06:33","00:09:20",null,9.5,"00:05:03","00:06:47"]
[null,null,3,"Stratégie de course\nLe candidat annonce avant son départ sa stratégie de course parmi celles proposées ci- après. Elle peut être régulée après C1.\nEn cas d’annonce de deux courses de vitesse différente un écart de 1 seconde est nécessaire En cas d’annonce de deux courses de même vitesse un écart de 3\" est toléré","Les schémas représentent graphiquement les variations de vitesse d’une course à l’autre (plus vite, moins vite, vitesse égale). Ils correspondent à une stratégie de course.\nExemple :\nSchéma choisi =\nStratégie de course = deuxième course moins rapide que la première, troisième course à la même vitesse que la deuxième"]
[null,null,null,"Stratégies proposées.\nElles ne sont pas hiérarchisées entre elles"]
[null,null,null,"Respect et régulation de la stratégie de course annoncée\n","Aucune stratégie C1-C2 et C2-C3 n’est respectée\n0 pt",null,"Une stratégie C1-C2 ou C2- C3 est respectée (avec une régulation) :\n1 pt",null,null,"Une stratégie C1-C2 ou C2-C3 est respectée (sans régulation) :\n2 pts",null,"La stratégie C1-C2-C3 est respectée (avec régulation) :\n2,5 pts",null,null,"La stratégie C1-C2-C3 est respectée (sans régulation) :\n3 pts"]
[null,null,3,"Préparation et récupération","Echauffement inadapté au type d’effort qui va suivre, l’élève est proche de l’inactivité. Récupération passive après l’effort (assis)\n0 à 1pt",null,null,null,"Echauffement progressif avec repérage d’allures\nRécupération active après l’effort\n1.25 à 2.25 pts",null,null,null,"Echauffement progressif complet avec repérage fin des allures projetées sur des distances de course significatives Récupération active après l’effort et préparation aux allures suivantes\n2.5 à 3 pts"]
{"$rows_left_out":2}
{"sheet":"DEBUT","index":4,"n_rows":191,"n_cols":20,"rows_kept":191,"cut":false,"hidden":false,"merged":[]}
[]
[]
[]
[null,"TEMPS TOUR",null,"DUREE","equivalent secondes","LONGUEUR PISTE","DISTANCE PLOTS","PTS /100m","Plots supp",null,"3x500 G","3x500 F","Note /14","Stratégie N°","Stratégie course","NOTE /3","Régulation","Echauffement",null,"sexe"]
[null,null,null,"15\"",15,50,10,0.1,0,null,"00:00:01","00:00:01",14,null,"0c",0,"oui",0]
[null,"00:01:10",null,"30\"",30,100,15,0.2,1,null,"00:04:18","00:05:41",14,1,"2C+R",1,"non",0.5,null,"g"]
[null,"00:01:11",null,"45\"",45,150,20,0.3,2,null,"00:04:21","00:05:47",13.5,2,"2C",2,null,1,null,"f"]
[null,"00:01:12",null,"1'",60,200,25,0.4,3,null,"00:04:25","00:05:54",13,3,"3C+R",2.5,null,1.5]
[null,"00:01:13",null,"1'30",90,250,50,0.5,4,null,"00:04:29","00:06:00",12.5,4,"3C",3,null,2]
[null,"00:01:14",null,"2'",120,300,100,0.6,5,null,"00:04:33","00:06:07",12,5,null,null,null,2.5]
[null,"00:01:15",null,"3'",180,350,null,0.7,6,null,"00:04:37","00:06:14",11.5,6,null,null,null,3]
[null,"00:01:16",null,"5'",300,400,null,0.8,null,null,"00:04:41","00:06:21",11,7]
[null,"00:01:17",null,"6'",360,450,null,0.9,null,null,"00:04:45","00:06:28",10.5,8]
[null,"00:01:18",null,"8'",480,500,null,1,null,null,"00:04:54","00:06:36",10,9]
[null,"00:01:19",null,"10'",600,null,null,1.1000000000000001,null,null,"00:05:03","00:06:47",9.5]
[null,"00:01:20",null,"12'",720,null,null,1.2,null,null,"00:05:13","00:06:58",9]
[null,"00:01:21",null,"15'",900,null,null,1.3,null,null,"00:05:23","00:07:09",8.5]
[null,"00:01:22",null,"18'",1080,null,null,1.4,null,null,"00:05:33","00:07:20",8]
[null,"00:01:23",null,"20'",1200,null,null,1.5,null,null,"00:05:43","00:07:31",7.5]
[null,"00:01:24",null,"25'",1500,null,null,1.6,null,null,"00:05:53","00:07:42",7]
{"$rows_left_out":172}
{"sheet":"APPEL","index":5,"n_rows":38,"n_cols":28,"rows_kept":38,"cut":false,"hidden":false,"merged":[[0,19,0,20],[0,22,0,23],[0,25,0,26],[0,1,0,2],[0,4,0,5],[0,7,0,8],[0,10,0,11],[0,13,0,14],[0,16,0,17]]}
[null,"TELEC",null,null,"1PROE",null,null,"TGA",null,null,"1EVS",null,null,"1GA",null,null,"1TU",null,null,"STAGE"]
[null,"NOMS","PRENOMS","sexe","NOMS","PRENOMS","sexe","NOMS","PRENOMS","sexe","NOMS","PRENOMS","sexe","NOMS","PRENOMS","sexe","NOMS","PRENOMS","sexe","NOMS","PRENOMS","sexe","NOMS","PRENOMS","sexe","NOMS","PRENOMS","sexe"]
[1,null,"Abdelbasset","g",null,"Abdelwahid","g",null,"Bertile","f",null,"Abir","f",null,"Camille","f",null,"Amir","g",null,"Alexandre","g"]
[2,null,"Alen","g",null,"Ali","g",null,"Chirine","f",null,"Adama","g",null,"Emilie","f",null,"Badrane","g",null,"Alexis F.","g"]
[3,null,"Bilal","g",null,"Fares","g",null,"Isma","f",null,"Elfeta","f",null,"Gehna","f",null,"Emre","g",null,"Anthony","g"]
[4,null,"Christian","g",null,"Gilles","g",null,"Jihenne","f",null,"Faiz","g",null,"Ismeta","f",null,"Hedi","g",null,"Christian","g"]
[5,null,"Halis","g",null,"Haykel","g",null,"Kandji","f",null,"Fares","g",null,"Janette","f",null,"Mansour","g",null,"Claudine","f"]
[6,null,"Laurent","g",null,"Mohamed","g",null,"Kenza","f",null,"Hocine","g",null,"Jenna","f",null,"Mounia","g",null,"Emmanuel","g"]
[7,null,"Mickael","g",null,"Mohamed","g",null,"Khayra","f",null,"Imen","f",null,"Juliana","f",null,"Mustafa","g",null,"vivien","g"]
[8,null,"Salim","g",null,"Mohamed","g",null,"Liddia","f",null,"Jenny","f",null,"Kelly","f",null,"Sombate rothanak","g",null,"Fred","g"]
[9,null,"Willy","g",null,"Phi tram","g",null,"Louiza","f",null,"Jennyline","f",null,"Laura","f",null,"Wail","g",null,"Gwen","g"]
[10,null,"mickael",null,null,"Ryad","g",null,"Lydia","f",null,"Kévin","g",null,"Lea","f",null,"Yohann","g",null,"Julien","g"]
[11,null,"mika",null,null,"Xhorxh","g",null,"Margarita","f",null,"Melvine","f",null,"Linda","f",null,"Zayd","g",null,"Laurent","g"]
[12,null,null,null,null,"Yassine","g",null,"Mouna","f",null,"Nesrine","f",null,"Maïssane","f",null,null,null,null,"Marc-Antoine","g"]
[13,null,null,null,null,null,null,null,"Nadia","f",null,"Ruth","f",null,"Mélinda","f",null,null,null,null,"Marco","g"]
[14,null,null,null,null,null,null,null,"Naila","f",null,"Sabrina","f",null,"Meltem","f",null,null,null,null,"Morgane","f"]
[15,null,null,null,null,null,null,null,"Naoures","f",null,"Sandra","f",null,"Morgane","f",null,null,null,null,"Nathalie","f"]
[16,null,null,null,null,null,null,null,"Nessrine","f",null,"Siwar","f",null,"Naomie","f",null,null,null,null,"Nico Afriat","g"]
[17,null,null,null,null,null,null,null,"Noemie","f",null,"Suleyman","g",null,"Nejma","f",null,null,null,null,"Nico Podu","g"]
[18,null,null,null,null,null,null,null,"Sarinece","f",null,null,null,null,"Nore-ymen","f",null,null,null,null,"Olivier","g"]
{"$rows_left_out":18}