{"text_format":"1","workbook":"xlsx","n_sheets":21,"sheets":["COMMENCER","DEFI (1)","DEFI (2)","DEFI (3)","DEFI (4)","DEFI (5)","DEFI (6)","DEFI (7)","DEFI (8)","DEFI (9)","DEFI (10)","DEFI (11)","DEFI (12)","DEFI (13)","DEFI (14)","DEFI (15)","BRAVO","APPEL","MUSCU","DEBUT","SAMICBIS"],"not_rendered":{"charts":0,"images":52,"macros":0,"external_links":1,"defined_names":105,"comments":15,"pivot_tables":0},"unopened":[],"bounds":{"document_bytes":16777216,"sheet_cells":100000,"rows_first":2000,"rows_last":500,"rows_between":2000,"halvings":0,"cell_chars":16384,"cell_head_chars":4096},"cells_cut":0,"cells_raw":0,"read":"whole","date_system":"1900"}

{"sheet":"COMMENCER","index":0,"n_rows":22,"n_cols":37,"rows_kept":22,"cut":false,"hidden":false,"merged":[[10,6,10,7],[3,4,3,19],[5,4,5,22]]}
[null,null,null,null,null,null,null,null,null,null,null,null,null,null,null,null,null,null,null,null,null,null,null,null,null,null,null,null,null,null,null,null,null,null,null,0,{"$f":"CONCATENATE(AJ1,\"'\")","v":"0'"}]
[null,null,null,null,null,null,null,null,null,null,null,null,null,null,null,null,null,null,null,null,null,null,null,null,null,null,null,null,null,null,null,null,null,null,null,1,{"$f":"CONCATENATE(AJ2,\"'\")","v":"1'"}]
[null,null,null,null,"EXCEL - CRÉER UNE APPLI EN 15 DEFIS",null,null,null,null,null,null,null,null,null,null,null,null,null,null,null,null,null,null,null,null,null,null,null,null,null,null,null,null,null,null,2,"2'"]
[null,null,null,null,"L'objectif est de comprendre les fonctions essentielles d'Excel pour créer ses propres applications  qui seront optimisées pour votre contexte de classe\nLe but est de réussir le plus de défis possibles menant à la création d'une appli muscu",null,null,null,null,null,null,null,null,null,null,null,null,null,null,null,null,null,null,null,null,"mickael.da-costa@ac-lyon.fr",null,null,null,null,null,null,null,null,null,3,"3'"]
[null,null,null,null,"Fonctionnement de l'appli",null,null,null,null,null,null,null,null,null,null,null,null,null,null,null,null,null,null,null,null,"Pour le RESOLP",null,null,null,null,null,null,null,null,null,4,"4'"]
[null,null,null,null,"-1 case blanche renvoie à une donnée de validation : cliquez dessus puis sur le petit triangle pour faire apparaître une liste",null,null,null,null,null,null,null,null,null,null,null,null,null,null,null,null,null,null,null,null,null,null,null,null,null,null,null,null,null,null,5,"5'"]
{"$rows_left_out":17}
{"sheet":"DEFI (1)","index":1,"n_rows":23,"n_cols":13,"rows_kept":23,"cut":false,"hidden":false,"merged":[[17,2,17,4],[17,5,17,7],[17,8,17,10],[22,2,22,10],[18,2,18,4],[18,5,18,7],[18,8,18,10],[19,2,19,10],[20,2,20,10],[21,2,21,10],[16,2,16,10],[6,7,9,10],[6,2,11,6],[12,2,12,6],[12,7,12,10],[11,7,11,10],[10,7,10,10],[1,2,1,10],[11,19,11,20],[13,2,13,6],[13,7,13,10],[3,2,4,2],[3,3,4,4],[3,6,3,9],[3,10,4,10],[4,6,4,9],[5,2,5,6],[5,7,5,10]]}
[]
[null,null,"ESSAIE DE REALISER CE DEFI SEUL EN UTILISANT LE FICHIER DE FORMATION. SI TU AS BESOIN D'AIDE APPELLE NOUS."]
[]
[null,null,"EXCEL","RESSOURCES",null,"Obj",{"$f":"VLOOKUP($D$4,SAMICBIS!$A$3:$T$135,5,FALSE)","v":"Comprendre l'utilité d'un fichier ressource pour être aidé dans la recherche de fonction"},null,null,null,{"$f":"VLOOKUP($D$4,SAMICBIS!$A$3:$T$135,2,FALSE)","v":1},{"$f":"COMMENCER!B13","v":"Johnny"},"Défi réussi"]
[null,null,null,null,null,"But",{"$f":"VLOOKUP($D$4,SAMICBIS!$A$3:$T$135,6,FALSE)","v":"Ouvrir le fichier ressource EXCEL- Formation tous niveaux 3.0"},null,null,null,null,{"$f":"COMMENCER!B14","v":0}]
[null,null,"Schéma",null,null,null,null,"Fonctions nécessaires",null,null,null,{"$f":"COMMENCER!B15","v":0}]
{"$rows_left_out":18}
{"sheet":"DEFI (2)","index":2,"n_rows":23,"n_cols":13,"rows_kept":23,"cut":false,"hidden":false,"merged":[[19,2,19,10],[20,2,20,10],[21,2,21,10],[22,2,22,10],[17,2,17,4],[17,5,17,7],[17,8,17,10],[18,2,18,4],[18,5,18,7],[18,8,18,10],[11,19,11,20],[12,2,12,6],[12,7,12,10],[13,2,13,6],[13,7,13,10],[16,2,16,10],[5,2,5,6],[5,7,5,10],[6,2,11,6],[6,7,9,10],[10,7,10,10],[11,7,11,10],[1,2,1,10],[3,2,4,2],[3,3,4,4],[3,6,3,9],[3,10,4,10],[4,6,4,9]]}
[]
[null,null,"ESSAIE DE REALISER CE DEFI SEUL EN UTILISANT LE FICHIER DE FORMATION. SI TU AS BESOIN D'AIDE APPELLE NOUS."]
[]
[null,null,"EXCEL","ONGLETS",null,"Obj",{"$f":"VLOOKUP($D$4,SAMICBIS!$A$3:$T$135,5,FALSE)","v":"Créer les onglets nécessaires à son appli"},null,null,null,{"$f":"VLOOKUP($D$4,SAMICBIS!$A$3:$T$135,2,FALSE)","v":2},{"$f":"COMMENCER!B13","v":"Johnny"},"Défi réussi"]
[null,null,null,null,null,"But",{"$f":"VLOOKUP($D$4,SAMICBIS!$A$3:$T$135,6,FALSE)","v":"Nommer les onglets DEBUT-APPEL-\"TITRE DE MON APPLI\""},null,null,null,null,{"$f":"COMMENCER!B14","v":0}]
[null,null,"Schéma",null,null,null,null,"Fonctions",null,null,null,{"$f":"COMMENCER!B15","v":0}]
{"$rows_left_out":18}
{"sheet":"DEFI (3)","index":3,"n_rows":23,"n_cols":13,"rows_kept":23,"cut":false,"hidden":false,"merged":[[19,2,19,10],[20,2,20,10],[21,2,21,10],[22,2,22,10],[17,2,17,4],[17,5,17,7],[17,8,17,10],[18,2,18,4],[18,5,18,7],[18,8,18,10],[11,19,11,20],[12,2,12,6],[12,7,12,10],[13,2,13,6],[13,7,13,10],[16,2,16,10],[5,2,5,6],[5,7,5,10],[6,2,11,6],[6,7,9,10],[10,7,10,10],[11,7,11,10],[1,2,1,10],[3,2,4,2],[3,3,4,4],[3,6,3,9],[3,10,4,10],[4,6,4,9]]}
[]
[null,null,"ESSAIE DE REALISER CE DEFI SEUL EN UTILISANT LE FICHIER DE FORMATION. SI TU AS BESOIN D'AIDE APPELLE NOUS."]
[]
[null,null,"EXCEL","DEBUT",null,"Obj",{"$f":"VLOOKUP($D$4,SAMICBIS!$A$3:$T$135,5,FALSE)","v":"Organiser les données au sein d'une feuille unique"},null,null,null,{"$f":"VLOOKUP($D$4,SAMICBIS!$A$3:$T$135,2,FALSE)","v":3},{"$f":"COMMENCER!B13","v":"Johnny"},"Défi réussi"]
[null,null,null,null,null,"But",{"$f":"VLOOKUP($D$4,SAMICBIS!$A$3:$T$135,6,FALSE)","v":"Mettre dans l'onglet DEBUT toutes les données utilisables par la suite"},null,null,null,null,{"$f":"COMMENCER!B14","v":0}]
[null,null,"Schéma",null,null,null,null,"Fonctions nécessaires",null,null,null,{"$f":"COMMENCER!B15","v":0}]
{"$rows_left_out":18}
{"sheet":"DEFI (4)","index":4,"n_rows":23,"n_cols":13,"rows_kept":23,"cut":false,"hidden":false,"merged":[[19,2,19,10],[20,2,20,10],[21,2,21,10],[22,2,22,10],[17,2,17,4],[17,5,17,7],[17,8,17,10],[18,2,18,4],[18,5,18,7],[18,8,18,10],[11,19,11,20],[12,2,12,6],[12,7,12,10],[13,2,13,6],[13,7,13,10],[16,2,16,10],[5,2,5,6],[5,7,5,10],[6,2,11,6],[6,7,9,10],[10,7,10,10],[11,7,11,10],[1,2,1,10],[3,2,4,2],[3,3,4,4],[3,6,3,9],[3,10,4,10],[4,6,4,9]]}
[]
[null,null,"ESSAIE DE REALISER CE DEFI SEUL EN UTILISANT LE FICHIER DE FORMATION. SI TU AS BESOIN D'AIDE APPELLE NOUS."]
[]
[null,null,"EXCEL","MON APPLI",null,"Obj",{"$f":"VLOOKUP($D$4,SAMICBIS!$A$3:$T$135,5,FALSE)","v":"Définir la forme générale de son appli en gardant des lignes et colonnes de réserve"},null,null,null,{"$f":"VLOOKUP($D$4,SAMICBIS!$A$3:$T$135,2,FALSE)","v":4},{"$f":"COMMENCER!B13","v":"Johnny"},"Défi réussi"]
[null,null,null,null,null,"But",{"$f":"VLOOKUP($D$4,SAMICBIS!$A$3:$T$135,6,FALSE)","v":"Mettre en forme globalement son appli "},null,null,null,null,{"$f":"COMMENCER!B14","v":0}]
[null,null,"Schéma",null,null,null,null,"Fonctions nécessaires",null,null,null,{"$f":"COMMENCER!B15","v":0}]
{"$rows_left_out":18}
{"sheet":"DEFI (5)","index":5,"n_rows":23,"n_cols":13,"rows_kept":23,"cut":false,"hidden":false,"merged":[[19,2,19,10],[20,2,20,10],[21,2,21,10],[22,2,22,10],[17,2,17,4],[17,5,17,7],[17,8,17,10],[18,2,18,4],[18,5,18,7],[18,8,18,10],[11,19,11,20],[12,2,12,6],[12,7,12,10],[13,2,13,6],[13,7,13,10],[16,2,16,10],[5,2,5,6],[5,7,5,10],[6,2,11,6],[6,7,9,10],[10,7,10,10],[11,7,11,10],[1,2,1,10],[3,2,4,2],[3,3,4,4],[3,6,3,9],[3,10,4,10],[4,6,4,9]]}
[]
[null,null,"ESSAIE DE REALISER CE DEFI SEUL EN UTILISANT LE FICHIER DE FORMATION. SI TU AS BESOIN D'AIDE APPELLE NOUS."]
[]
[null,null,"EXCEL","DONNEES DE VALIDATION",null,"Obj",{"$f":"VLOOKUP($D$4,SAMICBIS!$A$3:$T$135,5,FALSE)","v":"Créer la 1ère ligne et colonne de son appli avec données de validation"},null,null,null,{"$f":"VLOOKUP($D$4,SAMICBIS!$A$3:$T$135,2,FALSE)","v":5},{"$f":"COMMENCER!B13","v":"Johnny"},"Défi réussi"]
[null,null,null,null,null,"But",{"$f":"VLOOKUP($D$4,SAMICBIS!$A$3:$T$135,6,FALSE)","v":"Je choisis ce que je veux faire apparaître sur ma colonne de gauche au niveau de chaque ligne. JE choisi combien de colonne j'attribue à un élève et les pramètres que je vais y mettre. "},null,null,null,null,{"$f":"COMMENCER!B14","v":0}]
[null,null,"Schéma",null,null,null,null,"Fonctions nécessaires",null,null,null,{"$f":"COMMENCER!B15","v":0}]
{"$rows_left_out":18}
{"sheet":"DEFI (6)","index":6,"n_rows":23,"n_cols":13,"rows_kept":23,"cut":false,"hidden":false,"merged":[[19,2,19,10],[20,2,20,10],[21,2,21,10],[22,2,22,10],[17,2,17,4],[17,5,17,7],[17,8,17,10],[18,2,18,4],[18,5,18,7],[18,8,18,10],[11,19,11,20],[12,2,12,6],[12,7,12,10],[13,2,13,6],[13,7,13,10],[16,2,16,10],[5,2,5,6],[5,7,5,10],[6,2,11,6],[6,7,9,10],[10,7,10,10],[11,7,11,10],[1,2,1,10],[3,2,4,2],[3,3,4,4],[3,6,3,9],[3,10,4,10],[4,6,4,9]]}
[]
[null,null,"ESSAIE DE REALISER CE DEFI SEUL EN UTILISANT LE FICHIER DE FORMATION. SI TU AS BESOIN D'AIDE APPELLE NOUS."]
[]
[null,null,"EXCEL","INCREMENTER",null,"Obj",{"$f":"VLOOKUP($D$4,SAMICBIS!$A$3:$T$135,5,FALSE)","v":"Maitriser la fonction INCREMENTER"},null,null,null,{"$f":"VLOOKUP($D$4,SAMICBIS!$A$3:$T$135,2,FALSE)","v":6},{"$f":"COMMENCER!B13","v":"Johnny"},"Défi réussi"]
[null,null,null,null,null,"But",{"$f":"VLOOKUP($D$4,SAMICBIS!$A$3:$T$135,6,FALSE)","v":"Incrémenter votre 1ère ligne  autant de fois que souhaitez"},null,null,null,null,{"$f":"COMMENCER!B14","v":0}]
[null,null,"Schéma",null,null,null,null,"Fonctions nécessaires",null,null,null,{"$f":"COMMENCER!B15","v":0}]
{"$rows_left_out":18}
{"sheet":"DEFI (7)","index":7,"n_rows":23,"n_cols":13,"rows_kept":23,"cut":false,"hidden":false,"merged":[[19,2,19,10],[20,2,20,10],[21,2,21,10],[22,2,22,10],[17,2,17,4],[17,5,17,7],[17,8,17,10],[18,2,18,4],[18,5,18,7],[18,8,18,10],[11,19,11,20],[12,2,12,6],[12,7,12,10],[13,2,13,6],[13,7,13,10],[16,2,16,10],[5,2,5,6],[5,7,5,10],[6,2,11,6],[6,7,9,10],[10,7,10,10],[11,7,11,10],[1,2,1,10],[3,2,4,2],[3,3,4,4],[3,6,3,9],[3,10,4,10],[4,6,4,9]]}
[]
[null,null,"ESSAIE DE REALISER CE DEFI SEUL EN UTILISANT LE FICHIER DE FORMATION. SI TU AS BESOIN D'AIDE APPELLE NOUS."]
[]
[null,null,"EXCEL","SOMME …",null,"Obj",{"$f":"VLOOKUP($D$4,SAMICBIS!$A$3:$T$135,5,FALSE)","v":"Faire des calculs simples"},null,null,null,{"$f":"VLOOKUP($D$4,SAMICBIS!$A$3:$T$135,2,FALSE)","v":7},{"$f":"COMMENCER!B13","v":"Johnny"},"Défi réussi"]
[null,null,null,null,null,"But",{"$f":"VLOOKUP($D$4,SAMICBIS!$A$3:$T$135,6,FALSE)","v":"Au bout de chaque ligne, faites la somme des réps réalisées/exos. En bas de chaque colonne la moyenne du tonnage ou des réps réalisées par élève. Faire la moyenne"},null,null,null,null,{"$f":"COMMENCER!B14","v":0}]
[null,null,"Schéma",null,null,null,null,"Fonctions nécessaires",null,null,null,{"$f":"COMMENCER!B15","v":0}]
{"$rows_left_out":18}
{"sheet":"DEFI (8)","index":8,"n_rows":23,"n_cols":13,"rows_kept":23,"cut":false,"hidden":false,"merged":[[19,2,19,10],[20,2,20,10],[21,2,21,10],[22,2,22,10],[17,2,17,4],[17,5,17,7],[17,8,17,10],[18,2,18,4],[18,5,18,7],[18,8,18,10],[11,19,11,20],[12,2,12,6],[12,7,12,10],[13,2,13,6],[13,7,13,10],[16,2,16,10],[5,2,5,6],[5,7,5,10],[6,2,11,6],[6,7,9,10],[10,7,10,10],[11,7,11,10],[1,2,1,10],[3,2,4,2],[3,3,4,4],[3,6,3,9],[3,10,4,10],[4,6,4,9]]}
[]
[null,null,"ESSAIE DE REALISER CE DEFI SEUL EN UTILISANT LE FICHIER DE FORMATION. SI TU AS BESOIN D'AIDE APPELLE NOUS."]
[]
[null,null,"EXCEL","BAREME",null,"Obj",{"$f":"VLOOKUP($D$4,SAMICBIS!$A$3:$T$135,5,FALSE)","v":"Créer un barême adapté aux élèves"},null,null,null,{"$f":"VLOOKUP($D$4,SAMICBIS!$A$3:$T$135,2,FALSE)","v":8},{"$f":"COMMENCER!B13","v":"Johnny"},"Défi réussi"]
[null,null,null,null,null,"But",{"$f":"VLOOKUP($D$4,SAMICBIS!$A$3:$T$135,6,FALSE)","v":"Utiliser l'onglet DEBUT pour créer un barême simple"},null,null,null,null,{"$f":"COMMENCER!B14","v":0}]
[null,null,"Schéma",null,null,null,null,"Fonctions nécessaires",null,null,null,{"$f":"COMMENCER!B15","v":0}]
{"$rows_left_out":18}
{"sheet":"DEFI (9)","index":9,"n_rows":23,"n_cols":13,"rows_kept":23,"cut":false,"hidden":false,"merged":[[19,2,19,10],[20,2,20,10],[21,2,21,10],[22,2,22,10],[17,2,17,4],[17,5,17,7],[17,8,17,10],[18,2,18,4],[18,5,18,7],[18,8,18,10],[11,19,11,20],[12,2,12,6],[12,7,12,10],[13,2,13,6],[13,7,13,10],[16,2,16,10],[5,2,5,6],[5,7,5,10],[6,2,11,6],[6,7,9,10],[10,7,10,10],[11,7,11,10],[1,2,1,10],[3,2,4,2],[3,3,4,4],[3,6,3,9],[3,10,4,10],[4,6,4,9]]}
[]
[null,null,"ESSAIE DE REALISER CE DEFI SEUL EN UTILISANT LE FICHIER DE FORMATION. SI TU AS BESOIN D'AIDE APPELLE NOUS."]
[]
[null,null,"EXCEL","RECHERCHEV",null,"Obj",{"$f":"VLOOKUP($D$4,SAMICBIS!$A$3:$T$135,5,FALSE)","v":"Comprendr ele fonctionnement de RECHERCHEV et RECHERCHEH"},null,null,null,{"$f":"VLOOKUP($D$4,SAMICBIS!$A$3:$T$135,2,FALSE)","v":9},{"$f":"COMMENCER!B13","v":"Johnny"},"Défi réussi"]
[null,null,null,null,null,"But",{"$f":"VLOOKUP($D$4,SAMICBIS!$A$3:$T$135,6,FALSE)","v":"Utiliser la fonction recherchev pour faire correspondre un résultat avec un commentaire et/ou une note automatiquement"},null,null,null,null,{"$f":"COMMENCER!B14","v":0}]
[null,null,"Schéma",null,null,null,null,"Fonctions nécessaires",null,null,null,{"$f":"COMMENCER!B15","v":0}]
{"$rows_left_out":18}
{"sheet":"DEFI (10)","index":10,"n_rows":23,"n_cols":13,"rows_kept":23,"cut":false,"hidden":false,"merged":[[19,2,19,10],[20,2,20,10],[21,2,21,10],[22,2,22,10],[17,2,17,4],[17,5,17,7],[17,8,17,10],[18,2,18,4],[18,5,18,7],[18,8,18,10],[11,19,11,20],[12,2,12,6],[12,7,12,10],[13,2,13,6],[13,7,13,10],[16,2,16,10],[5,2,5,6],[5,7,5,10],[6,2,11,6],[6,7,9,10],[10,7,10,10],[11,7,11,10],[1,2,1,10],[3,2,4,2],[3,3,4,4],[3,6,3,9],[3,10,4,10],[4,6,4,9]]}
[]
[null,null,"ESSAIE DE REALISER CE DEFI SEUL EN UTILISANT LE FICHIER DE FORMATION. SI TU AS BESOIN D'AIDE APPELLE NOUS."]
[]
[null,null,"EXCEL","FIGER",null,"Obj",{"$f":"VLOOKUP($D$4,SAMICBIS!$A$3:$T$135,5,FALSE)","v":"Comprendre l'intérêt de FIGER des colonnes ou lignes"},null,null,null,{"$f":"VLOOKUP($D$4,SAMICBIS!$A$3:$T$135,2,FALSE)","v":10},{"$f":"COMMENCER!B13","v":"Johnny"},"Défi réussi"]
[null,null,null,null,null,"But",{"$f":"VLOOKUP($D$4,SAMICBIS!$A$3:$T$135,6,FALSE)","v":"Figer les cellules au bon endroit "},null,null,null,null,{"$f":"COMMENCER!B14","v":0}]
[null,null,"Schéma",null,null,null,null,"Fonctions nécessaires",null,null,null,{"$f":"COMMENCER!B15","v":0}]
{"$rows_left_out":18}
{"sheet":"DEFI (11)","index":11,"n_rows":23,"n_cols":13,"rows_kept":23,"cut":false,"hidden":false,"merged":[[19,2,19,10],[20,2,20,10],[21,2,21,10],[22,2,22,10],[17,2,17,4],[17,5,17,7],[17,8,17,10],[18,2,18,4],[18,5,18,7],[18,8,18,10],[11,19,11,20],[12,2,12,6],[12,7,12,10],[13,2,13,6],[13,7,13,10],[16,2,16,10],[5,2,5,6],[5,7,5,10],[6,2,11,6],[6,7,9,10],[10,7,10,10],[11,7,11,10],[1,2,1,10],[3,2,4,2],[3,3,4,4],[3,6,3,9],[3,10,4,10],[4,6,4,9]]}
[]
[null,null,"ESSAIE DE REALISER CE DEFI SEUL EN UTILISANT LE FICHIER DE FORMATION. SI TU AS BESOIN D'AIDE APPELLE NOUS."]
[]
[null,null,"EXCEL","LIEN HYPERTEXTE",null,"Obj",{"$f":"VLOOKUP($D$4,SAMICBIS!$A$3:$T$135,5,FALSE)","v":"Créer un lien hypertexte vers une autre cellule"},null,null,null,{"$f":"VLOOKUP($D$4,SAMICBIS!$A$3:$T$135,2,FALSE)","v":11},{"$f":"COMMENCER!B13","v":"Johnny"},"Défi réussi"]
[null,null,null,null,null,"But",{"$f":"VLOOKUP($D$4,SAMICBIS!$A$3:$T$135,6,FALSE)","v":"Créer des liens hypertextes qui vous permettent de vous déplacer aisément dans votre document"},null,null,null,null,{"$f":"COMMENCER!B14","v":0}]
[null,null,"Schéma",null,null,null,null,"Fonctions nécessaires",null,null,null,{"$f":"COMMENCER!B15","v":0}]
{"$rows_left_out":18}
{"sheet":"DEFI (12)","index":12,"n_rows":23,"n_cols":12,"rows_kept":23,"cut":false,"hidden":false,"merged":[[19,2,19,10],[20,2,20,10],[21,2,21,10],[22,2,22,10],[17,2,17,4],[17,5,17,7],[17,8,17,10],[18,2,18,4],[18,5,18,7],[18,8,18,10],[11,19,11,20],[12,2,12,6],[12,7,12,10],[13,2,13,6],[13,7,13,10],[16,2,16,10],[5,2,5,6],[5,7,5,10],[6,2,11,6],[6,7,9,10],[10,7,10,10],[11,7,11,10],[1,2,1,10],[3,2,4,2],[3,3,4,4],[3,6,3,9],[3,10,4,10],[4,6,4,9]]}
[]
[null,null,"ESSAIE DE REALISER CE DEFI SEUL EN UTILISANT LE FICHIER DE FORMATION. SI TU AS BESOIN D'AIDE APPELLE NOUS."]
[]
[null,null,"EXCEL","MISE EN FORME CONDITONNELLE",null,"Obj",{"$f":"VLOOKUP($D$4,SAMICBIS!$A$3:$T$135,5,FALSE)","v":"Mettre en forme condtionnelle vos données"},null,null,null,{"$f":"VLOOKUP($D$4,SAMICBIS!$A$3:$T$135,2,FALSE)","v":12},{"$f":"COMMENCER!B13","v":"Johnny"}]
[null,null,null,null,null,"But",{"$f":"VLOOKUP($D$4,SAMICBIS!$A$3:$T$135,6,FALSE)","v":"Faire ressortir, donner des infos en utilisant les couleurs"},null,null,null,null,{"$f":"COMMENCER!B14","v":0}]
[null,null,"Schéma",null,null,null,null,"Fonctions nécessaires",null,null,null,{"$f":"COMMENCER!B15","v":0}]
{"$rows_left_out":18}
{"sheet":"DEFI (13)","index":13,"n_rows":23,"n_cols":12,"rows_kept":23,"cut":false,"hidden":false,"merged":[[19,2,19,10],[20,2,20,10],[21,2,21,10],[22,2,22,10],[17,2,17,4],[17,5,17,7],[17,8,17,10],[18,2,18,4],[18,5,18,7],[18,8,18,10],[11,19,11,20],[12,2,12,6],[12,7,12,10],[13,2,13,6],[13,7,13,10],[16,2,16,10],[5,2,5,6],[5,7,5,10],[6,2,11,6],[6,7,9,10],[10,7,10,10],[11,7,11,10],[1,2,1,10],[3,2,4,2],[3,3,4,4],[3,6,3,9],[3,10,4,10],[4,6,4,9]]}
[]
[null,null,"ESSAIE DE REALISER CE DEFI SEUL EN UTILISANT LE FICHIER DE FORMATION. SI TU AS BESOIN D'AIDE APPELLE NOUS."]
[]
[null,null,"EXCEL","GRAPHIQUE",null,"Obj",{"$f":"VLOOKUP($D$4,SAMICBIS!$A$3:$T$135,5,FALSE)","v":"Créer un graphique"},null,null,null,{"$f":"VLOOKUP($D$4,SAMICBIS!$A$3:$T$135,2,FALSE)","v":13},{"$f":"COMMENCER!B13","v":"Johnny"}]
[null,null,null,null,null,"But",{"$f":"VLOOKUP($D$4,SAMICBIS!$A$3:$T$135,6,FALSE)","v":"Passez d'un graphique simple à un graphique joli"},null,null,null,null,{"$f":"COMMENCER!B14","v":0}]
[null,null,"Schéma",null,null,null,null,"Fonctions nécessaires",null,null,null,{"$f":"COMMENCER!B15","v":0}]
{"$rows_left_out":18}
{"sheet":"DEFI (14)","index":14,"n_rows":23,"n_cols":12,"rows_kept":23,"cut":false,"hidden":false,"merged":[[19,2,19,10],[20,2,20,10],[21,2,21,10],[22,2,22,10],[17,2,17,4],[17,5,17,7],[17,8,17,10],[18,2,18,4],[18,5,18,7],[18,8,18,10],[11,19,11,20],[12,2,12,6],[12,7,12,10],[13,2,13,6],[13,7,13,10],[16,2,16,10],[5,2,5,6],[5,7,5,10],[6,2,11,6],[6,7,9,10],[10,7,10,10],[11,7,11,10],[1,2,1,10],[3,2,4,2],[3,3,4,4],[3,6,3,9],[3,10,4,10],[4,6,4,9]]}
[]
[null,null,"ESSAIE DE REALISER CE DEFI SEUL EN UTILISANT LE FICHIER DE FORMATION. SI TU AS BESOIN D'AIDE APPELLE NOUS."]
[]
[null,null,"EXCEL","MACRO simple",null,"Obj",{"$f":"VLOOKUP($D$4,SAMICBIS!$A$3:$T$135,5,FALSE)","v":"Créer une macro simple pour incrémenter"},null,null,null,{"$f":"VLOOKUP($D$4,SAMICBIS!$A$3:$T$135,2,FALSE)","v":14},{"$f":"COMMENCER!B13","v":"Johnny"}]
[null,null,null,null,null,"But",{"$f":"VLOOKUP($D$4,SAMICBIS!$A$3:$T$135,6,FALSE)","v":"Recopier le code d'une macro pour l'affecter à un bouton"},null,null,null,null,{"$f":"COMMENCER!B14","v":0}]
[null,null,"Schéma",null,null,null,null,"Fonctions nécessaires",null,null,null,{"$f":"COMMENCER!B15","v":0}]
{"$rows_left_out":18}
{"sheet":"DEFI (15)","index":15,"n_rows":23,"n_cols":12,"rows_kept":23,"cut":false,"hidden":false,"merged":[[19,2,19,10],[20,2,20,10],[21,2,21,10],[22,2,22,10],[17,2,17,4],[17,5,17,7],[17,8,17,10],[18,2,18,4],[18,5,18,7],[18,8,18,10],[11,19,11,20],[12,2,12,6],[12,7,12,10],[13,2,13,6],[13,7,13,10],[16,2,16,10],[5,2,5,6],[5,7,5,10],[6,2,11,6],[6,7,9,10],[10,7,10,10],[11,7,11,10],[1,2,1,10],[3,2,4,2],[3,3,4,4],[3,6,3,9],[3,10,4,10],[4,6,4,9]]}
[]
[null,null,"ESSAIE DE REALISER CE DEFI SEUL EN UTILISANT LE FICHIER DE FORMATION. SI TU AS BESOIN D'AIDE APPELLE NOUS."]
[]
[null,null,"EXCEL","SECURITE",null,"Obj",{"$f":"VLOOKUP($D$4,SAMICBIS!$A$3:$T$135,5,FALSE)","v":"Sécurisez votre  document"},null,null,null,{"$f":"VLOOKUP($D$4,SAMICBIS!$A$3:$T$135,2,FALSE)","v":15},{"$f":"COMMENCER!B13","v":"Johnny"}]
[null,null,null,null,null,"But",{"$f":"VLOOKUP($D$4,SAMICBIS!$A$3:$T$135,6,FALSE)","v":"Choisissez les cellules modifiables et vérouillez les autres"},null,null,null,null,{"$f":"COMMENCER!B14","v":0}]
[null,null,"Schéma",null,null,null,null,"Fonctions nécessaires",null,null,null,{"$f":"COMMENCER!B15","v":0}]
{"$rows_left_out":18}
{"sheet":"BRAVO","index":16,"n_rows":9,"n_cols":3,"rows_kept":9,"cut":false,"hidden":false,"merged":[[8,2,18,8]]}
[]
[]
[]
[]
[]
[]
{"$rows_left_out":4}
{"sheet":"APPEL","index":17,"n_rows":9,"n_cols":6,"rows_kept":9,"cut":false,"hidden":false,"merged":[[0,1,0,2],[0,4,0,5]]}
[null,"STAGE TICE"]
[null,"NOMS","PRENOMS",null,"NOMS","PRENOMS"]
[null,null,"Johnny"]
[null,null,"Cyril"]
[null,null,"Barby"]
[null,null,"Cécé"]
{"$rows_left_out":4}
{"sheet":"MUSCU","index":18,"n_rows":22,"n_cols":21,"rows_kept":22,"cut":false,"hidden":false,"merged":[[3,1,3,6],[20,1,20,6]]}
[]
[]
[]
[null,"Séance 1 - Obj : découvrir en toute sécurité différents exercices selon une méthode tonification",null,null,null,null,null,"Elève A",null,"Elève A",null,"Elève A",null,"Elève A",null,"Elève B",null,"Elève C"]
[null,"Quadriceps",null,1,"Séries",5,"Kg",5,"Kg",10,"Kg",5,"Kg",5,"Kg",5,"Kg",5,"Kg"]
[null,"Presse",null,5,"Réps",1,"Récup'",5,"Réps",5,"Réps",null,"Réps",5,"Réps",5,"Réps",5,"Réps"]
{"$rows_left_out":17}
{"sheet":"DEBUT","index":19,"n_rows":7,"n_cols":10,"rows_kept":7,"cut":false,"hidden":false,"merged":[]}
[]
[null,"Réps","Commentaire","Muscles","Récupération","Exercices","Séries","Charge","Tonnage","Commentaires"]
[null,5,"Un petit effort sup","Biceps","30\"","Développé couché",null,null,0,"Peux mieux faire"]
[null,10,"Pas mal ","Triceps",1,"Tirage horizontal",1,5,1000,"C'est pas mal"]
[null,15,"TU te dépasses !","Quadriceps","1'30","Presse",2,10,4000,"Bravo"]
[null,null,null,"…","…","…",3,15]
{"$rows_left_out":2}
{"sheet":"SAMICBIS","index":20,"n_rows":22,"n_cols":22,"rows_kept":22,"cut":false,"hidden":false,"merged":[]}
[null,null,null,null,null,null,null,null,"2,26x1,25",null,null,null,null,null,null,null,null,null,null,"Conseil pour "]
["nom SA","n° SA","Colonne1","Colonne2","Obj SA","But","Colonne3","Consignes","Schéma","Consignes 2","Schéma 2","Astuces","Fonctions","CR","Intérêt SA","Connaissances","Capacités","Attitudes","Complexification","Simplification",null,"type SA"]
["RESSOURCES",1,null,null,"Comprendre l'utilité d'un fichier ressource pour être aidé dans la recherche de fonction","Ouvrir le fichier ressource EXCEL- Formation tous niveaux 3.0",null,"Si vous ne l'avez pas téléchargé, demandez à un membre du cercle de vous transmettre le fichier EXCEL - formation tous niveaux 3.0 sur clé USB","3,44 x 1,84","N'oubliez pas de valider votre défi en haut à droite de votre prénom avant de cliquer sur le suivant",null,"Quand vous bossez sur une appli ouvrez ce fichier pour aller chercher rapidement les infos utiles stockées dans un fichier unique","Ouvrir un fichier","Je mets en parallèle ce document et le fichier EXCEL formation",null,null,null,null,null,null,null,"Routine"]
["ONGLETS",2,null,null,"Créer les onglets nécessaires à son appli","Nommer les onglets DEBUT-APPEL-\"TITRE DE MON APPLI\"",null,"Créez ou au moins vérifiez que les onglets APPEL et DEBUT existent et créez un nouvel onglet que vous nommez selon votre envie (en lien avec la muscu)",null,null,null,"En faisant un clic droit sur les 2 petits triangles en bas à droite vous pouvez visualiser tous vos onglets et en sélectionner un","Créer et nommer un nouvel onglet","Organiser vos onglets de manière logique pour vous et vos élèves",null,null,null,null,null,null,null,"Multi-volants"]
["DEBUT",3,null,null,"Organiser les données au sein d'une feuille unique","Mettre dans l'onglet DEBUT toutes les données utilisables par la suite",null,"Dans l'onglet DEBUT : dessinez un grand tableau avec la mise en forme souhaitée avec des en-têtes pour chaque colonne précisant de quoi il s'agit. ",null,"Mettre dedans le nom des muscles à travailler, le nom des exercices, les niveaux de réalisation, les séries, réps, charge, récup, et autre donnée que vous jugerez utiles",null,"Créez un fond de couleur. Faites des tableaux avec fond blanc et en-têtes d'une autre couleur","Dessinez un tableau simple avec choix des bordures, couleurs, …"," Ici c'est la base de données",null,null,null,null,null,null,null,"Volant continu"]
["MON APPLI",4,null,null,"Définir la forme générale de son appli en gardant des lignes et colonnes de réserve","Mettre en forme globalement son appli ",null,"L'appli muscu proposée va être une sorte de tableau à double entrée avec en haut les prénoms des élèves et à gauche, les exercices, niveaux, paramètres individualisables. Au milieu, les élèves (ou vous) pourrez mettre les infos que vous jugerez utiles",null,"Commencez simple pour ne pas vous perdre.",null,"Pensez aux infos utiles : choix exos, charges, réps, …","Mettre en forme son appli. Définir les grandes colonnes et lignes","Posez vous la question : quelles infos je veux pouvoir retenir ?"]
{"$rows_left_out":16}