{"text_format":"1","workbook":"xlsx","n_sheets":4,"sheets":["Accueil","Evaluation","Barèmes & Options","Présentation des profils"],"not_rendered":{"charts":0,"images":1,"macros":1,"external_links":0,"defined_names":393,"comments":1,"pivot_tables":0},"unopened":[],"bounds":{"document_bytes":16777216,"sheet_cells":100000,"rows_first":2000,"rows_last":500,"rows_between":2000,"halvings":0,"cell_chars":16384,"cell_head_chars":4096},"cells_cut":0,"cells_raw":0,"read":"whole","date_system":"1900"}

{"sheet":"Accueil","index":0,"n_rows":0,"n_cols":0,"rows_kept":0,"cut":false,"hidden":false,"merged":[]}

{"sheet":"Evaluation","index":1,"n_rows":101,"n_cols":41,"rows_kept":101,"cut":false,"hidden":false,"merged":[[0,0,0,32]]}
["Course de demi-fond Bac GT - N4 - 2018"]
[]
["Nom","Prénom","Sexe F ou M","Classe","Profil","Projet C1","Projet C1","500-1","500-1","Ecart","Profil si régulation","profil choisi","500-2","500-2","500-3","500-3","Temps Total","c2-c1","c3-c2","c3-c1","respect c1-c2=","respect c1-c2+","respect c1-c2-","respect C2-C3=","respect C2-C3+","respect C2-C3-","Respect Profile 9","points respect","points profil / 3","Point projet C1 / 1","Points perf / 14","Points echauff. / 2","Note / 20",null,null,null,null,null,"Sexe"]
[null,null,null,null,null,null,{"$f":"IF(F4=\"\",\"\",F4/100)","v":""},null,{"$f":"IF(H4=\"\",\"\",H4/100)","v":""},{"$f":"IF(OR(G4=\"\",I4=\"\"),\"\",ABS((INT(I4)*60)+((I4-INT(I4))*100)-((INT(G4)*60)+((G4-INT(G4))*100))))","v":""},null,{"$f":"IF(AND(E4=\"\",K4=\"\"),\"\",IF(K4=\"\",E4,K4))","v":""},null,{"$f":"IF(M4=\"\",\"\",M4/100)","v":""},null,{"$f":"IF(O4=\"\",\"\",O4/100)","v":""},{"$f":"IF(AND(P4<>\"\",N4<>\"\",I4<>\"\"),(INT(((INT($I4)*60)+(($I4-INT($I4))*100)+(INT($N4)*60)+(($N4-INT($N4))*100)+(INT($P4)*60)+(($P4-INT($P4))*100))/60)+MOD(((INT($I4)*60)+(($I4-INT($I4))*100)+(INT($N4)*60)+(($N4-INT($N4))*100)+(INT($P4)*60)+(($P4-INT($P4))*100)),60)/100)*100,\"\")","v":""},{"$f":"ROUND((INT(N4)*60)+((N4-INT(N4))*100)-((INT(I4)*60)+((I4-INT(I4))*100)),0)","v":{"$error":"#VALUE!"}},{"$f":"ROUND((INT(P4)*60)+((P4-INT(P4))*100)-((INT(N4)*60)+((N4-INT(N4))*100)),0)","v":{"$error":"#VALUE!"}},{"$f":"ROUND((INT(P4)*60)+((P4-INT(P4))*100)-((INT(I4)*60)+((I4-INT(I4))*100)),0)","v":{"$error":"#VALUE!"}},{"$f":"IF(AND(N4<>0,I4<>0),IF(OR(L4=1,L4=3,L4=4),IF(OR(R4=0,ABS(R4)<='Barèmes & Options'!H$2),1,0)),\"\")","v":false},{"$f":"IF(AND(N4<>\"\",I4<>\"\"),IF(OR(L4=5,L4=7),IF(R4>0,1,0)),\"\")","v":""},{"$f":"IF(AND(N4<>\"\",I4<>\"\"),IF(OR(L4=2,L4=6,L4=8),IF(R4<0,1,0)),\"\")","v":""},{"$f":"IF(AND(N4<>0,P4<>0),IF(OR(L4=1,L4=5,L4=6),IF(OR(S4=0,ABS(S4)<='Barèmes & Options'!H$2),1,0)),\"\")","v":false},{"$f":"IF(AND(N4<>\"\",P4<>\"\"),IF(OR(L4=4,L4=8),IF(S4>0,1,0)),\"\")","v":""},{"$f":"IF(AND(N4<>\"\",P4<>\"\"),IF(OR(L4=2,L4=3,L4=7),IF(S4<0,1,0)),\"\")","v":""},{"$f":"IF(SUM(U4:Z4)=2,IF(L4=2,IF(L4=2,IF(T4-'Barèmes & Options'!H$2<-1,0,1)),\"\"),0)","v":0},{"$f":"IF(OR(L4=2,L4=9),SUM(U4:Z4)-AA4,SUM(U4:Z4))","v":0},{"$f":"IF(L4<>\"\",IF(AND(L4>=1,L4<=8,L4=ABS(L4)),IF(AND(L4<=9,L4>=1),IF(AND(AB4=1,K4<>\"\"),1,IF(AND(AB4=1,K4=\"\"),2,IF(AND(AB4=2,K4<>\"\"),2.5,IF(AND(AB4=2,K4=\"\"),3,0)))),\"\"),\"Err. Profil\"),\"\")","v":""},{"$f":"IF(G4<>\"\",IF(ROUND(J4,0)<=3,1,0),\"\")","v":""},{"$f":"IF(AND(P4<>\"\",N4<>\"\",I4<>\"\"),IF($C4=\"\",\"SX\",IF($C4=\"F\",VLOOKUP(ROUND($Q4,0)/100,Barème500,3),VLOOKUP(ROUND($Q4,0)/100,Barème500,2))),\"\")","v":""},null,{"$f":"IF(OR(AF4=\"\",AF4=\"\",AE4=\"\",AD4=\"\",AC4=\"\"),\"\",IF(OR(AF4<0,AF4>2),\"Err ech.\",SUM(AF4,AE4,AD4,AC4)))","v":""},null,"Moyenne F. :",{"$f":"IF(ISERROR(AN4),\"\",AN4)","v":""},null,null,{"$f":"IF(C4<>\"f\",\"m\",\"f\")","v":"m"},{"$f":"AVERAGEIF(AM4:AM101,\"f\",AG4:AG101)","v":{"$error":"#DIV/0!"}},"filles"]
[null,null,null,null,null,null,{"$f":"IF(F5=\"\",\"\",F5/100)","v":""},null,{"$f":"IF(H5=\"\",\"\",H5/100)","v":""},{"$f":"IF(OR(G5=\"\",I5=\"\"),\"\",ABS((INT(I5)*60)+((I5-INT(I5))*100)-((INT(G5)*60)+((G5-INT(G5))*100))))","v":""},null,{"$f":"IF(AND(E5=\"\",K5=\"\"),\"\",IF(K5=\"\",E5,K5))","v":""},null,{"$f":"IF(M5=\"\",\"\",M5/100)","v":""},null,{"$f":"IF(O5=\"\",\"\",O5/100)","v":""},{"$f":"IF(AND(P5<>\"\",N5<>\"\",I5<>\"\"),(INT(((INT($I5)*60)+(($I5-INT($I5))*100)+(INT($N5)*60)+(($N5-INT($N5))*100)+(INT($P5)*60)+(($P5-INT($P5))*100))/60)+MOD(((INT($I5)*60)+(($I5-INT($I5))*100)+(INT($N5)*60)+(($N5-INT($N5))*100)+(INT($P5)*60)+(($P5-INT($P5))*100)),60)/100)*100,\"\")","v":""},{"$f":"ROUND((INT(N5)*60)+((N5-INT(N5))*100)-((INT(I5)*60)+((I5-INT(I5))*100)),0)","v":{"$error":"#VALUE!"}},{"$f":"ROUND((INT(P5)*60)+((P5-INT(P5))*100)-((INT(N5)*60)+((N5-INT(N5))*100)),0)","v":{"$error":"#VALUE!"}},{"$f":"ROUND((INT(P5)*60)+((P5-INT(P5))*100)-((INT(I5)*60)+((I5-INT(I5))*100)),0)","v":{"$error":"#VALUE!"}},{"$f":"IF(AND(N5<>0,I5<>0),IF(OR(L5=1,L5=3,L5=4),IF(OR(R5=0,ABS(R5)<='Barèmes & Options'!H$2),1,0)),\"\")","v":false},{"$f":"IF(AND(N5<>\"\",I5<>\"\"),IF(OR(L5=5,L5=7),IF(R5>0,1,0)),\"\")","v":""},{"$f":"IF(AND(N5<>\"\",I5<>\"\"),IF(OR(L5=2,L5=6,L5=8),IF(R5<0,1,0)),\"\")","v":""},{"$f":"IF(AND(N5<>0,P5<>0),IF(OR(L5=1,L5=5,L5=6),IF(OR(S5=0,ABS(S5)<='Barèmes & Options'!H$2),1,0)),\"\")","v":false},{"$f":"IF(AND(N5<>\"\",P5<>\"\"),IF(OR(L5=4,L5=8),IF(S5>0,1,0)),\"\")","v":""},{"$f":"IF(AND(N5<>\"\",P5<>\"\"),IF(OR(L5=2,L5=3,L5=7),IF(S5<0,1,0)),\"\")","v":""},{"$f":"IF(SUM(U5:Z5)=2,IF(L5=2,IF(L5=2,IF(T5-'Barèmes & Options'!H$2<-1,0,1)),\"\"),0)","v":0},{"$f":"IF(OR(L5=2,L5=9),SUM(U5:Z5)-AA5,SUM(U5:Z5))","v":0},{"$f":"IF(L5<>\"\",IF(AND(L5>=1,L5<=8,L5=ABS(L5)),IF(AND(L5<=9,L5>=1),IF(AND(AB5=1,K5<>\"\"),1,IF(AND(AB5=1,K5=\"\"),2,IF(AND(AB5=2,K5<>\"\"),2.5,IF(AND(AB5=2,K5=\"\"),3,0)))),\"\"),\"Err. Profil\"),\"\")","v":""},{"$f":"IF(G5<>\"\",IF(ROUND(J5,0)<=3,1,0),\"\")","v":""},{"$f":"IF(AND(P5<>\"\",N5<>\"\",I5<>\"\"),IF($C5=\"\",\"SX\",IF($C5=\"F\",VLOOKUP(ROUND($Q5,0)/100,Barème500,3),VLOOKUP(ROUND($Q5,0)/100,Barème500,2))),\"\")","v":""},null,{"$f":"IF(OR(AF5=\"\",AF5=\"\",AE5=\"\",AD5=\"\",AC5=\"\"),\"\",IF(OR(AF5<0,AF5>2),\"Err ech.\",SUM(AF5,AE5,AD5,AC5)))","v":""},null,"moyenne G. :",{"$f":"IF(ISERROR(AN5),\"\",AN5)","v":""},null,null,"m",{"$f":"AVERAGEIF(AM4:AM101,\"m\",AG4:AG101)","v":{"$error":"#DIV/0!"}},"garçons"]
[null,null,null,null,null,null,"",null,"","",null,"",null,"",null,"","",{"$error":"#VALUE!"},{"$error":"#VALUE!"},{"$error":"#VALUE!"},{"$f":"IF(AND(N6<>0,I6<>0),IF(OR(L6=1,L6=3,L6=4),IF(OR(R6=0,ABS(R6)<='Barèmes & Options'!H$2),1,0)),\"\")","v":false},"","",{"$f":"IF(AND(N6<>0,P6<>0),IF(OR(L6=1,L6=5,L6=6),IF(OR(S6=0,ABS(S6)<='Barèmes & Options'!H$2),1,0)),\"\")","v":false},"","",{"$f":"IF(SUM(U6:Z6)=2,IF(L6=2,IF(L6=2,IF(T6-'Barèmes & Options'!H$2<-1,0,1)),\"\"),0)","v":0},0,"","",{"$f":"IF(AND(P6<>\"\",N6<>\"\",I6<>\"\"),IF($C6=\"\",\"SX\",IF($C6=\"F\",VLOOKUP(ROUND($Q6,0)/100,Barème500,3),VLOOKUP(ROUND($Q6,0)/100,Barème500,2))),\"\")","v":""},null,"",null,"Moyenne :",{"$f":"IF(ISERROR(AN6),\"\",AN6)","v":""},null,null,"m",{"$f":"AVERAGE(AG4:AG101)","v":{"$error":"#DIV/0!"}},"géné"]
[null,null,null,null,null,null,"",null,"","",null,"",null,"",null,"","",{"$error":"#VALUE!"},{"$error":"#VALUE!"},{"$error":"#VALUE!"},{"$f":"IF(AND(N7<>0,I7<>0),IF(OR(L7=1,L7=3,L7=4),IF(OR(R7=0,ABS(R7)<='Barèmes & Options'!H$2),1,0)),\"\")","v":false},"","",{"$f":"IF(AND(N7<>0,P7<>0),IF(OR(L7=1,L7=5,L7=6),IF(OR(S7=0,ABS(S7)<='Barèmes & Options'!H$2),1,0)),\"\")","v":false},"","",{"$f":"IF(SUM(U7:Z7)=2,IF(L7=2,IF(L7=2,IF(T7-'Barèmes & Options'!H$2<-1,0,1)),\"\"),0)","v":0},0,"","",{"$f":"IF(AND(P7<>\"\",N7<>\"\",I7<>\"\"),IF($C7=\"\",\"SX\",IF($C7=\"F\",VLOOKUP(ROUND($Q7,0)/100,Barème500,3),VLOOKUP(ROUND($Q7,0)/100,Barème500,2))),\"\")","v":""},null,"",null,"Note max :",{"$f":"IF(COUNT(AG4:AG101)>0,MAX(AG4:AG101),\"\")","v":""},null,null,"m"]
[null,null,null,null,null,null,"",null,"","",null,"",null,"",null,"","",{"$error":"#VALUE!"},{"$error":"#VALUE!"},{"$error":"#VALUE!"},{"$f":"IF(AND(N8<>0,I8<>0),IF(OR(L8=1,L8=3,L8=4),IF(OR(R8=0,ABS(R8)<='Barèmes & Options'!H$2),1,0)),\"\")","v":false},"","",{"$f":"IF(AND(N8<>0,P8<>0),IF(OR(L8=1,L8=5,L8=6),IF(OR(S8=0,ABS(S8)<='Barèmes & Options'!H$2),1,0)),\"\")","v":false},"","",{"$f":"IF(SUM(U8:Z8)=2,IF(L8=2,IF(L8=2,IF(T8-'Barèmes & Options'!H$2<-1,0,1)),\"\"),0)","v":0},0,"","",{"$f":"IF(AND(P8<>\"\",N8<>\"\",I8<>\"\"),IF($C8=\"\",\"SX\",IF($C8=\"F\",VLOOKUP(ROUND($Q8,0)/100,Barème500,3),VLOOKUP(ROUND($Q8,0)/100,Barème500,2))),\"\")","v":""},null,"",null,"Note min :",{"$f":"IF(COUNT(AG4:AG101)>0,MIN(AG4:AG101),\"\")","v":""},null,null,"m"]
[null,null,null,null,null,null,"",null,"","",null,"",null,"",null,"","",{"$error":"#VALUE!"},{"$error":"#VALUE!"},{"$error":"#VALUE!"},{"$f":"IF(AND(N9<>0,I9<>0),IF(OR(L9=1,L9=3,L9=4),IF(OR(R9=0,ABS(R9)<='Barèmes & Options'!H$2),1,0)),\"\")","v":false},"","",{"$f":"IF(AND(N9<>0,P9<>0),IF(OR(L9=1,L9=5,L9=6),IF(OR(S9=0,ABS(S9)<='Barèmes & Options'!H$2),1,0)),\"\")","v":false},"","",{"$f":"IF(SUM(U9:Z9)=2,IF(L9=2,IF(L9=2,IF(T9-'Barèmes & Options'!H$2<-1,0,1)),\"\"),0)","v":0},0,"","",{"$f":"IF(AND(P9<>\"\",N9<>\"\",I9<>\"\"),IF($C9=\"\",\"SX\",IF($C9=\"F\",VLOOKUP(ROUND($Q9,0)/100,Barème500,3),VLOOKUP(ROUND($Q9,0)/100,Barème500,2))),\"\")","v":""},null,"",null,null,null,null,null,"m"]
[null,null,null,null,null,null,"",null,"","",null,"",null,"",null,"","",{"$error":"#VALUE!"},{"$error":"#VALUE!"},{"$error":"#VALUE!"},{"$f":"IF(AND(N10<>0,I10<>0),IF(OR(L10=1,L10=3,L10=4),IF(OR(R10=0,ABS(R10)<='Barèmes & Options'!H$2),1,0)),\"\")","v":false},"","",{"$f":"IF(AND(N10<>0,P10<>0),IF(OR(L10=1,L10=5,L10=6),IF(OR(S10=0,ABS(S10)<='Barèmes & Options'!H$2),1,0)),\"\")","v":false},"","",{"$f":"IF(SUM(U10:Z10)=2,IF(L10=2,IF(L10=2,IF(T10-'Barèmes & Options'!H$2<-1,0,1)),\"\"),0)","v":0},0,"","",{"$f":"IF(AND(P10<>\"\",N10<>\"\",I10<>\"\"),IF($C10=\"\",\"SX\",IF($C10=\"F\",VLOOKUP(ROUND($Q10,0)/100,Barème500,3),VLOOKUP(ROUND($Q10,0)/100,Barème500,2))),\"\")","v":""},null,"",null,"Date :",null,null,null,"m"]
[null,null,null,null,null,null,"",null,"","",null,"",null,"",null,"","",{"$error":"#VALUE!"},{"$error":"#VALUE!"},{"$error":"#VALUE!"},{"$f":"IF(AND(N11<>0,I11<>0),IF(OR(L11=1,L11=3,L11=4),IF(OR(R11=0,ABS(R11)<='Barèmes & Options'!H$2),1,0)),\"\")","v":false},"","",{"$f":"IF(AND(N11<>0,P11<>0),IF(OR(L11=1,L11=5,L11=6),IF(OR(S11=0,ABS(S11)<='Barèmes & Options'!H$2),1,0)),\"\")","v":false},"","",{"$f":"IF(SUM(U11:Z11)=2,IF(L11=2,IF(L11=2,IF(T11-'Barèmes & Options'!H$2<-1,0,1)),\"\"),0)","v":0},0,"","",{"$f":"IF(AND(P11<>\"\",N11<>\"\",I11<>\"\"),IF($C11=\"\",\"SX\",IF($C11=\"F\",VLOOKUP(ROUND($Q11,0)/100,Barème500,3),VLOOKUP(ROUND($Q11,0)/100,Barème500,2))),\"\")","v":""},null,"",null,null,null,null,null,"m"]
[null,null,null,null,null,null,"",null,"","",null,"",null,"",null,"","",{"$error":"#VALUE!"},{"$error":"#VALUE!"},{"$error":"#VALUE!"},{"$f":"IF(AND(N12<>0,I12<>0),IF(OR(L12=1,L12=3,L12=4),IF(OR(R12=0,ABS(R12)<='Barèmes & Options'!H$2),1,0)),\"\")","v":false},"","",{"$f":"IF(AND(N12<>0,P12<>0),IF(OR(L12=1,L12=5,L12=6),IF(OR(S12=0,ABS(S12)<='Barèmes & Options'!H$2),1,0)),\"\")","v":false},"","",{"$f":"IF(SUM(U12:Z12)=2,IF(L12=2,IF(L12=2,IF(T12-'Barèmes & Options'!H$2<-1,0,1)),\"\"),0)","v":0},0,"","",{"$f":"IF(AND(P12<>\"\",N12<>\"\",I12<>\"\"),IF($C12=\"\",\"SX\",IF($C12=\"F\",VLOOKUP(ROUND($Q12,0)/100,Barème500,3),VLOOKUP(ROUND($Q12,0)/100,Barème500,2))),\"\")","v":""},null,"",null,null,null,null,null,"m"]
[null,null,null,null,null,null,"",null,"","",null,"",null,"",null,"","",{"$error":"#VALUE!"},{"$error":"#VALUE!"},{"$error":"#VALUE!"},{"$f":"IF(AND(N13<>0,I13<>0),IF(OR(L13=1,L13=3,L13=4),IF(OR(R13=0,ABS(R13)<='Barèmes & Options'!H$2),1,0)),\"\")","v":false},"","",{"$f":"IF(AND(N13<>0,P13<>0),IF(OR(L13=1,L13=5,L13=6),IF(OR(S13=0,ABS(S13)<='Barèmes & Options'!H$2),1,0)),\"\")","v":false},"","",{"$f":"IF(SUM(U13:Z13)=2,IF(L13=2,IF(L13=2,IF(T13-'Barèmes & Options'!H$2<-1,0,1)),\"\"),0)","v":0},0,"","",{"$f":"IF(AND(P13<>\"\",N13<>\"\",I13<>\"\"),IF($C13=\"\",\"SX\",IF($C13=\"F\",VLOOKUP(ROUND($Q13,0)/100,Barème500,3),VLOOKUP(ROUND($Q13,0)/100,Barème500,2))),\"\")","v":""},null,"",null,null,null,null,null,"m"]
[null,null,null,null,null,null,"",null,"","",null,"",null,"",null,"","",{"$error":"#VALUE!"},{"$error":"#VALUE!"},{"$error":"#VALUE!"},{"$f":"IF(AND(N14<>0,I14<>0),IF(OR(L14=1,L14=3,L14=4),IF(OR(R14=0,ABS(R14)<='Barèmes & Options'!H$2),1,0)),\"\")","v":false},"","",{"$f":"IF(AND(N14<>0,P14<>0),IF(OR(L14=1,L14=5,L14=6),IF(OR(S14=0,ABS(S14)<='Barèmes & Options'!H$2),1,0)),\"\")","v":false},"","",{"$f":"IF(SUM(U14:Z14)=2,IF(L14=2,IF(L14=2,IF(T14-'Barèmes & Options'!H$2<-1,0,1)),\"\"),0)","v":0},0,"","",{"$f":"IF(AND(P14<>\"\",N14<>\"\",I14<>\"\"),IF($C14=\"\",\"SX\",IF($C14=\"F\",VLOOKUP(ROUND($Q14,0)/100,Barème500,3),VLOOKUP(ROUND($Q14,0)/100,Barème500,2))),\"\")","v":""},null,"",null,null,null,null,null,"m"]
[null,null,null,null,null,null,"",null,"","",null,"",null,"",null,"","",{"$error":"#VALUE!"},{"$error":"#VALUE!"},{"$error":"#VALUE!"},{"$f":"IF(AND(N15<>0,I15<>0),IF(OR(L15=1,L15=3,L15=4),IF(OR(R15=0,ABS(R15)<='Barèmes & Options'!H$2),1,0)),\"\")","v":false},"","",{"$f":"IF(AND(N15<>0,P15<>0),IF(OR(L15=1,L15=5,L15=6),IF(OR(S15=0,ABS(S15)<='Barèmes & Options'!H$2),1,0)),\"\")","v":false},"","",{"$f":"IF(SUM(U15:Z15)=2,IF(L15=2,IF(L15=2,IF(T15-'Barèmes & Options'!H$2<-1,0,1)),\"\"),0)","v":0},0,"","",{"$f":"IF(AND(P15<>\"\",N15<>\"\",I15<>\"\"),IF($C15=\"\",\"SX\",IF($C15=\"F\",VLOOKUP(ROUND($Q15,0)/100,Barème500,3),VLOOKUP(ROUND($Q15,0)/100,Barème500,2))),\"\")","v":""},null,"",null,null,null,null,null,"m"]
[null,null,null,null,null,null,"",null,"","",null,"",null,"",null,"","",{"$error":"#VALUE!"},{"$error":"#VALUE!"},{"$error":"#VALUE!"},{"$f":"IF(AND(N16<>0,I16<>0),IF(OR(L16=1,L16=3,L16=4),IF(OR(R16=0,ABS(R16)<='Barèmes & Options'!H$2),1,0)),\"\")","v":false},"","",{"$f":"IF(AND(N16<>0,P16<>0),IF(OR(L16=1,L16=5,L16=6),IF(OR(S16=0,ABS(S16)<='Barèmes & Options'!H$2),1,0)),\"\")","v":false},"","",{"$f":"IF(SUM(U16:Z16)=2,IF(L16=2,IF(L16=2,IF(T16-'Barèmes & Options'!H$2<-1,0,1)),\"\"),0)","v":0},0,"","",{"$f":"IF(AND(P16<>\"\",N16<>\"\",I16<>\"\"),IF($C16=\"\",\"SX\",IF($C16=\"F\",VLOOKUP(ROUND($Q16,0)/100,Barème500,3),VLOOKUP(ROUND($Q16,0)/100,Barème500,2))),\"\")","v":""},null,"",null,null,null,null,null,"m"]
[null,null,null,null,null,null,"",null,"","",null,"",null,"",null,"","",{"$error":"#VALUE!"},{"$error":"#VALUE!"},{"$error":"#VALUE!"},{"$f":"IF(AND(N17<>0,I17<>0),IF(OR(L17=1,L17=3,L17=4),IF(OR(R17=0,ABS(R17)<='Barèmes & Options'!H$2),1,0)),\"\")","v":false},"","",{"$f":"IF(AND(N17<>0,P17<>0),IF(OR(L17=1,L17=5,L17=6),IF(OR(S17=0,ABS(S17)<='Barèmes & Options'!H$2),1,0)),\"\")","v":false},"","",{"$f":"IF(SUM(U17:Z17)=2,IF(L17=2,IF(L17=2,IF(T17-'Barèmes & Options'!H$2<-1,0,1)),\"\"),0)","v":0},0,"","",{"$f":"IF(AND(P17<>\"\",N17<>\"\",I17<>\"\"),IF($C17=\"\",\"SX\",IF($C17=\"F\",VLOOKUP(ROUND($Q17,0)/100,Barème500,3),VLOOKUP(ROUND($Q17,0)/100,Barème500,2))),\"\")","v":""},null,"",null,null,null,null,null,"m"]
[null,null,null,null,null,null,"",null,"","",null,"",null,"",null,"","",{"$error":"#VALUE!"},{"$error":"#VALUE!"},{"$error":"#VALUE!"},{"$f":"IF(AND(N18<>0,I18<>0),IF(OR(L18=1,L18=3,L18=4),IF(OR(R18=0,ABS(R18)<='Barèmes & Options'!H$2),1,0)),\"\")","v":false},"","",{"$f":"IF(AND(N18<>0,P18<>0),IF(OR(L18=1,L18=5,L18=6),IF(OR(S18=0,ABS(S18)<='Barèmes & Options'!H$2),1,0)),\"\")","v":false},"","",{"$f":"IF(SUM(U18:Z18)=2,IF(L18=2,IF(L18=2,IF(T18-'Barèmes & Options'!H$2<-1,0,1)),\"\"),0)","v":0},0,"","",{"$f":"IF(AND(P18<>\"\",N18<>\"\",I18<>\"\"),IF($C18=\"\",\"SX\",IF($C18=\"F\",VLOOKUP(ROUND($Q18,0)/100,Barème500,3),VLOOKUP(ROUND($Q18,0)/100,Barème500,2))),\"\")","v":""},null,"",null,null,null,null,null,"m"]
[null,null,null,null,null,null,"",null,"","",null,"",null,"",null,"","",{"$error":"#VALUE!"},{"$error":"#VALUE!"},{"$error":"#VALUE!"},{"$f":"IF(AND(N19<>0,I19<>0),IF(OR(L19=1,L19=3,L19=4),IF(OR(R19=0,ABS(R19)<='Barèmes & Options'!H$2),1,0)),\"\")","v":false},"","",{"$f":"IF(AND(N19<>0,P19<>0),IF(OR(L19=1,L19=5,L19=6),IF(OR(S19=0,ABS(S19)<='Barèmes & Options'!H$2),1,0)),\"\")","v":false},"","",{"$f":"IF(SUM(U19:Z19)=2,IF(L19=2,IF(L19=2,IF(T19-'Barèmes & Options'!H$2<-1,0,1)),\"\"),0)","v":0},0,"","",{"$f":"IF(AND(P19<>\"\",N19<>\"\",I19<>\"\"),IF($C19=\"\",\"SX\",IF($C19=\"F\",VLOOKUP(ROUND($Q19,0)/100,Barème500,3),VLOOKUP(ROUND($Q19,0)/100,Barème500,2))),\"\")","v":""},null,"",null,null,null,null,null,"m"]
[null,null,null,null,null,null,"",null,"","",null,"",null,"",null,"","",{"$error":"#VALUE!"},{"$error":"#VALUE!"},{"$error":"#VALUE!"},{"$f":"IF(AND(N20<>0,I20<>0),IF(OR(L20=1,L20=3,L20=4),IF(OR(R20=0,ABS(R20)<='Barèmes & Options'!H$2),1,0)),\"\")","v":false},"","",{"$f":"IF(AND(N20<>0,P20<>0),IF(OR(L20=1,L20=5,L20=6),IF(OR(S20=0,ABS(S20)<='Barèmes & Options'!H$2),1,0)),\"\")","v":false},"","",{"$f":"IF(SUM(U20:Z20)=2,IF(L20=2,IF(L20=2,IF(T20-'Barèmes & Options'!H$2<-1,0,1)),\"\"),0)","v":0},0,"","",{"$f":"IF(AND(P20<>\"\",N20<>\"\",I20<>\"\"),IF($C20=\"\",\"SX\",IF($C20=\"F\",VLOOKUP(ROUND($Q20,0)/100,Barème500,3),VLOOKUP(ROUND($Q20,0)/100,Barème500,2))),\"\")","v":""},null,"",null,null,null,null,null,"m"]
[null,null,null,null,null,null,"",null,"","",null,"",null,"",null,"","",{"$error":"#VALUE!"},{"$error":"#VALUE!"},{"$error":"#VALUE!"},{"$f":"IF(AND(N21<>0,I21<>0),IF(OR(L21=1,L21=3,L21=4),IF(OR(R21=0,ABS(R21)<='Barèmes & Options'!H$2),1,0)),\"\")","v":false},"","",{"$f":"IF(AND(N21<>0,P21<>0),IF(OR(L21=1,L21=5,L21=6),IF(OR(S21=0,ABS(S21)<='Barèmes & Options'!H$2),1,0)),\"\")","v":false},"","",{"$f":"IF(SUM(U21:Z21)=2,IF(L21=2,IF(L21=2,IF(T21-'Barèmes & Options'!H$2<-1,0,1)),\"\"),0)","v":0},0,"","",{"$f":"IF(AND(P21<>\"\",N21<>\"\",I21<>\"\"),IF($C21=\"\",\"SX\",IF($C21=\"F\",VLOOKUP(ROUND($Q21,0)/100,Barème500,3),VLOOKUP(ROUND($Q21,0)/100,Barème500,2))),\"\")","v":""},null,"",null,null,null,null,null,"m"]
[null,null,null,null,null,null,"",null,"","",null,"",null,"",null,"","",{"$error":"#VALUE!"},{"$error":"#VALUE!"},{"$error":"#VALUE!"},{"$f":"IF(AND(N22<>0,I22<>0),IF(OR(L22=1,L22=3,L22=4),IF(OR(R22=0,ABS(R22)<='Barèmes & Options'!H$2),1,0)),\"\")","v":false},"","",{"$f":"IF(AND(N22<>0,P22<>0),IF(OR(L22=1,L22=5,L22=6),IF(OR(S22=0,ABS(S22)<='Barèmes & Options'!H$2),1,0)),\"\")","v":false},"","",{"$f":"IF(SUM(U22:Z22)=2,IF(L22=2,IF(L22=2,IF(T22-'Barèmes & Options'!H$2<-1,0,1)),\"\"),0)","v":0},0,"","",{"$f":"IF(AND(P22<>\"\",N22<>\"\",I22<>\"\"),IF($C22=\"\",\"SX\",IF($C22=\"F\",VLOOKUP(ROUND($Q22,0)/100,Barème500,3),VLOOKUP(ROUND($Q22,0)/100,Barème500,2))),\"\")","v":""},null,"",null,null,null,null,null,"m"]
[null,null,null,null,null,null,"",null,"","",null,"",null,"",null,"","",{"$error":"#VALUE!"},{"$error":"#VALUE!"},{"$error":"#VALUE!"},{"$f":"IF(AND(N23<>0,I23<>0),IF(OR(L23=1,L23=3,L23=4),IF(OR(R23=0,ABS(R23)<='Barèmes & Options'!H$2),1,0)),\"\")","v":false},"","",{"$f":"IF(AND(N23<>0,P23<>0),IF(OR(L23=1,L23=5,L23=6),IF(OR(S23=0,ABS(S23)<='Barèmes & Options'!H$2),1,0)),\"\")","v":false},"","",{"$f":"IF(SUM(U23:Z23)=2,IF(L23=2,IF(L23=2,IF(T23-'Barèmes & Options'!H$2<-1,0,1)),\"\"),0)","v":0},0,"","",{"$f":"IF(AND(P23<>\"\",N23<>\"\",I23<>\"\"),IF($C23=\"\",\"SX\",IF($C23=\"F\",VLOOKUP(ROUND($Q23,0)/100,Barème500,3),VLOOKUP(ROUND($Q23,0)/100,Barème500,2))),\"\")","v":""},null,"",null,null,null,null,null,"m"]
[null,null,null,null,null,null,"",null,"","",null,"",null,"",null,"","",{"$error":"#VALUE!"},{"$error":"#VALUE!"},{"$error":"#VALUE!"},{"$f":"IF(AND(N24<>0,I24<>0),IF(OR(L24=1,L24=3,L24=4),IF(OR(R24=0,ABS(R24)<='Barèmes & Options'!H$2),1,0)),\"\")","v":false},"","",{"$f":"IF(AND(N24<>0,P24<>0),IF(OR(L24=1,L24=5,L24=6),IF(OR(S24=0,ABS(S24)<='Barèmes & Options'!H$2),1,0)),\"\")","v":false},"","",{"$f":"IF(SUM(U24:Z24)=2,IF(L24=2,IF(L24=2,IF(T24-'Barèmes & Options'!H$2<-1,0,1)),\"\"),0)","v":0},0,"","",{"$f":"IF(AND(P24<>\"\",N24<>\"\",I24<>\"\"),IF($C24=\"\",\"SX\",IF($C24=\"F\",VLOOKUP(ROUND($Q24,0)/100,Barème500,3),VLOOKUP(ROUND($Q24,0)/100,Barème500,2))),\"\")","v":""},null,"",null,null,null,null,null,"m"]
[null,null,null,null,null,null,"",null,"","",null,"",null,"",null,"","",{"$error":"#VALUE!"},{"$error":"#VALUE!"},{"$error":"#VALUE!"},{"$f":"IF(AND(N25<>0,I25<>0),IF(OR(L25=1,L25=3,L25=4),IF(OR(R25=0,ABS(R25)<='Barèmes & Options'!H$2),1,0)),\"\")","v":false},"","",{"$f":"IF(AND(N25<>0,P25<>0),IF(OR(L25=1,L25=5,L25=6),IF(OR(S25=0,ABS(S25)<='Barèmes & Options'!H$2),1,0)),\"\")","v":false},"","",{"$f":"IF(SUM(U25:Z25)=2,IF(L25=2,IF(L25=2,IF(T25-'Barèmes & Options'!H$2<-1,0,1)),\"\"),0)","v":0},0,"","",{"$f":"IF(AND(P25<>\"\",N25<>\"\",I25<>\"\"),IF($C25=\"\",\"SX\",IF($C25=\"F\",VLOOKUP(ROUND($Q25,0)/100,Barème500,3),VLOOKUP(ROUND($Q25,0)/100,Barème500,2))),\"\")","v":""},null,"",null,null,null,null,null,"m"]
[null,null,null,null,null,null,"",null,"","",null,"",null,"",null,"","",{"$error":"#VALUE!"},{"$error":"#VALUE!"},{"$error":"#VALUE!"},{"$f":"IF(AND(N26<>0,I26<>0),IF(OR(L26=1,L26=3,L26=4),IF(OR(R26=0,ABS(R26)<='Barèmes & Options'!H$2),1,0)),\"\")","v":false},"","",{"$f":"IF(AND(N26<>0,P26<>0),IF(OR(L26=1,L26=5,L26=6),IF(OR(S26=0,ABS(S26)<='Barèmes & Options'!H$2),1,0)),\"\")","v":false},"","",{"$f":"IF(SUM(U26:Z26)=2,IF(L26=2,IF(L26=2,IF(T26-'Barèmes & Options'!H$2<-1,0,1)),\"\"),0)","v":0},0,"","",{"$f":"IF(AND(P26<>\"\",N26<>\"\",I26<>\"\"),IF($C26=\"\",\"SX\",IF($C26=\"F\",VLOOKUP(ROUND($Q26,0)/100,Barème500,3),VLOOKUP(ROUND($Q26,0)/100,Barème500,2))),\"\")","v":""},null,"",null,null,null,null,null,"m"]
[null,null,null,null,null,null,"",null,"","",null,"",null,"",null,"","",{"$error":"#VALUE!"},{"$error":"#VALUE!"},{"$error":"#VALUE!"},{"$f":"IF(AND(N27<>0,I27<>0),IF(OR(L27=1,L27=3,L27=4),IF(OR(R27=0,ABS(R27)<='Barèmes & Options'!H$2),1,0)),\"\")","v":false},"","",{"$f":"IF(AND(N27<>0,P27<>0),IF(OR(L27=1,L27=5,L27=6),IF(OR(S27=0,ABS(S27)<='Barèmes & Options'!H$2),1,0)),\"\")","v":false},"","",{"$f":"IF(SUM(U27:Z27)=2,IF(L27=2,IF(L27=2,IF(T27-'Barèmes & Options'!H$2<-1,0,1)),\"\"),0)","v":0},0,"","",{"$f":"IF(AND(P27<>\"\",N27<>\"\",I27<>\"\"),IF($C27=\"\",\"SX\",IF($C27=\"F\",VLOOKUP(ROUND($Q27,0)/100,Barème500,3),VLOOKUP(ROUND($Q27,0)/100,Barème500,2))),\"\")","v":""},null,"",null,null,null,null,null,"m"]
[null,null,null,null,null,null,"",null,"","",null,"",null,"",null,"","",{"$error":"#VALUE!"},{"$error":"#VALUE!"},{"$error":"#VALUE!"},{"$f":"IF(AND(N28<>0,I28<>0),IF(OR(L28=1,L28=3,L28=4),IF(OR(R28=0,ABS(R28)<='Barèmes & Options'!H$2),1,0)),\"\")","v":false},"","",{"$f":"IF(AND(N28<>0,P28<>0),IF(OR(L28=1,L28=5,L28=6),IF(OR(S28=0,ABS(S28)<='Barèmes & Options'!H$2),1,0)),\"\")","v":false},"","",{"$f":"IF(SUM(U28:Z28)=2,IF(L28=2,IF(L28=2,IF(T28-'Barèmes & Options'!H$2<-1,0,1)),\"\"),0)","v":0},0,"","",{"$f":"IF(AND(P28<>\"\",N28<>\"\",I28<>\"\"),IF($C28=\"\",\"SX\",IF($C28=\"F\",VLOOKUP(ROUND($Q28,0)/100,Barème500,3),VLOOKUP(ROUND($Q28,0)/100,Barème500,2))),\"\")","v":""},null,"",null,null,null,null,null,"m"]
[null,null,null,null,null,null,"",null,"","",null,"",null,"",null,"","",{"$error":"#VALUE!"},{"$error":"#VALUE!"},{"$error":"#VALUE!"},{"$f":"IF(AND(N29<>0,I29<>0),IF(OR(L29=1,L29=3,L29=4),IF(OR(R29=0,ABS(R29)<='Barèmes & Options'!H$2),1,0)),\"\")","v":false},"","",{"$f":"IF(AND(N29<>0,P29<>0),IF(OR(L29=1,L29=5,L29=6),IF(OR(S29=0,ABS(S29)<='Barèmes & Options'!H$2),1,0)),\"\")","v":false},"","",{"$f":"IF(SUM(U29:Z29)=2,IF(L29=2,IF(L29=2,IF(T29-'Barèmes & Options'!H$2<-1,0,1)),\"\"),0)","v":0},0,"","",{"$f":"IF(AND(P29<>\"\",N29<>\"\",I29<>\"\"),IF($C29=\"\",\"SX\",IF($C29=\"F\",VLOOKUP(ROUND($Q29,0)/100,Barème500,3),VLOOKUP(ROUND($Q29,0)/100,Barème500,2))),\"\")","v":""},null,"",null,null,null,null,null,"m"]
[null,null,null,null,null,null,"",null,"","",null,"",null,"",null,"","",{"$error":"#VALUE!"},{"$error":"#VALUE!"},{"$error":"#VALUE!"},{"$f":"IF(AND(N30<>0,I30<>0),IF(OR(L30=1,L30=3,L30=4),IF(OR(R30=0,ABS(R30)<='Barèmes & Options'!H$2),1,0)),\"\")","v":false},"","",{"$f":"IF(AND(N30<>0,P30<>0),IF(OR(L30=1,L30=5,L30=6),IF(OR(S30=0,ABS(S30)<='Barèmes & Options'!H$2),1,0)),\"\")","v":false},"","",{"$f":"IF(SUM(U30:Z30)=2,IF(L30=2,IF(L30=2,IF(T30-'Barèmes & Options'!H$2<-1,0,1)),\"\"),0)","v":0},0,"","",{"$f":"IF(AND(P30<>\"\",N30<>\"\",I30<>\"\"),IF($C30=\"\",\"SX\",IF($C30=\"F\",VLOOKUP(ROUND($Q30,0)/100,Barème500,3),VLOOKUP(ROUND($Q30,0)/100,Barème500,2))),\"\")","v":""},null,"",null,null,null,null,null,"m"]
{"$rows_left_out":72}
{"sheet":"Barèmes & Options","index":2,"n_rows":218,"n_cols":8,"rows_kept":218,"cut":false,"hidden":false,"merged":[[0,0,0,2]]}
["Barème 1500"]
["temps","G","F",null,null,null,"Tolérance En sec. :",1]
[3,14,14]
[4.0999999999999996,14,14]
[4.1100000000000003,13.9,14]
[4.12,13.8,14]
[4.13,13.6,14]
[4.1399999999999997,13.5,14]
[4.1500000000000004,13.3,14]
[4.16,13.1,14]
[4.17,12.9,14]
[4.18,12.7,14]
[4.1900000000000004,12.6,14]
[4.2,12.5,14]
[4.21,12.4,14]
[4.22,12.2,14]
[4.2300000000000004,12.1,14]
[4.24,11.9,14]
[4.25,11.8,14]
[4.26,11.7,14]
[4.2699999999999996,11.5,14]
[4.28,11.3,14]
[4.29,11.2,14]
[4.3,11.1,14]
[4.3099999999999996,10.9,14]
[4.32,10.8,14]
[4.33,10.6,14]
[4.34,10.5,14]
[4.3499999999999996,10.4,14]
[4.3600000000000003,10.3,14]
{"$rows_left_out":189}
{"sheet":"Présentation des profils","index":3,"n_rows":0,"n_cols":0,"rows_kept":0,"cut":false,"hidden":false,"merged":[]}