{"text_format":"1","workbook":"xlsx","n_sheets":4,"sheets":["Accueil","Evaluation","Barèmes & Options","Présentation des profils"],"not_rendered":{"charts":0,"images":1,"macros":1,"external_links":0,"defined_names":395,"comments":1,"pivot_tables":0},"unopened":[],"bounds":{"document_bytes":16777216,"sheet_cells":100000,"rows_first":2000,"rows_last":500,"rows_between":2000,"halvings":0,"cell_chars":16384,"cell_head_chars":4096},"cells_cut":0,"cells_raw":0,"read":"whole","date_system":"1900"}

{"sheet":"Accueil","index":0,"n_rows":0,"n_cols":0,"rows_kept":0,"cut":false,"hidden":false,"merged":[]}

{"sheet":"Evaluation","index":1,"n_rows":101,"n_cols":37,"rows_kept":101,"cut":false,"hidden":false,"merged":[[0,0,0,28]]}
["Course de demi-fond CAP-BEP  N3 - 2018"]
[]
["Nom","Prénom","Sexe F ou M","Classe","Profil choisi","500-1","500-1","Profil si régulation","profil choisi","500-2","500-2","500-2","500-3","Temps Total","c2-c1","c3-c2","c3-c1","respect c1-c2=","respect c1-c2+","respect c1-c2-","respect C2-C3=","respect C2-C3+","respect C2-C3-","Respect Profile 9","points respect","points profil","Points perf","Points echauffement","Note",null,null,null,null,null,"Sexe"]
[null,null,null,null,null,null,{"$f":"IF(F4<>\"\",INT(F4/100)+((F4/100-INT(F4/100))),\"\")","v":""},null,{"$f":"IF(AND(E4=\"\",H4=\"\"),\"\",IF(H4=\"\",E4,H4))","v":""},null,{"$f":"IF(J4<>\"\",INT(J4/100)+((J4/100-INT(J4/100))),\"\")","v":""},null,{"$f":"IF(L4<>\"\",INT(L4/100)+((L4/100-INT(L4/100))),\"\")","v":""},{"$f":"IF(AND(M4<>\"\",K4<>\"\",G4<>\"\"),(INT(((INT($G4)*60)+(($G4-INT($G4))*100)+(INT($K4)*60)+(($K4-INT($K4))*100)+(INT($M4)*60)+(($M4-INT($M4))*100))/60)+MOD(((INT($G4)*60)+(($G4-INT($G4))*100)+(INT($K4)*60)+(($K4-INT($K4))*100)+(INT($M4)*60)+(($M4-INT($M4))*100)),60)/100)*100,\"\")","v":""},{"$f":"ROUND((INT(K4)*60)+((K4-INT(K4))*100)-((INT(G4)*60)+((G4-INT(G4))*100)),0)","v":{"$error":"#VALUE!"}},{"$f":"ROUND((INT(M4)*60)+((M4-INT(M4))*100)-((INT(K4)*60)+((K4-INT(K4))*100)),0)","v":{"$error":"#VALUE!"}},{"$f":"ROUND((INT(M4)*60)+((M4-INT(M4))*100)-((INT(G4)*60)+((G4-INT(G4))*100)),0)","v":{"$error":"#VALUE!"}},{"$f":"IF(AND(K4<>\"\",G4<>\"\"),IF(OR(I4=1,I4=3,I4=4),IF(ABS(O4)<=3.5,1,0)),\"\")","v":""},{"$f":"IF(AND(K4<>\"\",G4<>\"\"),IF(OR(I4=5,I4=7),IF(O4>0,1,0)),\"\")","v":""},{"$f":"IF(AND(K4<>\"\",G4<>\"\"),IF(OR(I4=2,I4=6,I4=8),IF(O4<0,1,0)),\"\")","v":""},{"$f":"IF(AND(K4<>\"\",M4<>\"\"),IF(OR(I4=1,I4=5,I4=6),IF(ABS(P4)<=3.5,1,0)),\"\")","v":""},{"$f":"IF(AND(K4<>\"\",M4<>\"\"),IF(OR(I4=4,I4=8),IF(P4>0,1,0)),\"\")","v":""},{"$f":"IF(AND(K4<>\"\",M4<>\"\"),IF(OR(I4=2,I4=3,I4=7),IF(P4<0,1,0)),\"\")","v":""},{"$f":"IF(SUM(R4:W4)=2,IF(I4=2,IF(I4=2,IF(Q4-'Barèmes & Options'!H$2<-1,0,1)),\"\"),0)","v":0},{"$f":"IF(OR(I4=2,I4=9),SUM(R4:W4)-X4,SUM(R4:W4))","v":0},{"$f":"IF(I4<>\"\",IF(AND(I4>=1,I4<=8,I4=ABS(I4)),IF(AND(I4<=9,I4>=1),IF(AND(Y4=1,H4<>\"\"),1,IF(AND(Y4=1,H4=\"\"),2,IF(AND(Y4=2,H4<>\"\"),2.5,IF(AND(Y4=2,H4=\"\"),3,0)))),\"\"),\"Err. Profil\"),\"\")","v":""},{"$f":"IF(AND(M4<>\"\",K4<>\"\",G4<>\"\"),IF($C4=\"\",\"\",IF($C4=\"F\",VLOOKUP(ROUND($N4,0)/100,BARF,2),VLOOKUP(ROUND($N4,0)/100,BARG,2))),\"\")","v":""},null,{"$f":"IF(OR(AB4=\"\",AA4=\"\",Z4=\"\"),\"\",IF(OR(AB4<0,AB4>3),\"Err ech.\",SUM(AB4,AA4,Z4)))","v":""},null,"Moyenne F. :",{"$f":"IF(ISERROR(AJ4),\"\",AJ4)","v":""},null,null,{"$f":"IF(C4<>\"f\",\"m\",\"f\")","v":"m"},{"$f":"AVERAGEIF(AI4:AI101,\"f\",AC4:AC101)","v":{"$error":"#DIV/0!"}},"filles"]
[null,null,null,null,null,null,{"$f":"IF(F5<>\"\",INT(F5/100)+((F5/100-INT(F5/100))),\"\")","v":""},null,{"$f":"IF(AND(E5=\"\",H5=\"\"),\"\",IF(H5=\"\",E5,H5))","v":""},null,{"$f":"IF(J5<>\"\",INT(J5/100)+((J5/100-INT(J5/100))),\"\")","v":""},null,{"$f":"IF(L5<>\"\",INT(L5/100)+((L5/100-INT(L5/100))),\"\")","v":""},{"$f":"IF(AND(M5<>\"\",K5<>\"\",G5<>\"\"),(INT(((INT($G5)*60)+(($G5-INT($G5))*100)+(INT($K5)*60)+(($K5-INT($K5))*100)+(INT($M5)*60)+(($M5-INT($M5))*100))/60)+MOD(((INT($G5)*60)+(($G5-INT($G5))*100)+(INT($K5)*60)+(($K5-INT($K5))*100)+(INT($M5)*60)+(($M5-INT($M5))*100)),60)/100)*100,\"\")","v":""},{"$f":"ROUND((INT(K5)*60)+((K5-INT(K5))*100)-((INT(G5)*60)+((G5-INT(G5))*100)),0)","v":{"$error":"#VALUE!"}},{"$f":"ROUND((INT(M5)*60)+((M5-INT(M5))*100)-((INT(K5)*60)+((K5-INT(K5))*100)),0)","v":{"$error":"#VALUE!"}},{"$f":"ROUND((INT(M5)*60)+((M5-INT(M5))*100)-((INT(G5)*60)+((G5-INT(G5))*100)),0)","v":{"$error":"#VALUE!"}},{"$f":"IF(AND(K5<>\"\",G5<>\"\"),IF(OR(I5=1,I5=3,I5=4),IF(ABS(O5)<=3.5,1,0)),\"\")","v":""},{"$f":"IF(AND(K5<>\"\",G5<>\"\"),IF(OR(I5=5,I5=7),IF(O5>0,1,0)),\"\")","v":""},{"$f":"IF(AND(K5<>\"\",G5<>\"\"),IF(OR(I5=2,I5=6,I5=8),IF(O5<0,1,0)),\"\")","v":""},{"$f":"IF(AND(K5<>\"\",M5<>\"\"),IF(OR(I5=1,I5=5,I5=6),IF(ABS(P5)<=3.5,1,0)),\"\")","v":""},{"$f":"IF(AND(K5<>\"\",M5<>\"\"),IF(OR(I5=4,I5=8),IF(P5>0,1,0)),\"\")","v":""},{"$f":"IF(AND(K5<>\"\",M5<>\"\"),IF(OR(I5=2,I5=3,I5=7),IF(P5<0,1,0)),\"\")","v":""},{"$f":"IF(SUM(R5:W5)=2,IF(I5=2,IF(I5=2,IF(Q5-'Barèmes & Options'!H$2<-1,0,1)),\"\"),0)","v":0},{"$f":"IF(OR(I5=2,I5=9),SUM(R5:W5)-X5,SUM(R5:W5))","v":0},{"$f":"IF(I5<>\"\",IF(AND(I5>=1,I5<=8,I5=ABS(I5)),IF(AND(I5<=9,I5>=1),IF(AND(Y5=1,H5<>\"\"),1,IF(AND(Y5=1,H5=\"\"),2,IF(AND(Y5=2,H5<>\"\"),2.5,IF(AND(Y5=2,H5=\"\"),3,0)))),\"\"),\"Err. Profil\"),\"\")","v":""},{"$f":"IF(AND(M5<>\"\",K5<>\"\",G5<>\"\"),IF($C5=\"\",\"\",IF($C5=\"F\",VLOOKUP(ROUND($N5,0)/100,BARF,2),VLOOKUP(ROUND($N5,0)/100,BARG,2))),\"\")","v":""},null,{"$f":"IF(OR(AB5=\"\",AA5=\"\",Z5=\"\"),\"\",IF(OR(AB5<0,AB5>3),\"Err ech.\",SUM(AB5,AA5,Z5)))","v":""},null,"moyenne G. :",{"$f":"IF(ISERROR(AJ5),\"\",AJ5)","v":""},null,null,"m",{"$f":"AVERAGEIF(AI4:AI101,\"m\",AC4:AC101)","v":{"$error":"#DIV/0!"}},"garçons"]
[null,null,null,null,null,null,"",null,"",null,"",null,"","",{"$error":"#VALUE!"},{"$error":"#VALUE!"},{"$error":"#VALUE!"},"","","","","","",{"$f":"IF(SUM(R6:W6)=2,IF(I6=2,IF(I6=2,IF(Q6-'Barèmes & Options'!H$2<-1,0,1)),\"\"),0)","v":0},0,"",{"$f":"IF(AND(M6<>\"\",K6<>\"\",G6<>\"\"),IF($C6=\"\",\"\",IF($C6=\"F\",VLOOKUP(ROUND($N6,0)/100,BARF,2),VLOOKUP(ROUND($N6,0)/100,BARG,2))),\"\")","v":""},null,"",null,"Moyenne :",{"$f":"IF(ISERROR(AJ6),\"\",AJ6)","v":""},null,null,"m",{"$f":"AVERAGE(AC4:AC101)","v":{"$error":"#DIV/0!"}},"géné"]
[null,null,null,null,null,null,"",null,"",null,"",null,"","",{"$error":"#VALUE!"},{"$error":"#VALUE!"},{"$error":"#VALUE!"},"","","","","","",{"$f":"IF(SUM(R7:W7)=2,IF(I7=2,IF(I7=2,IF(Q7-'Barèmes & Options'!H$2<-1,0,1)),\"\"),0)","v":0},0,"",{"$f":"IF(AND(M7<>\"\",K7<>\"\",G7<>\"\"),IF($C7=\"\",\"\",IF($C7=\"F\",VLOOKUP(ROUND($N7,0)/100,BARF,2),VLOOKUP(ROUND($N7,0)/100,BARG,2))),\"\")","v":""},null,"",null,"Note max :",{"$f":"IF(COUNT(AC4:AC101)>0,MAX(AC4:AC101),\"\")","v":""},null,null,"m"]
[null,null,null,null,null,null,"",null,"",null,"",null,"","",{"$error":"#VALUE!"},{"$error":"#VALUE!"},{"$error":"#VALUE!"},"","","","","","",{"$f":"IF(SUM(R8:W8)=2,IF(I8=2,IF(I8=2,IF(Q8-'Barèmes & Options'!H$2<-1,0,1)),\"\"),0)","v":0},0,"",{"$f":"IF(AND(M8<>\"\",K8<>\"\",G8<>\"\"),IF($C8=\"\",\"\",IF($C8=\"F\",VLOOKUP(ROUND($N8,0)/100,BARF,2),VLOOKUP(ROUND($N8,0)/100,BARG,2))),\"\")","v":""},null,"",null,"Note min :",{"$f":"IF(COUNT(AC4:AC101)>0,MIN(AC4:AC101),\"\")","v":""},null,null,"m"]
[null,null,null,null,null,null,"",null,"",null,"",null,"","",{"$error":"#VALUE!"},{"$error":"#VALUE!"},{"$error":"#VALUE!"},"","","","","","",{"$f":"IF(SUM(R9:W9)=2,IF(I9=2,IF(I9=2,IF(Q9-'Barèmes & Options'!H$2<-1,0,1)),\"\"),0)","v":0},0,"",{"$f":"IF(AND(M9<>\"\",K9<>\"\",G9<>\"\"),IF($C9=\"\",\"\",IF($C9=\"F\",VLOOKUP(ROUND($N9,0)/100,BARF,2),VLOOKUP(ROUND($N9,0)/100,BARG,2))),\"\")","v":""},null,"",null,null,null,null,null,"m"]
[null,null,null,null,null,null,"",null,"",null,"",null,"","",{"$error":"#VALUE!"},{"$error":"#VALUE!"},{"$error":"#VALUE!"},"","","","","","",{"$f":"IF(SUM(R10:W10)=2,IF(I10=2,IF(I10=2,IF(Q10-'Barèmes & Options'!H$2<-1,0,1)),\"\"),0)","v":0},0,"",{"$f":"IF(AND(M10<>\"\",K10<>\"\",G10<>\"\"),IF($C10=\"\",\"\",IF($C10=\"F\",VLOOKUP(ROUND($N10,0)/100,BARF,2),VLOOKUP(ROUND($N10,0)/100,BARG,2))),\"\")","v":""},null,"",null,"Date :",null,null,null,"m"]
[null,null,null,null,null,null,"",null,"",null,"",null,"","",{"$error":"#VALUE!"},{"$error":"#VALUE!"},{"$error":"#VALUE!"},"","","","","","",{"$f":"IF(SUM(R11:W11)=2,IF(I11=2,IF(I11=2,IF(Q11-'Barèmes & Options'!H$2<-1,0,1)),\"\"),0)","v":0},0,"",{"$f":"IF(AND(M11<>\"\",K11<>\"\",G11<>\"\"),IF($C11=\"\",\"\",IF($C11=\"F\",VLOOKUP(ROUND($N11,0)/100,BARF,2),VLOOKUP(ROUND($N11,0)/100,BARG,2))),\"\")","v":""},null,"",null,null,null,null,null,"m"]
[null,null,null,null,null,null,"",null,"",null,"",null,"","",{"$error":"#VALUE!"},{"$error":"#VALUE!"},{"$error":"#VALUE!"},"","","","","","",{"$f":"IF(SUM(R12:W12)=2,IF(I12=2,IF(I12=2,IF(Q12-'Barèmes & Options'!H$2<-1,0,1)),\"\"),0)","v":0},0,"",{"$f":"IF(AND(M12<>\"\",K12<>\"\",G12<>\"\"),IF($C12=\"\",\"\",IF($C12=\"F\",VLOOKUP(ROUND($N12,0)/100,BARF,2),VLOOKUP(ROUND($N12,0)/100,BARG,2))),\"\")","v":""},null,"",null,null,null,null,null,"m"]
[null,null,null,null,null,null,"",null,"",null,"",null,"","",{"$error":"#VALUE!"},{"$error":"#VALUE!"},{"$error":"#VALUE!"},"","","","","","",{"$f":"IF(SUM(R13:W13)=2,IF(I13=2,IF(I13=2,IF(Q13-'Barèmes & Options'!H$2<-1,0,1)),\"\"),0)","v":0},0,"",{"$f":"IF(AND(M13<>\"\",K13<>\"\",G13<>\"\"),IF($C13=\"\",\"\",IF($C13=\"F\",VLOOKUP(ROUND($N13,0)/100,BARF,2),VLOOKUP(ROUND($N13,0)/100,BARG,2))),\"\")","v":""},null,"",null,null,null,null,null,"m"]
[null,null,null,null,null,null,"",null,"",null,"",null,"","",{"$error":"#VALUE!"},{"$error":"#VALUE!"},{"$error":"#VALUE!"},"","","","","","",{"$f":"IF(SUM(R14:W14)=2,IF(I14=2,IF(I14=2,IF(Q14-'Barèmes & Options'!H$2<-1,0,1)),\"\"),0)","v":0},0,"",{"$f":"IF(AND(M14<>\"\",K14<>\"\",G14<>\"\"),IF($C14=\"\",\"\",IF($C14=\"F\",VLOOKUP(ROUND($N14,0)/100,BARF,2),VLOOKUP(ROUND($N14,0)/100,BARG,2))),\"\")","v":""},null,"",null,null,null,null,null,"m"]
[null,null,null,null,null,null,"",null,"",null,"",null,"","",{"$error":"#VALUE!"},{"$error":"#VALUE!"},{"$error":"#VALUE!"},"","","","","","",{"$f":"IF(SUM(R15:W15)=2,IF(I15=2,IF(I15=2,IF(Q15-'Barèmes & Options'!H$2<-1,0,1)),\"\"),0)","v":0},0,"",{"$f":"IF(AND(M15<>\"\",K15<>\"\",G15<>\"\"),IF($C15=\"\",\"\",IF($C15=\"F\",VLOOKUP(ROUND($N15,0)/100,BARF,2),VLOOKUP(ROUND($N15,0)/100,BARG,2))),\"\")","v":""},null,"",null,null,null,null,null,"m"]
[null,null,null,null,null,null,"",null,"",null,"",null,"","",{"$error":"#VALUE!"},{"$error":"#VALUE!"},{"$error":"#VALUE!"},"","","","","","",{"$f":"IF(SUM(R16:W16)=2,IF(I16=2,IF(I16=2,IF(Q16-'Barèmes & Options'!H$2<-1,0,1)),\"\"),0)","v":0},0,"",{"$f":"IF(AND(M16<>\"\",K16<>\"\",G16<>\"\"),IF($C16=\"\",\"\",IF($C16=\"F\",VLOOKUP(ROUND($N16,0)/100,BARF,2),VLOOKUP(ROUND($N16,0)/100,BARG,2))),\"\")","v":""},null,"",null,null,null,null,null,"m"]
[null,null,null,null,null,null,"",null,"",null,"",null,"","",{"$error":"#VALUE!"},{"$error":"#VALUE!"},{"$error":"#VALUE!"},"","","","","","",{"$f":"IF(SUM(R17:W17)=2,IF(I17=2,IF(I17=2,IF(Q17-'Barèmes & Options'!H$2<-1,0,1)),\"\"),0)","v":0},0,"",{"$f":"IF(AND(M17<>\"\",K17<>\"\",G17<>\"\"),IF($C17=\"\",\"\",IF($C17=\"F\",VLOOKUP(ROUND($N17,0)/100,BARF,2),VLOOKUP(ROUND($N17,0)/100,BARG,2))),\"\")","v":""},null,"",null,null,null,null,null,"m"]
[null,null,null,null,null,null,"",null,"",null,"",null,"","",{"$error":"#VALUE!"},{"$error":"#VALUE!"},{"$error":"#VALUE!"},"","","","","","",{"$f":"IF(SUM(R18:W18)=2,IF(I18=2,IF(I18=2,IF(Q18-'Barèmes & Options'!H$2<-1,0,1)),\"\"),0)","v":0},0,"",{"$f":"IF(AND(M18<>\"\",K18<>\"\",G18<>\"\"),IF($C18=\"\",\"\",IF($C18=\"F\",VLOOKUP(ROUND($N18,0)/100,BARF,2),VLOOKUP(ROUND($N18,0)/100,BARG,2))),\"\")","v":""},null,"",null,null,null,null,null,"m"]
[null,null,null,null,null,null,"",null,"",null,"",null,"","",{"$error":"#VALUE!"},{"$error":"#VALUE!"},{"$error":"#VALUE!"},"","","","","","",{"$f":"IF(SUM(R19:W19)=2,IF(I19=2,IF(I19=2,IF(Q19-'Barèmes & Options'!H$2<-1,0,1)),\"\"),0)","v":0},0,"",{"$f":"IF(AND(M19<>\"\",K19<>\"\",G19<>\"\"),IF($C19=\"\",\"\",IF($C19=\"F\",VLOOKUP(ROUND($N19,0)/100,BARF,2),VLOOKUP(ROUND($N19,0)/100,BARG,2))),\"\")","v":""},null,"",null,null,null,null,null,"m"]
[null,null,null,null,null,null,"",null,"",null,"",null,"","",{"$error":"#VALUE!"},{"$error":"#VALUE!"},{"$error":"#VALUE!"},"","","","","","",{"$f":"IF(SUM(R20:W20)=2,IF(I20=2,IF(I20=2,IF(Q20-'Barèmes & Options'!H$2<-1,0,1)),\"\"),0)","v":0},0,"",{"$f":"IF(AND(M20<>\"\",K20<>\"\",G20<>\"\"),IF($C20=\"\",\"\",IF($C20=\"F\",VLOOKUP(ROUND($N20,0)/100,BARF,2),VLOOKUP(ROUND($N20,0)/100,BARG,2))),\"\")","v":""},null,"",null,null,null,null,null,"m"]
[null,null,null,null,null,null,"",null,"",null,"",null,"","",{"$error":"#VALUE!"},{"$error":"#VALUE!"},{"$error":"#VALUE!"},"","","","","","",{"$f":"IF(SUM(R21:W21)=2,IF(I21=2,IF(I21=2,IF(Q21-'Barèmes & Options'!H$2<-1,0,1)),\"\"),0)","v":0},0,"",{"$f":"IF(AND(M21<>\"\",K21<>\"\",G21<>\"\"),IF($C21=\"\",\"\",IF($C21=\"F\",VLOOKUP(ROUND($N21,0)/100,BARF,2),VLOOKUP(ROUND($N21,0)/100,BARG,2))),\"\")","v":""},null,"",null,null,null,null,null,"m"]
[null,null,null,null,null,null,"",null,"",null,"",null,"","",{"$error":"#VALUE!"},{"$error":"#VALUE!"},{"$error":"#VALUE!"},"","","","","","",{"$f":"IF(SUM(R22:W22)=2,IF(I22=2,IF(I22=2,IF(Q22-'Barèmes & Options'!H$2<-1,0,1)),\"\"),0)","v":0},0,"",{"$f":"IF(AND(M22<>\"\",K22<>\"\",G22<>\"\"),IF($C22=\"\",\"\",IF($C22=\"F\",VLOOKUP(ROUND($N22,0)/100,BARF,2),VLOOKUP(ROUND($N22,0)/100,BARG,2))),\"\")","v":""},null,"",null,null,null,null,null,"m"]
[null,null,null,null,null,null,"",null,"",null,"",null,"","",{"$error":"#VALUE!"},{"$error":"#VALUE!"},{"$error":"#VALUE!"},"","","","","","",{"$f":"IF(SUM(R23:W23)=2,IF(I23=2,IF(I23=2,IF(Q23-'Barèmes & Options'!H$2<-1,0,1)),\"\"),0)","v":0},0,"",{"$f":"IF(AND(M23<>\"\",K23<>\"\",G23<>\"\"),IF($C23=\"\",\"\",IF($C23=\"F\",VLOOKUP(ROUND($N23,0)/100,BARF,2),VLOOKUP(ROUND($N23,0)/100,BARG,2))),\"\")","v":""},null,"",null,null,null,null,null,"m"]
[null,null,null,null,null,null,"",null,"",null,"",null,"","",{"$error":"#VALUE!"},{"$error":"#VALUE!"},{"$error":"#VALUE!"},"","","","","","",{"$f":"IF(SUM(R24:W24)=2,IF(I24=2,IF(I24=2,IF(Q24-'Barèmes & Options'!H$2<-1,0,1)),\"\"),0)","v":0},0,"",{"$f":"IF(AND(M24<>\"\",K24<>\"\",G24<>\"\"),IF($C24=\"\",\"\",IF($C24=\"F\",VLOOKUP(ROUND($N24,0)/100,BARF,2),VLOOKUP(ROUND($N24,0)/100,BARG,2))),\"\")","v":""},null,"",null,null,null,null,null,"m"]
[null,null,null,null,null,null,"",null,"",null,"",null,"","",{"$error":"#VALUE!"},{"$error":"#VALUE!"},{"$error":"#VALUE!"},"","","","","","",{"$f":"IF(SUM(R25:W25)=2,IF(I25=2,IF(I25=2,IF(Q25-'Barèmes & Options'!H$2<-1,0,1)),\"\"),0)","v":0},0,"",{"$f":"IF(AND(M25<>\"\",K25<>\"\",G25<>\"\"),IF($C25=\"\",\"\",IF($C25=\"F\",VLOOKUP(ROUND($N25,0)/100,BARF,2),VLOOKUP(ROUND($N25,0)/100,BARG,2))),\"\")","v":""},null,"",null,null,null,null,null,"m"]
[null,null,null,null,null,null,"",null,"",null,"",null,"","",{"$error":"#VALUE!"},{"$error":"#VALUE!"},{"$error":"#VALUE!"},"","","","","","",{"$f":"IF(SUM(R26:W26)=2,IF(I26=2,IF(I26=2,IF(Q26-'Barèmes & Options'!H$2<-1,0,1)),\"\"),0)","v":0},0,"",{"$f":"IF(AND(M26<>\"\",K26<>\"\",G26<>\"\"),IF($C26=\"\",\"\",IF($C26=\"F\",VLOOKUP(ROUND($N26,0)/100,BARF,2),VLOOKUP(ROUND($N26,0)/100,BARG,2))),\"\")","v":""},null,"",null,null,null,null,null,"m"]
[null,null,null,null,null,null,"",null,"",null,"",null,"","",{"$error":"#VALUE!"},{"$error":"#VALUE!"},{"$error":"#VALUE!"},"","","","","","",{"$f":"IF(SUM(R27:W27)=2,IF(I27=2,IF(I27=2,IF(Q27-'Barèmes & Options'!H$2<-1,0,1)),\"\"),0)","v":0},0,"",{"$f":"IF(AND(M27<>\"\",K27<>\"\",G27<>\"\"),IF($C27=\"\",\"\",IF($C27=\"F\",VLOOKUP(ROUND($N27,0)/100,BARF,2),VLOOKUP(ROUND($N27,0)/100,BARG,2))),\"\")","v":""},null,"",null,null,null,null,null,"m"]
[null,null,null,null,null,null,"",null,"",null,"",null,"","",{"$error":"#VALUE!"},{"$error":"#VALUE!"},{"$error":"#VALUE!"},"","","","","","",{"$f":"IF(SUM(R28:W28)=2,IF(I28=2,IF(I28=2,IF(Q28-'Barèmes & Options'!H$2<-1,0,1)),\"\"),0)","v":0},0,"",{"$f":"IF(AND(M28<>\"\",K28<>\"\",G28<>\"\"),IF($C28=\"\",\"\",IF($C28=\"F\",VLOOKUP(ROUND($N28,0)/100,BARF,2),VLOOKUP(ROUND($N28,0)/100,BARG,2))),\"\")","v":""},null,"",null,null,null,null,null,"m"]
[null,null,null,null,null,null,"",null,"",null,"",null,"","",{"$error":"#VALUE!"},{"$error":"#VALUE!"},{"$error":"#VALUE!"},"","","","","","",{"$f":"IF(SUM(R29:W29)=2,IF(I29=2,IF(I29=2,IF(Q29-'Barèmes & Options'!H$2<-1,0,1)),\"\"),0)","v":0},0,"",{"$f":"IF(AND(M29<>\"\",K29<>\"\",G29<>\"\"),IF($C29=\"\",\"\",IF($C29=\"F\",VLOOKUP(ROUND($N29,0)/100,BARF,2),VLOOKUP(ROUND($N29,0)/100,BARG,2))),\"\")","v":""},null,"",null,null,null,null,null,"m"]
[null,null,null,null,null,null,"",null,"",null,"",null,"","",{"$error":"#VALUE!"},{"$error":"#VALUE!"},{"$error":"#VALUE!"},"","","","","","",{"$f":"IF(SUM(R30:W30)=2,IF(I30=2,IF(I30=2,IF(Q30-'Barèmes & Options'!H$2<-1,0,1)),\"\"),0)","v":0},0,"",{"$f":"IF(AND(M30<>\"\",K30<>\"\",G30<>\"\"),IF($C30=\"\",\"\",IF($C30=\"F\",VLOOKUP(ROUND($N30,0)/100,BARF,2),VLOOKUP(ROUND($N30,0)/100,BARG,2))),\"\")","v":""},null,"",null,null,null,null,null,"m"]
[null,null,null,null,null,null,"",null,"",null,"",null,"","",{"$error":"#VALUE!"},{"$error":"#VALUE!"},{"$error":"#VALUE!"},"","","","","","",{"$f":"IF(SUM(R31:W31)=2,IF(I31=2,IF(I31=2,IF(Q31-'Barèmes & Options'!H$2<-1,0,1)),\"\"),0)","v":0},0,"",{"$f":"IF(AND(M31<>\"\",K31<>\"\",G31<>\"\"),IF($C31=\"\",\"\",IF($C31=\"F\",VLOOKUP(ROUND($N31,0)/100,BARF,2),VLOOKUP(ROUND($N31,0)/100,BARG,2))),\"\")","v":""},null,"",null,null,null,null,null,"m"]
[null,null,null,null,null,null,"",null,"",null,"",null,"","",{"$error":"#VALUE!"},{"$error":"#VALUE!"},{"$error":"#VALUE!"},"","","","","","",{"$f":"IF(SUM(R32:W32)=2,IF(I32=2,IF(I32=2,IF(Q32-'Barèmes & Options'!H$2<-1,0,1)),\"\"),0)","v":0},0,"",{"$f":"IF(AND(M32<>\"\",K32<>\"\",G32<>\"\"),IF($C32=\"\",\"\",IF($C32=\"F\",VLOOKUP(ROUND($N32,0)/100,BARF,2),VLOOKUP(ROUND($N32,0)/100,BARG,2))),\"\")","v":""},null,"",null,null,null,null,null,"m"]
[null,null,null,null,null,null,"",null,"",null,"",null,"","",{"$error":"#VALUE!"},{"$error":"#VALUE!"},{"$error":"#VALUE!"},"","","","","","",{"$f":"IF(SUM(R33:W33)=2,IF(I33=2,IF(I33=2,IF(Q33-'Barèmes & Options'!H$2<-1,0,1)),\"\"),0)","v":0},0,"",{"$f":"IF(AND(M33<>\"\",K33<>\"\",G33<>\"\"),IF($C33=\"\",\"\",IF($C33=\"F\",VLOOKUP(ROUND($N33,0)/100,BARF,2),VLOOKUP(ROUND($N33,0)/100,BARG,2))),\"\")","v":""},null,"",null,null,null,null,null,"m"]
[null,null,null,null,null,null,"",null,"",null,"",null,"","",{"$error":"#VALUE!"},{"$error":"#VALUE!"},{"$error":"#VALUE!"},"","","","","","",{"$f":"IF(SUM(R34:W34)=2,IF(I34=2,IF(I34=2,IF(Q34-'Barèmes & Options'!H$2<-1,0,1)),\"\"),0)","v":0},0,"",{"$f":"IF(AND(M34<>\"\",K34<>\"\",G34<>\"\"),IF($C34=\"\",\"\",IF($C34=\"F\",VLOOKUP(ROUND($N34,0)/100,BARF,2),VLOOKUP(ROUND($N34,0)/100,BARG,2))),\"\")","v":""},null,"",null,null,null,null,null,"m"]
[null,null,null,null,null,null,"",null,"",null,"",null,"","",{"$error":"#VALUE!"},{"$error":"#VALUE!"},{"$error":"#VALUE!"},"","","","","","",{"$f":"IF(SUM(R35:W35)=2,IF(I35=2,IF(I35=2,IF(Q35-'Barèmes & Options'!H$2<-1,0,1)),\"\"),0)","v":0},0,"",{"$f":"IF(AND(M35<>\"\",K35<>\"\",G35<>\"\"),IF($C35=\"\",\"\",IF($C35=\"F\",VLOOKUP(ROUND($N35,0)/100,BARF,2),VLOOKUP(ROUND($N35,0)/100,BARG,2))),\"\")","v":""},null,"",null,null,null,null,null,"m"]
[null,null,null,null,null,null,"",null,"",null,"",null,"","",{"$error":"#VALUE!"},{"$error":"#VALUE!"},{"$error":"#VALUE!"},"","","","","","",{"$f":"IF(SUM(R36:W36)=2,IF(I36=2,IF(I36=2,IF(Q36-'Barèmes & Options'!H$2<-1,0,1)),\"\"),0)","v":0},0,"",{"$f":"IF(AND(M36<>\"\",K36<>\"\",G36<>\"\"),IF($C36=\"\",\"\",IF($C36=\"F\",VLOOKUP(ROUND($N36,0)/100,BARF,2),VLOOKUP(ROUND($N36,0)/100,BARG,2))),\"\")","v":""},null,"",null,null,null,null,null,{"$f":"IF(C36<>\"f\",\"m\",\"f\")","v":"m"}]
[null,null,null,null,null,null,"",null,"",null,"",null,"","",{"$error":"#VALUE!"},{"$error":"#VALUE!"},{"$error":"#VALUE!"},"","","","","","",{"$f":"IF(SUM(R37:W37)=2,IF(I37=2,IF(I37=2,IF(Q37-'Barèmes & Options'!H$2<-1,0,1)),\"\"),0)","v":0},0,"",{"$f":"IF(AND(M37<>\"\",K37<>\"\",G37<>\"\"),IF($C37=\"\",\"\",IF($C37=\"F\",VLOOKUP(ROUND($N37,0)/100,BARF,2),VLOOKUP(ROUND($N37,0)/100,BARG,2))),\"\")","v":""},null,"",null,null,null,null,null,"m"]
[null,null,null,null,null,null,"",null,"",null,"",null,"","",{"$error":"#VALUE!"},{"$error":"#VALUE!"},{"$error":"#VALUE!"},"","","","","","",{"$f":"IF(SUM(R38:W38)=2,IF(I38=2,IF(I38=2,IF(Q38-'Barèmes & Options'!H$2<-1,0,1)),\"\"),0)","v":0},0,"",{"$f":"IF(AND(M38<>\"\",K38<>\"\",G38<>\"\"),IF($C38=\"\",\"\",IF($C38=\"F\",VLOOKUP(ROUND($N38,0)/100,BARF,2),VLOOKUP(ROUND($N38,0)/100,BARG,2))),\"\")","v":""},null,"",null,null,null,null,null,"m"]
[null,null,null,null,null,null,"",null,"",null,"",null,"","",{"$error":"#VALUE!"},{"$error":"#VALUE!"},{"$error":"#VALUE!"},"","","","","","",{"$f":"IF(SUM(R39:W39)=2,IF(I39=2,IF(I39=2,IF(Q39-'Barèmes & Options'!H$2<-1,0,1)),\"\"),0)","v":0},0,"",{"$f":"IF(AND(M39<>\"\",K39<>\"\",G39<>\"\"),IF($C39=\"\",\"\",IF($C39=\"F\",VLOOKUP(ROUND($N39,0)/100,BARF,2),VLOOKUP(ROUND($N39,0)/100,BARG,2))),\"\")","v":""},null,"",null,null,null,null,null,"m"]
[null,null,null,null,null,null,"",null,"",null,"",null,"","",{"$error":"#VALUE!"},{"$error":"#VALUE!"},{"$error":"#VALUE!"},"","","","","","",{"$f":"IF(SUM(R40:W40)=2,IF(I40=2,IF(I40=2,IF(Q40-'Barèmes & Options'!H$2<-1,0,1)),\"\"),0)","v":0},0,"",{"$f":"IF(AND(M40<>\"\",K40<>\"\",G40<>\"\"),IF($C40=\"\",\"\",IF($C40=\"F\",VLOOKUP(ROUND($N40,0)/100,BARF,2),VLOOKUP(ROUND($N40,0)/100,BARG,2))),\"\")","v":""},null,"",null,null,null,null,null,"m"]
{"$rows_left_out":62}
{"sheet":"Barèmes & Options","index":2,"n_rows":141,"n_cols":13,"rows_kept":141,"cut":false,"hidden":false,"merged":[[0,0,0,2],[0,9,0,10],[0,11,0,12]]}
[null,null,null,null,null,null,null,null,null,"Barème Garçons",null,"Barème Filles"]
[null,null,null,null,null,null,null,null,null,"TPS G","Pts G","TPS F","PTS F"]
[null,null,null,null,null,null,null,null,null,3,14,3.3,14]
[null,null,null,null,null,null,null,null,null,4.4800000000000004,14,6.11,14]
[null,null,null,null,null,null,null,null,null,4.49,13.9,6.12,13.9]
[null,null,null,null,null,null,null,null,null,4.5,13.8,6.13,13.8]
[null,null,null,null,null,null,null,null,null,4.51,13.7,6.14,13.7]
[null,null,null,null,null,null,null,null,null,4.51,13.6,6.15,13.6]
[null,null,null,null,null,null,null,null,null,4.5199999999999996,13.5,6.16,13.5]
[null,null,null,null,null,null,null,null,null,4.53,13.4,6.17,13.4]
[null,null,null,null,null,null,null,null,null,4.54,13.3,6.18,13.3]
[null,null,null,null,null,null,null,null,null,4.55,13.2,6.19,13.2]
[null,null,null,null,null,null,null,null,null,4.55,13.1,6.2,13.1]
[null,null,null,null,null,null,null,null,null,4.5599999999999996,13,6.21,13]
[null,null,null,null,null,null,null,null,null,4.57,12.9,6.22,12.9]
[null,null,null,null,null,null,null,null,null,4.58,12.8,6.23,12.8]
[null,null,null,null,null,null,null,null,null,4.59,12.7,6.24,12.7]
[null,null,null,null,null,null,null,null,null,5,12.6,6.25,12.6]
[null,null,null,null,null,null,null,null,null,5.01,12.5,6.26,12.5]
[null,null,null,null,null,null,null,null,null,5.0199999999999996,12.4,6.27,12.4]
[null,null,null,null,null,null,null,null,null,5.03,12.3,6.28,12.3]
[null,null,null,null,null,null,null,null,null,5.04,12.2,6.29,12.2]
[null,null,null,null,null,null,null,null,null,5.04,12.1,6.3,12.1]
[null,null,null,null,null,null,null,null,null,5.05,12,6.31,12]
[null,null,null,null,null,null,null,null,null,5.0599999999999996,11.9,6.32,11.9]
[null,null,null,null,null,null,null,null,null,5.07,11.8,6.33,11.8]
[null,null,null,null,null,null,null,null,null,5.08,11.7,6.34,11.7]
[null,null,null,null,null,null,null,null,null,5.08,11.6,6.35,11.6]
[null,null,null,null,null,null,null,null,null,5.09,11.5,6.37,11.5]
[null,null,null,null,null,null,null,null,null,5.0999999999999996,11.4,6.38,11.4]
[null,null,null,null,null,null,null,null,null,5.1100000000000003,11.3,6.39,11.3]
[null,null,null,null,null,null,null,null,null,5.12,11.2,6.4,11.2]
[null,null,null,null,null,null,null,null,null,5.12,11.1,6.41,11.1]
[null,null,null,null,null,null,null,null,null,5.13,11,6.42,11]
[null,null,null,null,null,null,null,null,null,5.14,10.9,6.43,10.9]
[null,null,null,null,null,null,null,null,null,5.15,10.8,6.44,10.8]
[null,null,null,null,null,null,null,null,null,5.16,10.7,6.45,10.7]
[null,null,null,null,null,null,null,null,null,5.16,10.6,6.46,10.6]
[null,null,null,null,null,null,null,null,null,5.17,10.5,6.47,10.5]
[null,null,null,null,null,null,null,null,null,5.19,10.4,6.49,10.4]
{"$rows_left_out":102}
{"sheet":"Présentation des profils","index":3,"n_rows":0,"n_cols":0,"rows_kept":0,"cut":false,"hidden":false,"merged":[]}