{"text_format":"1","workbook":"xlsx","n_sheets":13,"sheets":["Choix de Format de course","gestion de CO avec Balises","gestion de course tradi","Gestion CO parcours","Gestion CO cartes","note rythmeFormat1et2","note nbre erreursformat1et2","note  balises cherchéesFormat12","note parcourscherchésformat3et4","liste d'élèves","validation de données","Baremes 1","Bareme 2"],"not_rendered":{"charts":0,"images":0,"macros":1,"external_links":0,"defined_names":8,"comments":0,"pivot_tables":0},"unopened":[],"bounds":{"document_bytes":16777216,"sheet_cells":100000,"rows_first":2000,"rows_last":500,"rows_between":2000,"halvings":0,"cell_chars":16384,"cell_head_chars":4096},"cells_cut":0,"cells_raw":0,"read":"whole","date_system":"1900"}

{"sheet":"Choix de Format de course","index":0,"n_rows":1,"n_cols":11,"rows_kept":1,"cut":false,"hidden":false,"merged":[[0,0,1,7],[0,10,44,26]]}
["CHOIX DE VOTRE FORMAT DE COURSE DE CO (cliquer successivement sur les onglets)",null,null,null,null,null,null,null,null,null,"Cahier des charges de l'application:     GCO polymorphe NUMEPS   \n\nCette application est sur le plan technique excessivement simple à mettre en place. Elle n'utilise que des formules Excel simples et des macros simples. Je combine cette Application GCO avec l'utilisation d'une application Android pour la prise des temps Multi-chrono et Timer qui a l'avantage d'être gratuite, de pouvoir démarrer 20 chronos simultanés, de les nommer et d'enregistrer des temps intermédiaires.\n\nC'est une proposition numérique pédagogique qui a vocation à être modifiée en fonction de votre contexte d'enseignement et votre traitement didactique pour des utilisateurs numériques débutants. Elle a l'intérêt de vous donner une note presque en direct et de vous faire gagner du temps quand elle est construite.\n\nVous pouvez donc l'utiliser en kit si elle correspond à votre contexte d'enseignement ( une version protégée sur un format de course de 12 balises ou 12 parcours ou 12 cartes: les formules et les feuilles sont protégées) ou la faire évoluer à votre guise selon des axes qui vous conviennent (je vous partage sur le site EPS académique une version non protégée, modifiable ou toutes les feulles du classeur apparaissent pour modification) et des tutoriels sur deux fonctions principales utilisées dans cette application (la fonction TEMPS et la  fonction rechercheV).\n\nLes axes d'évolution concernent le format de course, le nombre de balises ou parcours ou cartes, la définition des critères de notation, la définition des barêmes 1 (CO en étoile et traditionnelle) et des barêmes 2 (CO nbre de parcours et CO nbre de cartes) et le changement des données de barême dans les tableaux de référence (feuilles nommées note en bas), et le changement des formules dans les feuilles de gestion de course.\n\nLes formules Excel utilisées sont:\n\nLa fonction Temps (sert à transformer votre saisie du temps sous forme décimale pour la saisir vite et de transfomer ce temps au format excel: Par exemple pour 2min13, vous allez saisir 213 et elle tansformera ce temps au format excel hh:mm:ss).\nLa fonction rechercheV (sert à construire les barêmes).\nLa fonction Si imbriquée à la fonction Ou (sert à dénombrer le nombre de balises fausses).\nLa fonction Sierreur (sert à écrire 0 dans les cellules au lieu d'écrire #DIV/0! ou autres écritures illisibles si le calcul n'est pas faisable).\nLa fonction NBVAL (sert à dénombrer des cellules où il y a une valeur dedans).\n\nDes petites macros viennent s'ajouter principalement pour ajouter de l'ergonomie à l'application (Quand vous cliquez sur un onglet de couleur cela se dirige directement sur une autre feuille, je ne les détaille pas ici, elles sont verrouillées). Cela vous impose donc d'utiliser la même structure, c'est à dire de modifier uniquement les formats de course, leurs contenus et leurs barêmes.\nEt enfin, l'outil validation de données d'excel qui permet de créer des listes déroulantes (liste d'élèves dans les formats de courses....)\n\n\n               \n"]

{"sheet":"gestion de CO avec Balises","index":1,"n_rows":37,"n_cols":61,"rows_kept":37,"cut":false,"hidden":false,"merged":[[1,38,1,41],[1,42,1,45],[1,46,1,49],[0,2,0,49],[1,26,1,29],[1,30,1,33],[1,34,1,37],[1,2,1,5],[1,6,1,9],[1,10,1,13],[1,14,1,17],[1,18,1,21],[1,22,1,25]]}
[null,null,"Gestion de Course de CO de 12 balises  et Proposition d'une note selon 4 critères changeables (nombre de balises cherchées, rythme de course, nombre d'erreurs, lisibilité de la feuille de course). Une balise non trouvée est comptée comme fausse."]
[null,null,"Balise 1",null,null,null,"Balise 2",null,null,null,"Balise 3",null,null,null,"Balise 4",null,null,null,"Balise 5",null,null,null,"Balise 6",null,null,null,"Balise 7",null,null,null,"Balise 8",null,null,null,"Balise 9",null,null,null,"Balise 10",null,null,null,"Balise 11",null,null,null,"Balise 12"]
["NOM 1","NOM 2","code balise 1","tpsdecimal\nA saisir","Temps","Erreurs","code balise 2","tpsdecimal\nA saisir","Temps","Erreurs","code balise  3","tpsdecimal\nA saisir","Temps","Erreurs","code balise 4","tpsdecimal\nA saisir","Temps","Erreurs","code balise 5","tpsdecimal\nA saisir","Temps","Erreurs","code balise 6","tpsdecimal\nA saisir","Temps","Erreurs","code balise 7","tpsdecimal\nA saisir","Temps","Erreurs","code balise  8","tpsdecimal\nA saisir","Temps","Erreurs","code balise 9","tpsdecimal\nA saisir","Temps","Erreurs","code balise 10","tpsdecimal\nA saisir","Temps","Erreurs","code balise 11","tpsdecimal\nA saisir","Temps","Erreurs","code balise 12","tpsdecimal\nA saisir","Temps","Erreurs","Nb de balises cherchées","Note nbre de balises cherchées\n\n/5","Temps Total du parcours\n","rythme","note Rythme\n\n/5","Nombre d'erreurs","note Nombre d'erreurs\n\n/10","Lisibilité\nà saisir\n/1","Bonus éventuel","Note /21","Note/20"]
[null,null,null,null,{"$f":"TIME(0,D4/100,MOD(D4,100))","v":"00:00:00"},{"$f":"IF(OR(C4=\"o\",C4=\"\"),,1)","v":0},null,null,{"$f":"TIME(0,H4/100,MOD(H4,100))","v":"00:00:00"},{"$f":"IF(OR(G4=\"o\",G4=\"\"),,1)","v":0},null,null,{"$f":"TIME(0,L4/100,MOD(L4,100))","v":"00:00:00"},{"$f":"IF(OR(K4=\"o\",K4=\"\"),,1)","v":0},null,null,{"$f":"TIME(0,P4/100,MOD(P4,100))","v":"00:00:00"},{"$f":"IF(OR(O4=\"o\",O4=\"\"),,1)","v":0},null,null,{"$f":"TIME(0,T4/100,MOD(T4,100))","v":"00:00:00"},{"$f":"IF(OR(S4=\"o\",S4=\"\"),,1)","v":0},null,null,{"$f":"TIME(0,X4/100,MOD(X4,100))","v":"00:00:00"},{"$f":"IF(OR(W4=\"o\",W4=\"\"),,1)","v":0},null,null,{"$f":"TIME(0,AB4/100,MOD(AB4,100))","v":"00:00:00"},{"$f":"IF(OR(AA4=\"o\",AA4=\"\"),,1)","v":0},null,null,{"$f":"TIME(0,AF4/100,MOD(AF4,100))","v":"00:00:00"},{"$f":"IF(OR(AE4=\"o\",AE4=\"\"),,1)","v":0},null,null,{"$f":"TIME(0,AJ4/100,MOD(AJ4,100))","v":"00:00:00"},{"$f":"IF(OR(AI4=\"o\",AI4=\"\"),,1)","v":0},null,null,{"$f":"TIME(0,AN4/100,MOD(AN4,100))","v":"00:00:00"},{"$f":"IF(OR(AM4=\"o\",AM4=\"\"),,1)","v":0},null,null,{"$f":"TIME(0,AR4/100,MOD(AR4,100))","v":"00:00:00"},{"$f":"IF(OR(AQ4=\"o\",AQ4=\"\"),,1)","v":0},null,null,{"$f":"TIME(0,AV4/100,MOD(AV4,100))","v":"00:00:00"},{"$f":"IF(OR(AU4=\"o\",AU4=\"\"),,1)","v":0},{"$f":"COUNTA(D4,H4,L4,P4,T4,X4,AB4,AF4,AJ4,AN4,AR4,AV4)","v":0},{"$f":"VLOOKUP(AY4,'note  balises cherchéesFormat12'!$B$3:$C$13,2,TRUE)","v":0},{"$f":"E4+I4+M4+Q4+U4+Y4+AC4+AG4+AK4+AO4+AS4+AW4","v":"00:00:00"},{"$f":"IFERROR(BA4/AY4,0)","v":"00:00:00"},{"$f":"IFERROR(VLOOKUP(BB4,'note rythmeFormat1et2'!$C$3:$D$14,2,TRUE),0)","v":0},{"$f":"F4+J4+N4+R4+V4+Z4+AD4+AH4+AL4+AP4+AT4+AX4","v":0},{"$f":"IFERROR(VLOOKUP(BD4,'note nbre erreursformat1et2'!$C$2:$D$9,2,TRUE),0)","v":10},null,null,{"$f":"AZ4+BC4+BE4+BF4","v":10},{"$f":"(20/21)*BH4","v":9.5238095238095237}]
[null,null,null,null,{"$f":"TIME(0,D5/100,MOD(D5,100))","v":"00:00:00"},{"$f":"IF(OR(C5=\"o\",C5=\"\"),0,1)","v":0},null,null,{"$f":"TIME(0,H5/100,MOD(H5,100))","v":"00:00:00"},{"$f":"IF(OR(G5=\"o\",G5=\"\"),0,1)","v":0},null,null,"00:00:00",{"$f":"IF(OR(K5=\"o\",K5=\"\"),0,1)","v":0},null,null,"00:00:00",{"$f":"IF(OR(O5=\"o\",O5=\"\"),0,1)","v":0},null,null,"00:00:00",{"$f":"IF(OR(S5=\"o\",S5=\"\"),0,1)","v":0},null,null,"00:00:00",{"$f":"IF(OR(W5=\"o\",W5=\"\"),0,1)","v":0},null,null,"00:00:00",{"$f":"IF(OR(AA5=\"o\",AA5=\"\"),0,1)","v":0},null,null,"00:00:00",{"$f":"IF(OR(AE5=\"o\",AE5=\"\"),0,1)","v":0},null,null,"00:00:00",{"$f":"IF(OR(AI5=\"o\",AI5=\"\"),0,1)","v":0},null,null,{"$f":"TIME(0,AN5/100,MOD(AN5,100))","v":"00:00:00"},{"$f":"IF(OR(AM5=\"o\",AM5=\"\"),0,1)","v":0},null,null,{"$f":"TIME(0,AR5/100,MOD(AR5,100))","v":"00:00:00"},{"$f":"IF(OR(AQ5=\"o\",AQ5=\"\"),0,1)","v":0},null,null,{"$f":"TIME(0,AV5/100,MOD(AV5,100))","v":"00:00:00"},{"$f":"IF(OR(AU5=\"o\",AU5=\"\"),0,1)","v":0},0,{"$f":"VLOOKUP(AY5,'note  balises cherchéesFormat12'!$B$3:$C$13,2,TRUE)","v":0},"00:00:00",{"$f":"IFERROR(BA5/AY5,0)","v":"00:00:00"},{"$f":"IFERROR(VLOOKUP(BB5,'note rythmeFormat1et2'!$C$3:$D$14,2,TRUE),0)","v":0},0,{"$f":"IFERROR(VLOOKUP(BD5,'note nbre erreursformat1et2'!$C$2:$D$9,2,TRUE),0)","v":10},null,null,10,{"$f":"(20/21)*BH5","v":9.5238095238095237}]
[null,null,null,null,{"$f":"TIME(0,D6/100,MOD(D6,100))","v":"00:00:00"},0,null,null,"00:00:00",0,null,null,"00:00:00",0,null,null,"00:00:00",0,null,null,"00:00:00",0,null,null,"00:00:00",0,null,null,"00:00:00",0,null,null,"00:00:00",0,null,null,"00:00:00",0,null,null,"00:00:00",0,null,null,"00:00:00",0,null,null,"00:00:00",0,0,{"$f":"VLOOKUP(AY6,'note  balises cherchéesFormat12'!$B$3:$C$13,2,TRUE)","v":0},"00:00:00","00:00:00",{"$f":"IFERROR(VLOOKUP(BB6,'note rythmeFormat1et2'!$C$3:$D$14,2,TRUE),0)","v":0},0,{"$f":"IFERROR(VLOOKUP(BD6,'note nbre erreursformat1et2'!$C$2:$D$9,2,TRUE),0)","v":10},null,null,10,9.5238095238095237]
{"$rows_left_out":32}
{"sheet":"gestion de course tradi","index":2,"n_rows":38,"n_cols":16,"rows_kept":38,"cut":false,"hidden":false,"merged":[[0,2,1,15]]}
[null,null,"Gestion de Course de CO traditionnelle de 12 balises  et Proposition d'une note selon 4 critères changeables (nombre de balises cherchées, rythme de course, nombre d'erreurs, lisibilité de la feuille de course)"]
[]
["NOM 1","NOM 2","tpsdecimal \nA saisir","Temps du parcours","Nbre Erreurs\n","Nb de balises cherchées","Note nbre de balises cherchées\n\n/5","Temps Total du parcours\n","rythme","note Rythme\n\n\n/5","Nombre d'erreurs","note Nombre d'erreurs\n\n/10","Lisibilité\nà saisir\n\n\n/1","Bonus éventuel","Note /21","Note/20"]
[null,null,null,{"$f":"TIME(0,C4/100,MOD(C4,100))","v":"00:00:00"},null,null,{"$f":"VLOOKUP(F4,'note  balises cherchéesFormat12'!$B$3:$C$13,2,TRUE)","v":0},{"$f":"D4","v":"00:00:00"},{"$f":"IFERROR(H4/F4,0)","v":"00:00:00"},{"$f":"IFERROR(VLOOKUP(I4,'note rythmeFormat1et2'!$B$3:$D$14,2,TRUE),0)","v":0},{"$f":"E4","v":0},{"$f":"IFERROR(VLOOKUP(K4,'note nbre erreursformat1et2'!$C$2:$D$9,2,TRUE),0)","v":10},null,null,{"$f":"G4+J4+L4+M4","v":10},{"$f":"(20/21)*O4","v":9.5238095238095237}]
[null,null,null,{"$f":"TIME(0,C5/100,MOD(C5,100))","v":"00:00:00"},null,null,{"$f":"VLOOKUP(F5,'note  balises cherchéesFormat12'!$B$3:$C$13,2,TRUE)","v":0},{"$f":"D5","v":"00:00:00"},{"$f":"IFERROR(H5/F5,0)","v":"00:00:00"},{"$f":"IFERROR(VLOOKUP(I5,'note rythmeFormat1et2'!$B$3:$D$14,2,TRUE),0)","v":0},{"$f":"E5","v":0},{"$f":"IFERROR(VLOOKUP(K5,'note nbre erreursformat1et2'!$C$2:$D$9,2,TRUE),0)","v":10},null,null,10,{"$f":"(20/21)*O5","v":9.5238095238095237}]
[null,null,null,"00:00:00",null,null,{"$f":"VLOOKUP(F6,'note  balises cherchéesFormat12'!$B$3:$C$13,2,TRUE)","v":0},"00:00:00","00:00:00",{"$f":"IFERROR(VLOOKUP(I6,'note rythmeFormat1et2'!$B$3:$D$14,2,TRUE),0)","v":0},0,{"$f":"IFERROR(VLOOKUP(K6,'note nbre erreursformat1et2'!$C$2:$D$9,2,TRUE),0)","v":10},null,null,10,9.5238095238095237]
{"$rows_left_out":33}
{"sheet":"Gestion CO parcours","index":3,"n_rows":37,"n_cols":49,"rows_kept":37,"cut":false,"hidden":false,"merged":[[0,2,0,37],[1,2,1,4],[1,5,1,7],[1,8,1,10],[1,11,1,13],[1,14,1,16],[1,17,1,19],[1,20,1,22],[1,23,1,25],[1,26,1,28],[1,29,1,31],[1,32,1,34],[1,35,1,37]]}
[null,null,"Gestion de Course de CO de 12 parcours ( 5 balises par parcours)  et Proposition d'une note selon 4 critères changeables (nombre de balises cherchées, rythme de course, nombre d'erreurs, lisibilité de la feuille de course). Une balise non trouvée est comptée comme fausse."]
[null,null,"Parcours 1",null,null,"Parcours 2",null,null,"Parcours 3",null,null,"Parcours 4",null,null,"Parcours 5",null,null,"Parcours 6",null,null,"Parcours 7",null,null,"Parcours 8",null,null,"Parcours 9",null,null,"Parcours 10",null,null,"Parcours 11",null,null,"Parcours 12"]
["NOM 1","NOM 2","tpsdecimal\nA saisir","Temps","Erreurs","tpsdecimal\nA saisir","Temps","Erreurs","tpsdecimal\nA saisir","Temps","Erreurs","tpsdecimal\nA saisir","Temps","Erreurs","tpsdecimal\nA saisir","Temps","Erreurs","tpsdecimal\nA saisir","Temps","Erreurs","tpsdecimal\nA saisir","Temps","Erreurs","tpsdecimal\nA saisir","Temps","Erreurs","tpsdecimal\nA saisir","Temps","Erreurs","tpsdecimal\nA saisir","Temps","Erreurs","tpsdecimal\nA saisir","Temps","Erreurs","tpsdecimal\nA saisir","Temps","Erreurs","Nb de parcours cherchés","Note nbre de balises cherchées\n\n/5","Temps Total du parcours\n","rythme","note Rythme\n\n/5","Nombre d'erreurs","note Nombre d'erreurs\n\n/10","Lisibilité\nà saisir\n/1","Bonus éventuel","Note /21","Note/20"]
[null,null,null,{"$f":"TIME(0,C4/100,MOD(C4,100))","v":"00:00:00"},null,null,{"$f":"TIME(0,F4/100,MOD(F4,100))","v":"00:00:00"},null,null,{"$f":"TIME(0,I4/100,MOD(I4,100))","v":"00:00:00"},null,null,{"$f":"TIME(0,L4/100,MOD(L4,100))","v":"00:00:00"},null,null,{"$f":"TIME(0,O4/100,MOD(O4,100))","v":"00:00:00"},null,null,{"$f":"TIME(0,R4/100,MOD(R4,100))","v":"00:00:00"},null,null,{"$f":"TIME(0,U4/100,MOD(U4,100))","v":"00:00:00"},null,null,{"$f":"TIME(0,X4/100,MOD(X4,100))","v":"00:00:00"},null,null,{"$f":"TIME(0,AA4/100,MOD(AA4,100))","v":"00:00:00"},null,null,{"$f":"TIME(0,AD4/100,MOD(AD4,100))","v":"00:00:00"},null,null,{"$f":"TIME(0,AG4/100,MOD(AG4,100))","v":"00:00:00"},null,null,{"$f":"TIME(0,AJ4/100,MOD(AJ4,100))","v":"00:00:00"},null,{"$f":"COUNTA(C4,F4,I4,L4,O4,R4,U4,X4,AA4,AD4,AG4,AJ4)","v":0},{"$f":"VLOOKUP(AM4,'note  balises cherchéesFormat12'!$B$3:$C$13,2,TRUE)","v":0},{"$f":"D4+G4+J4+M4+P4+S4+V4+Y4+AB4+AE4+AH4+AK4","v":"00:00:00"},{"$f":"IFERROR(AO4/AM4,0)","v":"00:00:00"},{"$f":"IFERROR(VLOOKUP(AP4,'note rythmeFormat1et2'!$C$3:$D$14,2,TRUE),0)","v":0},{"$f":"E4+H4+K4+N4+Q4+T4+W4+Z4+AC4+AF4+AI4+AL4","v":0},{"$f":"IFERROR(VLOOKUP(AR4,'note nbre erreursformat1et2'!$C$2:$D$9,2,TRUE),0)","v":10},null,null,{"$f":"AN4+AQ4+AS4+AT4","v":10},{"$f":"(20/21)*AV4","v":9.5238095238095237}]
[null,null,null,"00:00:00",null,null,{"$f":"TIME(0,F5/100,MOD(F5,100))","v":"00:00:00"},null,null,{"$f":"TIME(0,I5/100,MOD(I5,100))","v":"00:00:00"},null,null,{"$f":"TIME(0,L5/100,MOD(L5,100))","v":"00:00:00"},null,null,{"$f":"TIME(0,O5/100,MOD(O5,100))","v":"00:00:00"},null,null,{"$f":"TIME(0,R5/100,MOD(R5,100))","v":"00:00:00"},null,null,{"$f":"TIME(0,U5/100,MOD(U5,100))","v":"00:00:00"},null,null,{"$f":"TIME(0,X5/100,MOD(X5,100))","v":"00:00:00"},null,null,{"$f":"TIME(0,AA5/100,MOD(AA5,100))","v":"00:00:00"},null,null,{"$f":"TIME(0,AD5/100,MOD(AD5,100))","v":"00:00:00"},null,null,{"$f":"TIME(0,AG5/100,MOD(AG5,100))","v":"00:00:00"},null,null,{"$f":"TIME(0,AJ5/100,MOD(AJ5,100))","v":"00:00:00"},null,0,{"$f":"VLOOKUP(AM5,'note  balises cherchéesFormat12'!$B$3:$C$13,2,TRUE)","v":0},"00:00:00",{"$f":"IFERROR(AO5/AM5,0)","v":"00:00:00"},{"$f":"IFERROR(VLOOKUP(AP5,'note rythmeFormat1et2'!$C$3:$D$14,2,TRUE),0)","v":0},0,{"$f":"IFERROR(VLOOKUP(AR5,'note nbre erreursformat1et2'!$C$2:$D$9,2,TRUE),0)","v":10},null,null,10,{"$f":"(20/21)*AV5","v":9.5238095238095237}]
[null,null,null,"00:00:00",null,null,"00:00:00",null,null,"00:00:00",null,null,"00:00:00",null,null,"00:00:00",null,null,"00:00:00",null,null,"00:00:00",null,null,"00:00:00",null,null,"00:00:00",null,null,"00:00:00",null,null,"00:00:00",null,null,"00:00:00",null,0,{"$f":"VLOOKUP(AM6,'note  balises cherchéesFormat12'!$B$3:$C$13,2,TRUE)","v":0},"00:00:00","00:00:00",{"$f":"IFERROR(VLOOKUP(AP6,'note rythmeFormat1et2'!$C$3:$D$14,2,TRUE),0)","v":0},0,{"$f":"IFERROR(VLOOKUP(AR6,'note nbre erreursformat1et2'!$C$2:$D$9,2,TRUE),0)","v":10},null,null,10,9.5238095238095237]
{"$rows_left_out":32}
{"sheet":"Gestion CO cartes","index":4,"n_rows":37,"n_cols":49,"rows_kept":37,"cut":false,"hidden":false,"merged":[[1,29,1,31],[1,32,1,34],[1,35,1,37],[0,2,0,37],[1,2,1,4],[1,5,1,7],[1,8,1,10],[1,11,1,13],[1,14,1,16],[1,17,1,19],[1,20,1,22],[1,23,1,25],[1,26,1,28]]}
[null,null,"Gestion de Course de CO de 12 cartes (5 balises par carte)  et Proposition d'une note selon 4 critères changeables (nombre de balises cherchées, rythme de course, nombre d'erreurs, lisibilité de la feuille de course). Une balise non trouvée est comptée comme fausse."]
[null,null,"Carte 1",null,null,"Carte 2",null,null,"Carte 3",null,null,"Carte 4",null,null,"Carte 5",null,null,"Carte 6",null,null,"Carte 7",null,null,"Carte 8",null,null,"Carte 9",null,null,"Carte 10",null,null,"Carte 11",null,null,"Carte 12"]
["NOM 1","NOM 2","tpsdecimal\nA saisir","Temps","Erreurs","tpsdecimal\nA saisir","Temps","Erreurs","tpsdecimal\nA saisir","Temps","Erreurs","tpsdecimal\nA saisir","Temps","Erreurs","tpsdecimal\nA saisir","Temps","Erreurs","tpsdecimal\nA saisir","Temps","Erreurs","tpsdecimal\nA saisir","Temps","Erreurs","tpsdecimal\nA saisir","Temps","Erreurs","tpsdecimal\nA saisir","Temps","Erreurs","tpsdecimal\nA saisir","Temps","Erreurs","tpsdecimal\nA saisir","Temps","Erreurs","tpsdecimal\nA saisir","Temps","Erreurs","Nb de cartes cherchées","Note nbre de balises cherchées\n\n/5","Temps Total du parcours\n","rythme","note Rythme\n\n/5","Nombre d'erreurs","note Nombre d'erreurs\n\n/10","Lisibilité\nà saisir\n/1","Bonus éventuel","Note /21","Note/20"]
[null,null,null,{"$f":"TIME(0,C4/100,MOD(C4,100))","v":"00:00:00"},null,null,{"$f":"TIME(0,F4/100,MOD(F4,100))","v":"00:00:00"},null,null,{"$f":"TIME(0,I4/100,MOD(I4,100))","v":"00:00:00"},null,null,{"$f":"TIME(0,L4/100,MOD(L4,100))","v":"00:00:00"},null,null,{"$f":"TIME(0,O4/100,MOD(O4,100))","v":"00:00:00"},null,null,{"$f":"TIME(0,R4/100,MOD(R4,100))","v":"00:00:00"},null,null,{"$f":"TIME(0,U4/100,MOD(U4,100))","v":"00:00:00"},null,null,{"$f":"TIME(0,X4/100,MOD(X4,100))","v":"00:00:00"},null,null,{"$f":"TIME(0,AA4/100,MOD(AA4,100))","v":"00:00:00"},null,null,{"$f":"TIME(0,AD4/100,MOD(AD4,100))","v":"00:00:00"},null,null,{"$f":"TIME(0,AG4/100,MOD(AG4,100))","v":"00:00:00"},null,null,{"$f":"TIME(0,AJ4/100,MOD(AJ4,100))","v":"00:00:00"},null,{"$f":"COUNTA(C4,F4,I4,L4,O4,R4,U4,X4,AA4,AD4,AG4,AJ4)","v":0},{"$f":"VLOOKUP(AM4,'note  balises cherchéesFormat12'!$B$3:$C$13,2,TRUE)","v":0},{"$f":"D4+G4+J4+M4+P4+S4+V4+Y4+AB4+AE4+AH4+AK4","v":"00:00:00"},{"$f":"IFERROR(AO4/AM4,0)","v":"00:00:00"},{"$f":"IFERROR(VLOOKUP(AP4,'note rythmeFormat1et2'!$C$3:$D$14,2,TRUE),0)","v":0},{"$f":"E4+H4+K4+N4+Q4+T4+W4+Z4+AC4+AF4+AI4+AL4","v":0},{"$f":"IFERROR(VLOOKUP(AR4,'note nbre erreursformat1et2'!$C$2:$D$9,2,TRUE),0)","v":10},null,null,{"$f":"AN4+AQ4+AS4+AT4","v":10},{"$f":"(20/21)*AV4","v":9.5238095238095237}]
[null,null,null,"00:00:00",null,null,{"$f":"TIME(0,F5/100,MOD(F5,100))","v":"00:00:00"},null,null,{"$f":"TIME(0,I5/100,MOD(I5,100))","v":"00:00:00"},null,null,{"$f":"TIME(0,L5/100,MOD(L5,100))","v":"00:00:00"},null,null,{"$f":"TIME(0,O5/100,MOD(O5,100))","v":"00:00:00"},null,null,{"$f":"TIME(0,R5/100,MOD(R5,100))","v":"00:00:00"},null,null,{"$f":"TIME(0,U5/100,MOD(U5,100))","v":"00:00:00"},null,null,{"$f":"TIME(0,X5/100,MOD(X5,100))","v":"00:00:00"},null,null,{"$f":"TIME(0,AA5/100,MOD(AA5,100))","v":"00:00:00"},null,null,{"$f":"TIME(0,AD5/100,MOD(AD5,100))","v":"00:00:00"},null,null,{"$f":"TIME(0,AG5/100,MOD(AG5,100))","v":"00:00:00"},null,null,{"$f":"TIME(0,AJ5/100,MOD(AJ5,100))","v":"00:00:00"},null,0,{"$f":"VLOOKUP(AM5,'note  balises cherchéesFormat12'!$B$3:$C$13,2,TRUE)","v":0},"00:00:00",{"$f":"IFERROR(AO5/AM5,0)","v":"00:00:00"},{"$f":"IFERROR(VLOOKUP(AP5,'note rythmeFormat1et2'!$C$3:$D$14,2,TRUE),0)","v":0},0,{"$f":"IFERROR(VLOOKUP(AR5,'note nbre erreursformat1et2'!$C$2:$D$9,2,TRUE),0)","v":10},null,null,10,{"$f":"(20/21)*AV5","v":9.5238095238095237}]
[null,null,null,"00:00:00",null,null,"00:00:00",null,null,"00:00:00",null,null,"00:00:00",null,null,"00:00:00",null,null,"00:00:00",null,null,"00:00:00",null,null,"00:00:00",null,null,"00:00:00",null,null,"00:00:00",null,null,"00:00:00",null,null,"00:00:00",null,0,{"$f":"VLOOKUP(AM6,'note  balises cherchéesFormat12'!$B$3:$C$13,2,TRUE)","v":0},"00:00:00","00:00:00",{"$f":"IFERROR(VLOOKUP(AP6,'note rythmeFormat1et2'!$C$3:$D$14,2,TRUE),0)","v":0},0,{"$f":"IFERROR(VLOOKUP(AR6,'note nbre erreursformat1et2'!$C$2:$D$9,2,TRUE),0)","v":10},null,null,10,9.5238095238095237]
{"$rows_left_out":32}
{"sheet":"note rythmeFormat1et2","index":5,"n_rows":14,"n_cols":4,"rows_kept":14,"cut":false,"hidden":false,"merged":[[1,1,1,3]]}
[]
[null,"Note rythme"]
[null,100,{"$f":"TIME(0,B3/100,MOD(B3,100))","v":"00:01:00"},5]
[null,200,"00:02:00",5]
[null,300,"00:03:00",5]
[null,400,"00:04:00",4.5]
{"$rows_left_out":9}
{"sheet":"note nbre erreursformat1et2","index":6,"n_rows":9,"n_cols":4,"rows_kept":9,"cut":false,"hidden":false,"merged":[]}
[]
[null,null,0,10]
[null,null,1,9]
[null,null,2,8]
[null,null,3,6]
[null,null,4,4]
{"$rows_left_out":4}
{"sheet":"note  balises cherchéesFormat12","index":7,"n_rows":13,"n_cols":3,"rows_kept":13,"cut":false,"hidden":false,"merged":[[1,1,1,2]]}
[]
[null,"note nbre parcours"]
[null,0,0]
[null,3,1.5]
[null,4,2]
[null,5,2.5]
{"$rows_left_out":8}
{"sheet":"note parcourscherchésformat3et4","index":8,"n_rows":0,"n_cols":0,"rows_kept":0,"cut":false,"hidden":false,"merged":[]}

{"sheet":"liste d'élèves","index":9,"n_rows":37,"n_cols":2,"rows_kept":37,"cut":false,"hidden":false,"merged":[[0,0,1,1]]}
["Copier/coller votre liste d'élèves"]
[]
["NOM","PRENOM"]
["NOM1","Prenom1"]
["NOM2","Prenom2"]
["NOM3","Prenom3"]
{"$rows_left_out":32}
{"sheet":"validation de données","index":10,"n_rows":13,"n_cols":8,"rows_kept":13,"cut":false,"hidden":false,"merged":[]}
[]
[null,"o",null,null,null,1,null,1]
[null,"n",null,null,null,2,null,2]
[null,null,null,null,null,3,null,3]
[null,null,null,null,null,4,null,4]
[null,null,null,null,null,5,null,5]
{"$rows_left_out":8}
{"sheet":"Baremes 1","index":11,"n_rows":23,"n_cols":34,"rows_kept":23,"cut":false,"hidden":false,"merged":[[9,0,9,1],[11,2,11,3],[11,13,11,15],[15,2,15,3],[15,0,15,1],[13,0,13,2],[11,6,11,7],[11,11,11,12],[13,12,13,15],[10,0,10,15],[14,0,14,15],[15,6,15,7],[15,14,15,15],[15,4,15,5],[15,12,15,13],[15,10,15,11],[14,18,14,19],[14,20,14,22],[13,6,13,8],[13,9,13,11],[12,18,12,34],[13,33,13,34],[12,0,12,15],[14,31,14,32],[14,33,14,34],[14,23,14,24],[13,18,13,19],[14,25,14,26],[14,27,14,28],[14,29,14,30],[13,3,13,5],[13,31,13,32],[13,29,13,30],[13,20,13,22],[13,23,13,24],[13,25,13,26],[13,27,13,28],[15,8,15,9],[22,0,23,15],[17,0,17,3],[17,4,17,7],[17,8,17,11],[16,0,16,11]]}
[]
[]
[]
[]
[]
[]
{"$rows_left_out":18}
{"sheet":"Bareme 2","index":12,"n_rows":22,"n_cols":33,"rows_kept":22,"cut":false,"hidden":false,"merged":[[9,0,9,1],[10,0,10,15],[11,2,11,3],[11,6,11,7],[11,11,11,12],[11,13,11,15],[12,0,12,15],[13,0,13,2],[13,3,13,5],[13,6,13,8],[13,9,13,11],[13,12,13,15],[14,0,14,15],[15,0,15,1],[15,2,15,3],[15,4,15,5],[15,6,15,7],[15,8,15,9],[15,10,15,11],[15,12,15,13],[15,14,15,15],[12,17,12,33],[13,17,13,18],[13,19,13,21],[13,22,13,23],[13,24,13,25],[13,26,13,27],[14,32,14,33],[21,0,22,15],[13,28,13,29],[13,30,13,31],[13,32,13,33],[14,17,14,18],[14,19,14,21],[14,22,14,23],[14,24,14,25],[14,26,14,27],[14,28,14,29],[14,30,14,31],[16,0,16,11],[17,0,17,3],[17,4,17,7],[17,8,17,11]]}
[]
[]
[]
[]
[]
[]
{"$rows_left_out":16}