{"text_format":"1","workbook":"xlsx","n_sheets":8,"sheets":["ACCUEIL","COMBATPOULE","MONBAREME","SAELEVE1","REFERENTIELS","APPEL","DEBUT","SAMICBIS"],"not_rendered":{"charts":1,"images":59,"macros":0,"external_links":0,"defined_names":13,"comments":1,"pivot_tables":0},"unopened":[],"bounds":{"document_bytes":16777216,"sheet_cells":100000,"rows_first":2000,"rows_last":500,"rows_between":2000,"halvings":0,"cell_chars":16384,"cell_head_chars":4096},"cells_cut":0,"cells_raw":0,"read":"whole","date_system":"1900"}

{"sheet":"ACCUEIL","index":0,"n_rows":25,"n_cols":6,"rows_kept":25,"cut":false,"hidden":false,"merged":[]}
[]
[]
[]
[null,null,null,null,null,"1- Avant de commencer : dupliquez ce document et renommez le selon vos envies"]
[null,"ACCUEIL","CLASSES","DEBUT",null,"2- Supprimez les onglets et boutons inutiles (les colonnes et lignes aussi)"]
[null,null,null,null,null,"3- Créez votre appli"]
[]
[null,null,"COMBAT POULE"]
[]
[]
{"$rows_left_out":16}
{"sheet":"COMBATPOULE","index":1,"n_rows":109,"n_cols":97,"rows_kept":109,"cut":false,"hidden":false,"merged":[[1,25,2,34],[8,4,8,5],[7,25,7,34],[3,25,3,34],[4,25,4,34],[5,25,5,34],[6,25,6,34],[3,4,3,5],[4,4,4,5],[5,4,5,5],[6,4,6,5],[7,4,7,5],[9,3,9,4],[10,3,10,4],[9,6,9,7],[10,6,10,7],[9,9,9,10],[10,9,10,10],[9,15,9,16],[9,18,9,19],[10,15,10,16],[10,18,10,19],[19,9,19,10],[19,15,19,16],[9,12,9,13],[10,12,10,13],[10,61,10,66],[68,9,68,10],[68,15,68,16],[78,9,78,10],[78,15,78,16],[10,31,10,36],[10,37,10,42],[10,43,10,48],[10,49,10,54],[29,9,29,10],[29,15,29,16],[39,9,39,10],[39,15,39,16],[49,9,49,10],[49,15,49,16],[59,9,59,10],[98,9,98,10],[98,15,98,16],[108,9,108,10],[108,15,108,16],[10,55,10,60],[59,15,59,16],[88,9,88,10],[88,15,88,16]]}
[null,"Classe "]
[null,"STAGE",null,null,"ACCUEIL",null,null,null,null,null,null,null,null,null,null,null,null,null,null,null,null,null,null,null,null,"Tout le monde se rencontre "]
[]
[null,"Elèves",null,"VICTOIRES","1 POINT",null,"10 points","100 points",null,"CLASSEMENT",null,null,null,null,null,null,null,null,null,null,null,null,null,null,null,"Chaque combat dure 6 manches de 30 secondes",null,null,null,null,null,null,null,null,null,null,null,null,null,null,null,null,null,null,null,null,null,null,null,null,null,null,null,null,null,null,null,null,null,null,null,null,null,null,null,null,null,null,null,"1 PT","10 PT","100PT","V",null,null,"1 PT","10 PT","100PT","V",null,null,"1 PT","10 PT","100PT","V",null,null,"1 PT","10 PT","100PT","V",null,null,"1 PT","10 PT","100PT","V"]
["A","Audrey",null,null,{"$f":"BR5+BX5+CD5+CJ5+CP5","v":1},null,{"$f":"BS5+BY5+CE5+CK5","v":4},{"$f":"BT5+BZ5+CF5+CL5","v":1},null,null,null,null,null,null,null,null,null,null,null,null,null,null,null,null,null,"Pour gagner le combat il faut marquer plus de points que son adversaire",null,null,null,null,null,null,null,null,null,null,null,null,null,null,null,null,null,null,null,null,null,null,null,null,null,null,null,null,null,null,null,null,null,null,null,null,null,null,null,null,null,null,{"$f":"$B5&\"_1\"","v":"Audrey_1"},{"$f":"IFERROR(VLOOKUP(BQ5,$BP$12:$BT$115,3,FALSE),0)","v":1},{"$f":"IFERROR(VLOOKUP(BQ5,$BP$12:$BT$115,4,FALSE),0)","v":4},{"$f":"IFERROR(VLOOKUP(BQ5,$BP$12:$BT$115,5,FALSE),0)","v":1},null,null,{"$f":"$B5&\"_2\"","v":"Audrey_2"},{"$f":"IFERROR(VLOOKUP(BW5,$BP$12:$BT$115,3,FALSE),0)","v":0},{"$f":"IFERROR(VLOOKUP(BW5,$BP$12:$BT$115,4,FALSE),0)","v":0},{"$f":"IFERROR(VLOOKUP(BW5,$BP$12:$BT$115,5,FALSE),0)","v":0},null,null,{"$f":"$B5&\"_3\"","v":"Audrey_3"},{"$f":"IFERROR(VLOOKUP(CC5,$BP$12:$BT$115,3,FALSE),0)","v":0},{"$f":"IFERROR(VLOOKUP(CC5,$BP$12:$BT$115,4,FALSE),0)","v":0},{"$f":"IFERROR(VLOOKUP(CC5,$BP$12:$BT$115,5,FALSE),0)","v":0},null,null,{"$f":"$B5&\"_4\"","v":"Audrey_4"},{"$f":"IFERROR(VLOOKUP(CI5,$BP$12:$BT$115,3,FALSE),0)","v":0},{"$f":"IFERROR(VLOOKUP(CI5,$BP$12:$BT$115,4,FALSE),0)","v":0},{"$f":"IFERROR(VLOOKUP(CI5,$BP$12:$BT$115,5,FALSE),0)","v":0},null,null,{"$f":"$B5&\"_5\"","v":"Audrey_5"},{"$f":"IFERROR(VLOOKUP(CO5,$BP$12:$BT$115,3,FALSE),0)","v":0},{"$f":"IFERROR(VLOOKUP(CO5,$BP$12:$BT$115,4,FALSE),0)","v":0},{"$f":"IFERROR(VLOOKUP(CO5,$BP$12:$BT$115,5,FALSE),0)","v":0}]
["B","jean",null,null,{"$f":"BR6+BX6+CD6+CJ6+CP6","v":0},null,{"$f":"BS6+BY6+CE6+CK6","v":4},{"$f":"BT6+BZ6+CF6+CL6","v":0},null,null,null,null,null,null,null,null,null,null,null,null,null,null,null,null,null,"On marque 100 points pour un tombé",null,null,null,null,null,null,null,null,null,null,null,null,null,null,null,null,null,null,null,null,null,null,null,null,null,null,null,null,null,null,null,null,null,null,null,null,null,null,null,null,null,null,{"$f":"$B6&\"_1\"","v":"jean_1"},{"$f":"IFERROR(VLOOKUP(BQ6,$BP$12:$BT$115,3,FALSE),0)","v":0},{"$f":"IFERROR(VLOOKUP(BQ6,$BP$12:$BT$115,4,FALSE),0)","v":3},{"$f":"IFERROR(VLOOKUP(BQ6,$BP$12:$BT$115,5,FALSE),0)","v":0},null,null,{"$f":"$B6&\"_2\"","v":"jean_2"},{"$f":"IFERROR(VLOOKUP(BW6,$BP$12:$BT$115,3,FALSE),0)","v":0},{"$f":"IFERROR(VLOOKUP(BW6,$BP$12:$BT$115,4,FALSE),0)","v":0},{"$f":"IFERROR(VLOOKUP(BW6,$BP$12:$BT$115,5,FALSE),0)","v":0},null,null,{"$f":"$B6&\"_3\"","v":"jean_3"},{"$f":"IFERROR(VLOOKUP(CC6,$BP$12:$BT$115,3,FALSE),0)","v":0},{"$f":"IFERROR(VLOOKUP(CC6,$BP$12:$BT$115,4,FALSE),0)","v":0},{"$f":"IFERROR(VLOOKUP(CC6,$BP$12:$BT$115,5,FALSE),0)","v":0},null,null,{"$f":"$B6&\"_4\"","v":"jean_4"},{"$f":"IFERROR(VLOOKUP(CI6,$BP$12:$BT$115,3,FALSE),0)","v":0},{"$f":"IFERROR(VLOOKUP(CI6,$BP$12:$BT$115,4,FALSE),0)","v":1},{"$f":"IFERROR(VLOOKUP(CI6,$BP$12:$BT$115,5,FALSE),0)","v":0},null,null,{"$f":"$B6&\"_5\"","v":"jean_5"},{"$f":"IFERROR(VLOOKUP(CO6,$BP$12:$BT$115,3,FALSE),0)","v":0},{"$f":"IFERROR(VLOOKUP(CO6,$BP$12:$BT$115,4,FALSE),0)","v":0},{"$f":"IFERROR(VLOOKUP(CO6,$BP$12:$BT$115,5,FALSE),0)","v":0}]
["C","abdel",null,null,0,null,0,0,null,null,null,null,null,null,null,null,null,null,null,null,null,null,null,null,null,"10 points pour une mise en danger ",null,null,null,null,null,null,null,null,null,null,null,null,null,null,null,null,null,null,null,null,null,null,null,null,null,null,null,null,null,null,null,null,null,null,null,null,null,null,null,null,null,null,"abdel_1",{"$f":"IFERROR(VLOOKUP(BQ7,$BP$12:$BT$115,3,FALSE),0)","v":0},{"$f":"IFERROR(VLOOKUP(BQ7,$BP$12:$BT$115,4,FALSE),0)","v":0},{"$f":"IFERROR(VLOOKUP(BQ7,$BP$12:$BT$115,5,FALSE),0)","v":0},null,null,"abdel_2",{"$f":"IFERROR(VLOOKUP(BW7,$BP$12:$BT$115,3,FALSE),0)","v":0},{"$f":"IFERROR(VLOOKUP(BW7,$BP$12:$BT$115,4,FALSE),0)","v":0},{"$f":"IFERROR(VLOOKUP(BW7,$BP$12:$BT$115,5,FALSE),0)","v":0},null,null,"abdel_3",{"$f":"IFERROR(VLOOKUP(CC7,$BP$12:$BT$115,3,FALSE),0)","v":0},{"$f":"IFERROR(VLOOKUP(CC7,$BP$12:$BT$115,4,FALSE),0)","v":0},{"$f":"IFERROR(VLOOKUP(CC7,$BP$12:$BT$115,5,FALSE),0)","v":0},null,null,"abdel_4",{"$f":"IFERROR(VLOOKUP(CI7,$BP$12:$BT$115,3,FALSE),0)","v":0},{"$f":"IFERROR(VLOOKUP(CI7,$BP$12:$BT$115,4,FALSE),0)","v":0},{"$f":"IFERROR(VLOOKUP(CI7,$BP$12:$BT$115,5,FALSE),0)","v":0},null,null,"abdel_5",{"$f":"IFERROR(VLOOKUP(CO7,$BP$12:$BT$115,3,FALSE),0)","v":0},{"$f":"IFERROR(VLOOKUP(CO7,$BP$12:$BT$115,4,FALSE),0)","v":0},{"$f":"IFERROR(VLOOKUP(CO7,$BP$12:$BT$115,5,FALSE),0)","v":0}]
["D","mic",null,null,0,null,1,3,null,null,null,null,null,null,null,null,null,null,null,null,null,null,null,null,null,"1 point pour une sortie de tapis",null,null,null,null,null,null,null,null,null,null,null,null,null,null,null,null,null,null,null,null,null,null,null,null,null,null,null,null,null,null,null,null,null,null,null,null,null,null,null,null,null,null,"mic_1",{"$f":"IFERROR(VLOOKUP(BQ8,$BP$12:$BT$115,3,FALSE),0)","v":0},{"$f":"IFERROR(VLOOKUP(BQ8,$BP$12:$BT$115,4,FALSE),0)","v":1},{"$f":"IFERROR(VLOOKUP(BQ8,$BP$12:$BT$115,5,FALSE),0)","v":3},null,null,"mic_2",{"$f":"IFERROR(VLOOKUP(BW8,$BP$12:$BT$115,3,FALSE),0)","v":0},{"$f":"IFERROR(VLOOKUP(BW8,$BP$12:$BT$115,4,FALSE),0)","v":0},{"$f":"IFERROR(VLOOKUP(BW8,$BP$12:$BT$115,5,FALSE),0)","v":0},null,null,"mic_3",{"$f":"IFERROR(VLOOKUP(CC8,$BP$12:$BT$115,3,FALSE),0)","v":0},{"$f":"IFERROR(VLOOKUP(CC8,$BP$12:$BT$115,4,FALSE),0)","v":0},{"$f":"IFERROR(VLOOKUP(CC8,$BP$12:$BT$115,5,FALSE),0)","v":0},null,null,"mic_4",{"$f":"IFERROR(VLOOKUP(CI8,$BP$12:$BT$115,3,FALSE),0)","v":0},{"$f":"IFERROR(VLOOKUP(CI8,$BP$12:$BT$115,4,FALSE),0)","v":0},{"$f":"IFERROR(VLOOKUP(CI8,$BP$12:$BT$115,5,FALSE),0)","v":0},null,null,"mic_5",{"$f":"IFERROR(VLOOKUP(CO8,$BP$12:$BT$115,3,FALSE),0)","v":0},{"$f":"IFERROR(VLOOKUP(CO8,$BP$12:$BT$115,4,FALSE),0)","v":0},{"$f":"IFERROR(VLOOKUP(CO8,$BP$12:$BT$115,5,FALSE),0)","v":0}]
["E","Nadine",null,null,0,null,3,0,null,null,null,null,null,null,null,null,null,null,null,null,null,null,null,null,null,null,null,null,null,null,null,null,null,null,null,null,null,null,null,null,null,null,null,null,null,null,null,null,null,null,null,null,null,null,null,null,null,null,null,null,null,null,null,null,null,null,null,null,"Nadine_1",{"$f":"IFERROR(VLOOKUP(BQ9,$BP$12:$BT$115,3,FALSE),0)","v":0},{"$f":"IFERROR(VLOOKUP(BQ9,$BP$12:$BT$115,4,FALSE),0)","v":3},{"$f":"IFERROR(VLOOKUP(BQ9,$BP$12:$BT$115,5,FALSE),0)","v":0},null,null,"Nadine_2",{"$f":"IFERROR(VLOOKUP(BW9,$BP$12:$BT$115,3,FALSE),0)","v":0},{"$f":"IFERROR(VLOOKUP(BW9,$BP$12:$BT$115,4,FALSE),0)","v":0},{"$f":"IFERROR(VLOOKUP(BW9,$BP$12:$BT$115,5,FALSE),0)","v":0},null,null,"Nadine_3",{"$f":"IFERROR(VLOOKUP(CC9,$BP$12:$BT$115,3,FALSE),0)","v":0},{"$f":"IFERROR(VLOOKUP(CC9,$BP$12:$BT$115,4,FALSE),0)","v":0},{"$f":"IFERROR(VLOOKUP(CC9,$BP$12:$BT$115,5,FALSE),0)","v":0},null,null,"Nadine_4",{"$f":"IFERROR(VLOOKUP(CI9,$BP$12:$BT$115,3,FALSE),0)","v":0},{"$f":"IFERROR(VLOOKUP(CI9,$BP$12:$BT$115,4,FALSE),0)","v":0},{"$f":"IFERROR(VLOOKUP(CI9,$BP$12:$BT$115,5,FALSE),0)","v":0},null,null,"Nadine_5",{"$f":"IFERROR(VLOOKUP(CO9,$BP$12:$BT$115,3,FALSE),0)","v":0},{"$f":"IFERROR(VLOOKUP(CO9,$BP$12:$BT$115,4,FALSE),0)","v":0},{"$f":"IFERROR(VLOOKUP(CO9,$BP$12:$BT$115,5,FALSE),0)","v":0}]
[null,null,null,"MANCHE 1",null,null,"MANCHE 2",null,null,"MANCHE 3",null,null,"MANCHE 4",null,null,"MANCHE 5",null,null,"MANCHE 6"]
{"$rows_left_out":100}
{"sheet":"MONBAREME","index":2,"n_rows":36,"n_cols":11,"rows_kept":36,"cut":false,"hidden":false,"merged":[[6,1,6,2],[0,5,2,10],[0,13,2,16],[3,1,3,2],[4,1,4,2],[5,1,5,2],[18,1,18,2],[7,1,7,2],[8,1,8,2],[9,1,9,2],[10,1,10,2],[11,1,11,2],[12,1,12,2],[13,1,13,2],[14,1,14,2],[15,1,15,2],[16,1,16,2],[17,1,17,2],[30,1,30,2],[19,1,19,2],[20,1,20,2],[21,1,21,2],[22,1,22,2],[23,1,23,2],[24,1,24,2],[25,1,25,2],[26,1,26,2],[27,1,27,2],[28,1,28,2],[29,1,29,2],[31,1,31,2],[32,1,32,2],[33,1,33,2],[34,1,34,2],[35,1,35,2]]}
[null,"Classe "]
[null,"1TU-GA",null,null,"N4"]
[]
[null,"Elèves",null,{"$f":"Tableau4[[#Headers],[Points marqués]]","v":"Points marqués"},{"$f":"Tableau4[[#Headers],[CRITERE 2]]","v":"CRITERE 2"},{"$f":"Tableau4[[#Headers],[CRITERE 3]]","v":"CRITERE 3"},{"$f":"Tableau4[[#Headers],[CRITERE 4]]","v":"CRITERE 4"},{"$f":"Tableau46[[#Headers],[POINTS]]","v":"POINTS"},{"$f":"Tableau46[[#Headers],[COMPETENCE]]","v":"COMPETENCE"},{"$f":"Tableau46[[#Headers],[C3]]","v":"C3"},{"$f":"Tableau46[[#Headers],[C4]]","v":"C4"}]
[{"$f":"IF($B$2=APPEL!$B$1,VLOOKUP(B5,APPEL!$C$3:$D$38,2,FALSE),IF($B$2=APPEL!$E$1,VLOOKUP(B5,APPEL!$F$3:$G$38,2,FALSE),IF($B$2=APPEL!$H$1,VLOOKUP(B5,APPEL!$I$3:$J$38,2,FALSE),IF($B$2=APPEL!$K$1,VLOOKUP(B5,APPEL!$L$3:$M$38,2,FALSE),IF($B$2=APPEL!$N$1,VLOOKUP(B5,APPEL!$O$3:$P$38,2,FALSE),IF($B$2=APPEL!$Q$1,VLOOKUP(B5,APPEL!$R$3:$S$38,2,FALSE),IF($B$2=APPEL!$T$1,VLOOKUP(B5,APPEL!$U$3:$V$38,2,FALSE),IF($B$2=APPEL!$W$1,VLOOKUP(B5,APPEL!$X$3:$Y$38,2,FALSE),IF($B$2=APPEL!$Z$1,VLOOKUP(B5,APPEL!$AA$3:$AB$38,2,FALSE))))))))))","v":"g"},{"$f":"IF($B$2=APPEL!$B$1,APPEL!C3,IF($B$2=APPEL!$E$1,APPEL!F3,IF($B$2=APPEL!$H$1,APPEL!I3,IF($B$2=APPEL!$K$1,APPEL!L3,IF($B$2=APPEL!$N$1,APPEL!O3,IF($B$2=APPEL!$Q$1,APPEL!R3,IF($B$2=APPEL!$T$1,APPEL!U3,IF($B$2=APPEL!$W$1,APPEL!X3,IF($B$2=APPEL!$Z$1,APPEL!AA3)))))))))","v":"Abraham"},null,100,{"$f":"IFERROR(VLOOKUP(D5,DEBUT!$B$5:$E$100,2,FALSE),\"\")","v":0},{"$f":"IFERROR(VLOOKUP(D5,DEBUT!$B$5:$E$100,3,FALSE),\"\")","v":0},{"$f":"IFERROR(VLOOKUP(D5,DEBUT!$B$5:$E$100,4,FALSE),\"\")","v":0},"et en +",{"$f":"IFERROR(VLOOKUP(H5,DEBUT!$G$5:$J$100,2,FALSE),\"\")","v":""},{"$f":"IFERROR(VLOOKUP(H5,DEBUT!$G$5:$J$100,3,FALSE),\"\")","v":""},{"$f":"IFERROR(VLOOKUP(H5,DEBUT!$G$5:$J$100,4,FALSE),\"\")","v":""}]
[{"$f":"IF($B$2=APPEL!$B$1,VLOOKUP(B6,APPEL!$C$3:$D$38,2,FALSE),IF($B$2=APPEL!$E$1,VLOOKUP(B6,APPEL!$F$3:$G$38,2,FALSE),IF($B$2=APPEL!$H$1,VLOOKUP(B6,APPEL!$I$3:$J$38,2,FALSE),IF($B$2=APPEL!$K$1,VLOOKUP(B6,APPEL!$L$3:$M$38,2,FALSE),IF($B$2=APPEL!$N$1,VLOOKUP(B6,APPEL!$O$3:$P$38,2,FALSE),IF($B$2=APPEL!$Q$1,VLOOKUP(B6,APPEL!$R$3:$S$38,2,FALSE),IF($B$2=APPEL!$T$1,VLOOKUP(B6,APPEL!$U$3:$V$38,2,FALSE),IF($B$2=APPEL!$W$1,VLOOKUP(B6,APPEL!$X$3:$Y$38,2,FALSE),IF($B$2=APPEL!$Z$1,VLOOKUP(B6,APPEL!$AA$3:$AB$38,2,FALSE))))))))))","v":"f"},{"$f":"IF($B$2=APPEL!$B$1,APPEL!C4,IF($B$2=APPEL!$E$1,APPEL!F4,IF($B$2=APPEL!$H$1,APPEL!I4,IF($B$2=APPEL!$K$1,APPEL!L4,IF($B$2=APPEL!$N$1,APPEL!O4,IF($B$2=APPEL!$Q$1,APPEL!R4,IF($B$2=APPEL!$T$1,APPEL!U4,IF($B$2=APPEL!$W$1,APPEL!X4,IF($B$2=APPEL!$Z$1,APPEL!AA4)))))))))","v":"Aimane"},null,10,{"$f":"IFERROR(VLOOKUP(D6,DEBUT!$B$5:$E$100,2,FALSE),\"\")","v":0},{"$f":"IFERROR(VLOOKUP(D6,DEBUT!$B$5:$E$100,3,FALSE),\"\")","v":0},{"$f":"IFERROR(VLOOKUP(D6,DEBUT!$B$5:$E$100,4,FALSE),\"\")","v":0},"Bien échauffé",{"$f":"IFERROR(VLOOKUP(H6,DEBUT!$G$5:$J$100,2,FALSE),\"\")","v":""},{"$f":"IFERROR(VLOOKUP(H6,DEBUT!$G$5:$J$100,3,FALSE),\"\")","v":""},{"$f":"IFERROR(VLOOKUP(H6,DEBUT!$G$5:$J$100,4,FALSE),\"\")","v":""}]
[{"$f":"IF($B$2=APPEL!$B$1,VLOOKUP(B7,APPEL!$C$3:$D$38,2,FALSE),IF($B$2=APPEL!$E$1,VLOOKUP(B7,APPEL!$F$3:$G$38,2,FALSE),IF($B$2=APPEL!$H$1,VLOOKUP(B7,APPEL!$I$3:$J$38,2,FALSE),IF($B$2=APPEL!$K$1,VLOOKUP(B7,APPEL!$L$3:$M$38,2,FALSE),IF($B$2=APPEL!$N$1,VLOOKUP(B7,APPEL!$O$3:$P$38,2,FALSE),IF($B$2=APPEL!$Q$1,VLOOKUP(B7,APPEL!$R$3:$S$38,2,FALSE),IF($B$2=APPEL!$T$1,VLOOKUP(B7,APPEL!$U$3:$V$38,2,FALSE),IF($B$2=APPEL!$W$1,VLOOKUP(B7,APPEL!$X$3:$Y$38,2,FALSE),IF($B$2=APPEL!$Z$1,VLOOKUP(B7,APPEL!$AA$3:$AB$38,2,FALSE))))))))))","v":"f"},{"$f":"IF($B$2=APPEL!$B$1,APPEL!C5,IF($B$2=APPEL!$E$1,APPEL!F5,IF($B$2=APPEL!$H$1,APPEL!I5,IF($B$2=APPEL!$K$1,APPEL!L5,IF($B$2=APPEL!$N$1,APPEL!O5,IF($B$2=APPEL!$Q$1,APPEL!R5,IF($B$2=APPEL!$T$1,APPEL!U5,IF($B$2=APPEL!$W$1,APPEL!X5,IF($B$2=APPEL!$Z$1,APPEL!AA5)))))))))","v":"Amel"},null,null,{"$f":"IFERROR(VLOOKUP(D7,DEBUT!$B$5:$E$100,2,FALSE),\"\")","v":""},{"$f":"IFERROR(VLOOKUP(D7,DEBUT!$B$5:$E$100,3,FALSE),\"\")","v":""},{"$f":"IFERROR(VLOOKUP(D7,DEBUT!$B$5:$E$100,4,FALSE),\"\")","v":""},null,{"$f":"IFERROR(VLOOKUP(H7,DEBUT!$G$5:$J$100,2,FALSE),\"\")","v":"Insuffisant"},{"$f":"IFERROR(VLOOKUP(H7,DEBUT!$G$5:$J$100,3,FALSE),\"\")","v":0},{"$f":"IFERROR(VLOOKUP(H7,DEBUT!$G$5:$J$100,4,FALSE),\"\")","v":0}]
[{"$f":"IF($B$2=APPEL!$B$1,VLOOKUP(B8,APPEL!$C$3:$D$38,2,FALSE),IF($B$2=APPEL!$E$1,VLOOKUP(B8,APPEL!$F$3:$G$38,2,FALSE),IF($B$2=APPEL!$H$1,VLOOKUP(B8,APPEL!$I$3:$J$38,2,FALSE),IF($B$2=APPEL!$K$1,VLOOKUP(B8,APPEL!$L$3:$M$38,2,FALSE),IF($B$2=APPEL!$N$1,VLOOKUP(B8,APPEL!$O$3:$P$38,2,FALSE),IF($B$2=APPEL!$Q$1,VLOOKUP(B8,APPEL!$R$3:$S$38,2,FALSE),IF($B$2=APPEL!$T$1,VLOOKUP(B8,APPEL!$U$3:$V$38,2,FALSE),IF($B$2=APPEL!$W$1,VLOOKUP(B8,APPEL!$X$3:$Y$38,2,FALSE),IF($B$2=APPEL!$Z$1,VLOOKUP(B8,APPEL!$AA$3:$AB$38,2,FALSE))))))))))","v":"f"},{"$f":"IF($B$2=APPEL!$B$1,APPEL!C6,IF($B$2=APPEL!$E$1,APPEL!F6,IF($B$2=APPEL!$H$1,APPEL!I6,IF($B$2=APPEL!$K$1,APPEL!L6,IF($B$2=APPEL!$N$1,APPEL!O6,IF($B$2=APPEL!$Q$1,APPEL!R6,IF($B$2=APPEL!$T$1,APPEL!U6,IF($B$2=APPEL!$W$1,APPEL!X6,IF($B$2=APPEL!$Z$1,APPEL!AA6)))))))))","v":"Amira"},null,null,{"$f":"IFERROR(VLOOKUP(D8,DEBUT!$B$5:$E$100,2,FALSE),\"\")","v":""},{"$f":"IFERROR(VLOOKUP(D8,DEBUT!$B$5:$E$100,3,FALSE),\"\")","v":""},{"$f":"IFERROR(VLOOKUP(D8,DEBUT!$B$5:$E$100,4,FALSE),\"\")","v":""},null,{"$f":"IFERROR(VLOOKUP(H8,DEBUT!$G$5:$J$100,2,FALSE),\"\")","v":"Insuffisant"},{"$f":"IFERROR(VLOOKUP(H8,DEBUT!$G$5:$J$100,3,FALSE),\"\")","v":0},{"$f":"IFERROR(VLOOKUP(H8,DEBUT!$G$5:$J$100,4,FALSE),\"\")","v":0}]
[{"$f":"IF($B$2=APPEL!$B$1,VLOOKUP(B9,APPEL!$C$3:$D$38,2,FALSE),IF($B$2=APPEL!$E$1,VLOOKUP(B9,APPEL!$F$3:$G$38,2,FALSE),IF($B$2=APPEL!$H$1,VLOOKUP(B9,APPEL!$I$3:$J$38,2,FALSE),IF($B$2=APPEL!$K$1,VLOOKUP(B9,APPEL!$L$3:$M$38,2,FALSE),IF($B$2=APPEL!$N$1,VLOOKUP(B9,APPEL!$O$3:$P$38,2,FALSE),IF($B$2=APPEL!$Q$1,VLOOKUP(B9,APPEL!$R$3:$S$38,2,FALSE),IF($B$2=APPEL!$T$1,VLOOKUP(B9,APPEL!$U$3:$V$38,2,FALSE),IF($B$2=APPEL!$W$1,VLOOKUP(B9,APPEL!$X$3:$Y$38,2,FALSE),IF($B$2=APPEL!$Z$1,VLOOKUP(B9,APPEL!$AA$3:$AB$38,2,FALSE))))))))))","v":"g"},{"$f":"IF($B$2=APPEL!$B$1,APPEL!C7,IF($B$2=APPEL!$E$1,APPEL!F7,IF($B$2=APPEL!$H$1,APPEL!I7,IF($B$2=APPEL!$K$1,APPEL!L7,IF($B$2=APPEL!$N$1,APPEL!O7,IF($B$2=APPEL!$Q$1,APPEL!R7,IF($B$2=APPEL!$T$1,APPEL!U7,IF($B$2=APPEL!$W$1,APPEL!X7,IF($B$2=APPEL!$Z$1,APPEL!AA7)))))))))","v":"Anis"},null,null,{"$f":"IFERROR(VLOOKUP(D9,DEBUT!$B$5:$E$100,2,FALSE),\"\")","v":""},{"$f":"IFERROR(VLOOKUP(D9,DEBUT!$B$5:$E$100,3,FALSE),\"\")","v":""},{"$f":"IFERROR(VLOOKUP(D9,DEBUT!$B$5:$E$100,4,FALSE),\"\")","v":""},null,{"$f":"IFERROR(VLOOKUP(H9,DEBUT!$G$5:$J$100,2,FALSE),\"\")","v":"Insuffisant"},{"$f":"IFERROR(VLOOKUP(H9,DEBUT!$G$5:$J$100,3,FALSE),\"\")","v":0},{"$f":"IFERROR(VLOOKUP(H9,DEBUT!$G$5:$J$100,4,FALSE),\"\")","v":0}]
[{"$f":"IF($B$2=APPEL!$B$1,VLOOKUP(B10,APPEL!$C$3:$D$38,2,FALSE),IF($B$2=APPEL!$E$1,VLOOKUP(B10,APPEL!$F$3:$G$38,2,FALSE),IF($B$2=APPEL!$H$1,VLOOKUP(B10,APPEL!$I$3:$J$38,2,FALSE),IF($B$2=APPEL!$K$1,VLOOKUP(B10,APPEL!$L$3:$M$38,2,FALSE),IF($B$2=APPEL!$N$1,VLOOKUP(B10,APPEL!$O$3:$P$38,2,FALSE),IF($B$2=APPEL!$Q$1,VLOOKUP(B10,APPEL!$R$3:$S$38,2,FALSE),IF($B$2=APPEL!$T$1,VLOOKUP(B10,APPEL!$U$3:$V$38,2,FALSE),IF($B$2=APPEL!$W$1,VLOOKUP(B10,APPEL!$X$3:$Y$38,2,FALSE),IF($B$2=APPEL!$Z$1,VLOOKUP(B10,APPEL!$AA$3:$AB$38,2,FALSE))))))))))","v":"f"},{"$f":"IF($B$2=APPEL!$B$1,APPEL!C8,IF($B$2=APPEL!$E$1,APPEL!F8,IF($B$2=APPEL!$H$1,APPEL!I8,IF($B$2=APPEL!$K$1,APPEL!L8,IF($B$2=APPEL!$N$1,APPEL!O8,IF($B$2=APPEL!$Q$1,APPEL!R8,IF($B$2=APPEL!$T$1,APPEL!U8,IF($B$2=APPEL!$W$1,APPEL!X8,IF($B$2=APPEL!$Z$1,APPEL!AA8)))))))))","v":"Beyza"},null,null,{"$f":"IFERROR(VLOOKUP(D10,DEBUT!$B$5:$E$100,2,FALSE),\"\")","v":""},{"$f":"IFERROR(VLOOKUP(D10,DEBUT!$B$5:$E$100,3,FALSE),\"\")","v":""},{"$f":"IFERROR(VLOOKUP(D10,DEBUT!$B$5:$E$100,4,FALSE),\"\")","v":""},null,{"$f":"IFERROR(VLOOKUP(H10,DEBUT!$G$5:$J$100,2,FALSE),\"\")","v":"Insuffisant"},{"$f":"IFERROR(VLOOKUP(H10,DEBUT!$G$5:$J$100,3,FALSE),\"\")","v":0},{"$f":"IFERROR(VLOOKUP(H10,DEBUT!$G$5:$J$100,4,FALSE),\"\")","v":0}]
{"$rows_left_out":27}
{"sheet":"SAELEVE1","index":3,"n_rows":19,"n_cols":11,"rows_kept":19,"cut":false,"hidden":false,"merged":[[15,2,15,10],[16,2,16,10],[17,2,17,10],[18,2,18,10],[14,9,14,10],[14,5,14,8],[13,2,13,4],[14,2,14,4],[13,9,13,10],[13,5,13,8],[7,17,7,18],[8,2,8,6],[8,7,8,10],[9,2,9,6],[9,7,9,10],[12,2,12,10],[4,2,4,6],[4,7,4,10],[5,2,7,6],[5,7,5,10],[6,7,6,10],[7,7,7,10],[2,2,3,2],[2,3,3,4],[2,6,2,9],[2,10,3,10],[3,6,3,9]]}
[null,null,null,"Situation d'apprentissage"]
[]
[null,null,{"$f":"VLOOKUP($D$3,SAMICBIS!$A$3:$T$70,4,FALSE)","v":"BAD"},"Max Tirs en 1'",null,"Obj",{"$f":"VLOOKUP($D$3,SAMICBIS!$A$3:$T$70,5,FALSE)","v":"Améliorer la qualité du tir en course"},null,null,null,{"$f":"VLOOKUP($D$3,SAMICBIS!$A$3:$T$70,2,FALSE)","v":"T1'"}]
[null,null,null,null,null,"But",{"$f":"VLOOKUP($D$3,SAMICBIS!$A$3:$T$70,6,FALSE)","v":"Marquer le plus de paniers possibles en 1 minute"}]
[null,null,"Schéma / Matériel nécessaire",null,null,null,null,"Matériel nécessaire"]
[null,null,null,null,null,null,null,{"$f":"VLOOKUP($D$3,SAMICBIS!$A$3:$T$70,13,FALSE)","v":"2 ballons (1 chacun). 1 panier. 2 plots. 1 chrono. 1 tablette."}]
[null,null,null,null,null,null,null,"Consignes"]
[null,null,null,null,null,null,null,{"$f":"CONCATENATE(VLOOKUP($D$3,SAMICBIS!$A$3:$T$70,8,FALSE),\"  -  \",VLOOKUP($D$3,SAMICBIS!$A$3:$T$70,10,FALSE))","v":"Mini défi 1 contre 1. Les joueurs se placent à leur plot. AU signal d'un camarade ils dribblent pour aller shooter au panier. Que le tir soit réussi ou non, les 2 joueurs retournent faire le tour du plot en dribblant pour tenter un nouveau tir. Ils tournent pendant 1 minute. chacun compte son score en même temps que les observateurs et le relève sur la tablette à la fin. 2 nouveaux élèves passent quand la minute est finie.  -  Consignes 2"}]
[null,null,"Critères de réussite",null,null,null,null,"Conseils pour réussir"]
[null,null,{"$f":"VLOOKUP($D$3,SAMICBIS!$A$3:$T$70,14,FALSE)","v":"Je réussi au moins 3 tirs à l'arrêt et 5 tirs en course."},null,null,null,null,{"$f":"VLOOKUP($D$3,SAMICBIS!$A$3:$T$70,12,FALSE)","v":"JE dribble rapidement pour pouvoir effectuer plusieurs shoots. Je m'applique sur chaque tir en m'aidant de l'angle du carré de la planche. "}]
{"$rows_left_out":10}
{"sheet":"REFERENTIELS","index":4,"n_rows":47,"n_cols":7,"rows_kept":47,"cut":false,"hidden":false,"merged":[[44,2,45,2],[44,3,45,3],[46,8,46,9],[25,2,26,2],[25,3,26,3],[27,2,28,2],[27,3,28,3],[29,8,29,9],[30,2,30,9],[37,2,37,3],[37,4,37,9],[38,2,38,3],[38,4,38,9],[39,4,39,5],[39,6,39,9],[40,2,41,2],[40,3,41,3],[42,2,43,2],[3,2,3,3],[4,2,4,3],[20,2,20,3],[21,2,21,3],[42,3,43,3],[3,4,3,9],[4,4,4,9],[13,2,13,9],[5,4,5,5],[5,6,5,9],[20,4,20,9],[8,3,9,3],[6,3,7,3],[6,2,7,2],[8,2,9,2],[10,2,11,2],[10,3,11,3],[12,8,12,9],[21,4,21,9],[22,4,22,5],[22,6,22,9],[23,2,24,2],[23,3,24,3]]}
[]
[]
[null,null,"APSA N3"]
[null,null,"COMPETENCES ATTENDUES",null,"PRINCIPES D’ELABORATION DE L’EPREUVE"]
[]
[null,null,"POINTS A AFFECTER","ELEMENTS A EVALUER","COMPETENCE DE NIVEAU 3 EN COURS D’ACQUISITION\nDe 0 à 09 pts",null,"COMPETENCE DE NIVEAU 3 ACQUISE\nDe 10 à 20 pts"]
[null,null,"05 Points","Performance Individuelle sur 50m.\nTemps individuel sur 50 mètres"]
[]
[null,null,"05 Points","Indice de transmission. Différence entre  le meilleur temps réalisé sur 4x50 mètres (2) et la somme des temps des 4 coureurs sur 50m"]
[]
{"$rows_left_out":38}
{"sheet":"APPEL","index":5,"n_rows":38,"n_cols":28,"rows_kept":38,"cut":false,"hidden":false,"merged":[[0,19,0,20],[0,22,0,23],[0,25,0,26],[0,1,0,2],[0,4,0,5],[0,7,0,8],[0,10,0,11],[0,13,0,14],[0,16,0,17]]}
[null,"1TU-GA",null,null,"1TU-GA2",null,null,"STAGE",null,null,"1EVS",null,null,"1GA",null,null,"1TU",null,null,"STAGE",null,null,"classe8",null,null,"classe9"]
[null,"NOMS","PRENOMS","sexe","NOMS","PRENOMS","sexe","NOMS","PRENOMS","sexe","NOMS","PRENOMS","sexe","NOMS","PRENOMS","sexe","NOMS","PRENOMS","sexe","NOMS","PRENOMS","sexe","NOMS","PRENOMS","sexe","NOMS","PRENOMS","sexe"]
[1,null,"Abraham","g",null,"Ali Malek","g",null,"Christine"]
[2,null,"Aimane","f",null,"Aline","f",null,"Eric"]
[3,null,"Amel","f",null,"Alya","f",null,"Audrey"]
[4,null,"Amira","f",null,"Amine","g",null,"Julien"]
[5,null,"Anis","g",null,"Badis","g",null,"Marie"]
[6,null,"Beyza","f",null,"Jean-Michaël","g",null,"Nadine"]
[7,null,"Clarky","g",null,"Jessica","f",null,"Sylvain"]
[8,null,"Djamel","g",null,"Kaïna","f",null,"Céline"]
{"$rows_left_out":29}
{"sheet":"DEBUT","index":6,"n_rows":13,"n_cols":28,"rows_kept":13,"cut":false,"hidden":false,"merged":[[0,1,2,4],[0,11,2,16],[0,6,2,9]]}
[null,null,null,null,null,null,"BAREME POINTS MATCH",null,null,null,null,"MES DONNES DE VALIDATION MODIFIABLES"]
[]
[]
[null,"Points marqués","CRITERE 2","CRITERE 3","CRITERE 4",null,"POINTS","COMPETENCE","C3","C4",null,"DV1","DV2","DV3","DV4","DV5","DV6","DV7","DV8","DV9","DV10","DV11","DV12","DV13","DV14","DV15","DV16","DV17"]
[]
[null,100,null,null,null,null,0,"Insuffisant"]
[null,10,null,null,null,null,9,"Insuffisant"]
[null,1,null,null,null,null,10,"Fragile"]
[null,null,null,null,null,null,60,"Fragile"]
[null,null,null,null,null,null,61,"Satisfaisant"]
{"$rows_left_out":4}
{"sheet":"SAMICBIS","index":7,"n_rows":5,"n_cols":20,"rows_kept":5,"cut":false,"hidden":false,"merged":[]}
[null,null,null,null,null,null,null,null,"Taille schéma PC : 1,25x2,26",null,"Taille schéma tablette : 1,85x3,4\"",null,null,null,null,null,null,null,null,"Conseil pour "]
["nom SA","n° SA","OBJ GENERAL","APSA","Obj SA","But","Type SA","Consignes","Schéma","Consignes 2","Schéma 2","Réussir","Matériel ","CR","Intérêt SA","Connaissances","Capacités","Attitudes","Complexification","Simplification"]
["Max Tirs en 1'","T1'","Améliorer la qualité du tir en course. Construire une continuité dribble-tir","BAD","Améliorer la qualité du tir en course","Marquer le plus de paniers possibles en 1 minute","Défi","Mini défi 1 contre 1. Les joueurs se placent à leur plot. AU signal d'un camarade ils dribblent pour aller shooter au panier. Que le tir soit réussi ou non, les 2 joueurs retournent faire le tour du plot en dribblant pour tenter un nouveau tir. Ils tournent pendant 1 minute. chacun compte son score en même temps que les observateurs et le relève sur la tablette à la fin. 2 nouveaux élèves passent quand la minute est finie.",null,"Consignes 2",null,"JE dribble rapidement pour pouvoir effectuer plusieurs shoots. Je m'applique sur chaque tir en m'aidant de l'angle du carré de la planche. ","2 ballons (1 chacun). 1 panier. 2 plots. 1 chrono. 1 tablette.","Je réussi au moins 3 tirs à l'arrêt et 5 tirs en course.","Intérêt SA","Cns","Cap","Att","Cplx","Simpli"]
["1000 plots",1000]
["PASSE et VA","PVA"]