{"text_format":"1","workbook":"xlsx","n_sheets":13,"sheets":["ACCUEIL","Classeauto","Choixeleves","GRAPHIQUES","TRANSMISSION IDEALE","Choixeleves (2)","MONBAREME","MACROS","SAELEVE1","REFERENTIELS","APPEL","DEBUT","SAMICBIS"],"not_rendered":{"charts":1,"images":60,"macros":1,"external_links":0,"defined_names":20,"comments":1,"pivot_tables":0},"unopened":[],"bounds":{"document_bytes":16777216,"sheet_cells":100000,"rows_first":2000,"rows_last":500,"rows_between":2000,"halvings":0,"cell_chars":16384,"cell_head_chars":4096},"cells_cut":0,"cells_raw":0,"read":"whole","date_system":"1900"}

{"sheet":"ACCUEIL","index":0,"n_rows":25,"n_cols":6,"rows_kept":25,"cut":false,"hidden":false,"merged":[]}
[]
[]
[]
[null,null,null,null,null,"1- Avant de commencer : dupliquez ce document et renommez le selon vos envies"]
[null,"ACCUEIL","CLASSES","DEBUT",null,"2- Supprimez les onglets et boutons inutiles (les colonnes et lignes aussi)"]
[null,null,null,null,null,"3- Créez votre appli"]
{"$rows_left_out":20}
{"sheet":"Classeauto","index":1,"n_rows":36,"n_cols":5,"rows_kept":36,"cut":false,"hidden":false,"merged":[[33,1,33,2],[34,1,34,2],[35,1,35,2],[3,1,3,2],[28,1,28,2],[29,1,29,2],[30,1,30,2],[31,1,31,2],[32,1,32,2],[23,1,23,2],[24,1,24,2],[25,1,25,2],[26,1,26,2],[27,1,27,2],[18,1,18,2],[19,1,19,2],[20,1,20,2],[21,1,21,2],[22,1,22,2],[13,1,13,2],[14,1,14,2],[15,1,15,2],[16,1,16,2],[17,1,17,2],[8,1,8,2],[9,1,9,2],[10,1,10,2],[11,1,11,2],[12,1,12,2],[0,17,2,20],[4,1,4,2],[5,1,5,2],[6,1,6,2],[7,1,7,2],[0,5,2,14]]}
[null,"Classe "]
[null,"1TU-GA",null,null,"N4"]
[]
[null,"Elèves"]
[{"$f":"IF($B$2=APPEL!$B$1,VLOOKUP(B5,APPEL!$C$3:$D$38,2,FALSE),IF($B$2=APPEL!$E$1,VLOOKUP(B5,APPEL!$F$3:$G$38,2,FALSE),IF($B$2=APPEL!$H$1,VLOOKUP(B5,APPEL!$I$3:$J$38,2,FALSE),IF($B$2=APPEL!$K$1,VLOOKUP(B5,APPEL!$L$3:$M$38,2,FALSE),IF($B$2=APPEL!$N$1,VLOOKUP(B5,APPEL!$O$3:$P$38,2,FALSE),IF($B$2=APPEL!$Q$1,VLOOKUP(B5,APPEL!$R$3:$S$38,2,FALSE),IF($B$2=APPEL!$T$1,VLOOKUP(B5,APPEL!$U$3:$V$38,2,FALSE),IF($B$2=APPEL!$W$1,VLOOKUP(B5,APPEL!$X$3:$Y$38,2,FALSE),IF($B$2=APPEL!$Z$1,VLOOKUP(B5,APPEL!$AA$3:$AB$38,2,FALSE))))))))))","v":"g"},{"$f":"IF($B$2=APPEL!$B$1,APPEL!C3,IF($B$2=APPEL!$E$1,APPEL!F3,IF($B$2=APPEL!$H$1,APPEL!I3,IF($B$2=APPEL!$K$1,APPEL!L3,IF($B$2=APPEL!$N$1,APPEL!O3,IF($B$2=APPEL!$Q$1,APPEL!R3,IF($B$2=APPEL!$T$1,APPEL!U3,IF($B$2=APPEL!$W$1,APPEL!X3,IF($B$2=APPEL!$Z$1,APPEL!AA3)))))))))","v":"Abraham"}]
[{"$f":"IF($B$2=APPEL!$B$1,VLOOKUP(B6,APPEL!$C$3:$D$38,2,FALSE),IF($B$2=APPEL!$E$1,VLOOKUP(B6,APPEL!$F$3:$G$38,2,FALSE),IF($B$2=APPEL!$H$1,VLOOKUP(B6,APPEL!$I$3:$J$38,2,FALSE),IF($B$2=APPEL!$K$1,VLOOKUP(B6,APPEL!$L$3:$M$38,2,FALSE),IF($B$2=APPEL!$N$1,VLOOKUP(B6,APPEL!$O$3:$P$38,2,FALSE),IF($B$2=APPEL!$Q$1,VLOOKUP(B6,APPEL!$R$3:$S$38,2,FALSE),IF($B$2=APPEL!$T$1,VLOOKUP(B6,APPEL!$U$3:$V$38,2,FALSE),IF($B$2=APPEL!$W$1,VLOOKUP(B6,APPEL!$X$3:$Y$38,2,FALSE),IF($B$2=APPEL!$Z$1,VLOOKUP(B6,APPEL!$AA$3:$AB$38,2,FALSE))))))))))","v":"f"},{"$f":"IF($B$2=APPEL!$B$1,APPEL!C4,IF($B$2=APPEL!$E$1,APPEL!F4,IF($B$2=APPEL!$H$1,APPEL!I4,IF($B$2=APPEL!$K$1,APPEL!L4,IF($B$2=APPEL!$N$1,APPEL!O4,IF($B$2=APPEL!$Q$1,APPEL!R4,IF($B$2=APPEL!$T$1,APPEL!U4,IF($B$2=APPEL!$W$1,APPEL!X4,IF($B$2=APPEL!$Z$1,APPEL!AA4)))))))))","v":"Aimane"}]
{"$rows_left_out":31}
{"sheet":"Choixeleves","index":2,"n_rows":109,"n_cols":20,"rows_kept":109,"cut":false,"hidden":false,"merged":[[11,3,12,3],[11,4,12,4],[11,5,12,5],[11,6,12,6],[11,7,12,7],[17,3,18,3],[17,4,18,4],[17,5,18,5],[17,6,18,6],[17,7,18,7],[17,8,18,8],[17,9,18,9],[17,10,18,10],[14,3,15,3],[23,3,24,3],[23,4,24,4],[23,5,24,5],[23,6,24,6],[23,7,24,7],[23,8,24,8],[23,9,24,9],[23,10,24,10],[20,3,21,3],[20,4,21,4],[20,5,21,5],[20,6,21,6],[20,7,21,7],[20,8,21,8],[29,3,30,3],[29,4,30,4],[29,5,30,5],[29,6,30,6],[29,7,30,7],[29,8,30,8],[29,9,30,9],[29,10,30,10],[26,3,27,3],[26,4,27,4],[26,5,27,5],[26,6,27,6],[26,7,27,7],[26,8,27,8],[35,3,36,3],[35,4,36,4],[35,5,36,5],[35,6,36,6],[35,7,36,7],[35,8,36,8],[35,9,36,9],[35,10,36,10],[32,3,33,3],[32,4,33,4],[32,5,33,5],[32,6,33,6],[32,7,33,7],[32,8,33,8],[41,3,42,3],[41,4,42,4],[41,5,42,5],[41,6,42,6],[41,7,42,7],[41,8,42,8],[41,9,42,9],[41,10,42,10],[38,3,39,3],[38,4,39,4],[38,5,39,5],[38,6,39,6],[38,7,39,7],[38,8,39,8],[47,3,48,3],[47,4,48,4],[47,5,48,5],[47,6,48,6],[47,7,48,7],[47,8,48,8],[47,9,48,9],[47,10,48,10],[44,3,45,3],[44,4,45,4],[44,5,45,5],[44,6,45,6],[44,7,45,7],[44,8,45,8],[53,3,54,3],[53,4,54,4],[53,5,54,5],[53,6,54,6],[53,7,54,7],[53,8,54,8],[53,9,54,9],[53,10,54,10],[50,3,51,3],[50,4,51,4],[50,5,51,5],[50,6,51,6],[50,7,51,7],[50,8,51,8],[4,8,5,8],[11,11,12,11],[14,4,15,4],[14,5,15,5],[14,6,15,6],[14,7,15,7],[14,8,15,8],[14,9,15,9],[50,9,51,9],[50,10,51,10],[44,9,45,9],[44,10,45,10],[38,9,39,9],[38,10,39,10],[32,9,33,9],[32,10,33,10],[26,9,27,9],[26,10,27,10],[20,9,21,9],[20,10,21,10],[14,10,15,10],[11,8,12,8],[11,9,12,9],[11,10,12,10],[41,11,42,11],[44,11,45,11],[47,11,48,11],[50,11,51,11],[53,11,54,11],[4,9,5,9],[14,11,15,11],[17,11,18,11],[20,11,21,11],[23,11,24,11],[26,11,27,11],[29,11,30,11],[32,11,33,11],[35,11,36,11],[38,11,39,11]]}
[null,"Classe "]
[null,"STAGE"]
[]
[null,"Elèves",{"$f":"B5","v":"Rémi"},{"$f":"B6","v":"Timothée"},{"$f":"B7","v":"Virginie"},{"$f":"B8","v":"Quentin"},{"$f":"B9","v":"Mick"},"Temps individuel"]
[null,"Rémi",null,null,null,null,null,3.6,null,"INDICE DE PERF"]
[null,"Timothée",null,null,null,null,null,5]
{"$rows_left_out":104}
{"sheet":"GRAPHIQUES","index":3,"n_rows":103,"n_cols":44,"rows_kept":103,"cut":false,"hidden":false,"merged":[]}
[]
[null,null,null,null,null,null,null,null,null,null,null,"IP","IT","Perf/25m","Perf/relais",null,null,null,"IP","IT","Perf/25m","Perf/relais",null,null,null,"IP","IT","Perf/25m","Perf/relais",null,null,null,"IP","IT","Perf/25m","Perf/relais",null,null,null,"IP","IT","Perf/25m","Perf/relais"]
[null,null,null,null,null,null,null,null,null,{"$f":"Choixeleves!B5","v":"Rémi"},{"$f":"$J$3&\"_\"&P3","v":"Rémi_1"},{"$f":"IFERROR(VLOOKUP(K3,Choixeleves!$M$12:$Z$157,3,FALSE),\"\")","v":4},{"$f":"IFERROR(VLOOKUP(K3,Choixeleves!$M$12:$Z$157,5,FALSE),\"\")","v":1.4000000000000004},{"$f":"IFERROR(VLOOKUP(K3,Choixeleves!$M$12:$Z$157,6,FALSE),\"\")","v":3.6},{"$f":"IFERROR(VLOOKUP(K3,Choixeleves!$M$12:$Z$157,7,FALSE),\"\")","v":12},1,{"$f":"Choixeleves!B6","v":"Timothée"},{"$f":"$Q$3&\"_\"&W3","v":"Timothée_1"},{"$f":"IFERROR(VLOOKUP(R3,Choixeleves!$M$12:$Z$157,3,FALSE),\"\")","v":""},{"$f":"IFERROR(VLOOKUP(R3,Choixeleves!$M$12:$Z$157,5,FALSE),\"\")","v":""},{"$f":"IFERROR(VLOOKUP(R3,Choixeleves!$M$12:$Z$157,6,FALSE),\"\")","v":""},{"$f":"IFERROR(VLOOKUP(R3,Choixeleves!$M$12:$Z$157,7,FALSE),\"\")","v":""},1,{"$f":"Choixeleves!B7","v":"Virginie"},{"$f":"$X$3&\"_\"&AD3","v":"Virginie_1"},{"$f":"IFERROR(VLOOKUP(Y3,Choixeleves!$M$12:$Z$157,3,FALSE),\"\")","v":4},{"$f":"IFERROR(VLOOKUP(Y3,Choixeleves!$M$12:$Z$157,5,FALSE),\"\")","v":1.4000000000000004},{"$f":"IFERROR(VLOOKUP(Y3,Choixeleves!$M$12:$Z$157,6,FALSE),\"\")","v":7},{"$f":"IFERROR(VLOOKUP(Y3,Choixeleves!$M$12:$Z$157,7,FALSE),\"\")","v":12},1,{"$f":"Choixeleves!B8","v":"Quentin"},{"$f":"$AE$3&\"_\"&AK3","v":"Quentin_1"},{"$f":"IFERROR(VLOOKUP(AF3,Choixeleves!$M$12:$Z$157,3,FALSE),\"\")","v":""},{"$f":"IFERROR(VLOOKUP(AF3,Choixeleves!$M$12:$Z$157,5,FALSE),\"\")","v":""},{"$f":"IFERROR(VLOOKUP(AF3,Choixeleves!$M$12:$Z$157,6,FALSE),\"\")","v":""},{"$f":"IFERROR(VLOOKUP(AF3,Choixeleves!$M$12:$Z$157,7,FALSE),\"\")","v":""},1,{"$f":"Choixeleves!B9","v":"Mick"},{"$f":"$AL$3&\"_\"&AR3","v":"Mick_1"},{"$f":"IFERROR(VLOOKUP(AM3,Choixeleves!$M$12:$Z$157,3,FALSE),\"\")","v":""},{"$f":"IFERROR(VLOOKUP(AM3,Choixeleves!$M$12:$Z$157,5,FALSE),\"\")","v":""},{"$f":"IFERROR(VLOOKUP(AM3,Choixeleves!$M$12:$Z$157,6,FALSE),\"\")","v":""},{"$f":"IFERROR(VLOOKUP(AM3,Choixeleves!$M$12:$Z$157,7,FALSE),\"\")","v":""},1]
[null,null,null,null,null,null,null,null,null,null,{"$f":"$J$3&\"_\"&P4","v":"Rémi_2"},{"$f":"IFERROR(VLOOKUP(K4,Choixeleves!$M$12:$Z$157,3,FALSE),\"\")","v":12},{"$f":"IFERROR(VLOOKUP(K4,Choixeleves!$M$12:$Z$157,5,FALSE),\"\")","v":-2.5999999999999996},{"$f":"IFERROR(VLOOKUP(K4,Choixeleves!$M$12:$Z$157,6,FALSE),\"\")","v":3.6},{"$f":"IFERROR(VLOOKUP(K4,Choixeleves!$M$12:$Z$157,7,FALSE),\"\")","v":8},2,null,{"$f":"$Q$3&\"_\"&W4","v":"Timothée_2"},{"$f":"IFERROR(VLOOKUP(R4,Choixeleves!$M$12:$Z$157,3,FALSE),\"\")","v":""},{"$f":"IFERROR(VLOOKUP(R4,Choixeleves!$M$12:$Z$157,5,FALSE),\"\")","v":""},{"$f":"IFERROR(VLOOKUP(R4,Choixeleves!$M$12:$Z$157,6,FALSE),\"\")","v":""},{"$f":"IFERROR(VLOOKUP(R4,Choixeleves!$M$12:$Z$157,7,FALSE),\"\")","v":""},2,null,{"$f":"$X$3&\"_\"&AD4","v":"Virginie_2"},{"$f":"IFERROR(VLOOKUP(Y4,Choixeleves!$M$12:$Z$157,3,FALSE),\"\")","v":12},{"$f":"IFERROR(VLOOKUP(Y4,Choixeleves!$M$12:$Z$157,5,FALSE),\"\")","v":-2.5999999999999996},{"$f":"IFERROR(VLOOKUP(Y4,Choixeleves!$M$12:$Z$157,6,FALSE),\"\")","v":7},{"$f":"IFERROR(VLOOKUP(Y4,Choixeleves!$M$12:$Z$157,7,FALSE),\"\")","v":8},2,null,{"$f":"$AE$3&\"_\"&AK4","v":"Quentin_2"},{"$f":"IFERROR(VLOOKUP(AF4,Choixeleves!$M$12:$Z$157,3,FALSE),\"\")","v":""},{"$f":"IFERROR(VLOOKUP(AF4,Choixeleves!$M$12:$Z$157,5,FALSE),\"\")","v":""},{"$f":"IFERROR(VLOOKUP(AF4,Choixeleves!$M$12:$Z$157,6,FALSE),\"\")","v":""},{"$f":"IFERROR(VLOOKUP(AF4,Choixeleves!$M$12:$Z$157,7,FALSE),\"\")","v":""},2,null,{"$f":"$AL$3&\"_\"&AR4","v":"Mick_2"},{"$f":"IFERROR(VLOOKUP(AM4,Choixeleves!$M$12:$Z$157,3,FALSE),\"\")","v":""},{"$f":"IFERROR(VLOOKUP(AM4,Choixeleves!$M$12:$Z$157,5,FALSE),\"\")","v":""},{"$f":"IFERROR(VLOOKUP(AM4,Choixeleves!$M$12:$Z$157,6,FALSE),\"\")","v":""},{"$f":"IFERROR(VLOOKUP(AM4,Choixeleves!$M$12:$Z$157,7,FALSE),\"\")","v":""},2]
[null,null,null,null,null,null,null,null,null,null,"Rémi_3",{"$f":"IFERROR(VLOOKUP(K5,Choixeleves!$M$12:$Z$157,3,FALSE),\"\")","v":12},{"$f":"IFERROR(VLOOKUP(K5,Choixeleves!$M$12:$Z$157,5,FALSE),\"\")","v":-3.6},{"$f":"IFERROR(VLOOKUP(K5,Choixeleves!$M$12:$Z$157,6,FALSE),\"\")","v":3.6},{"$f":"IFERROR(VLOOKUP(K5,Choixeleves!$M$12:$Z$157,7,FALSE),\"\")","v":0},3,null,"Timothée_3",{"$f":"IFERROR(VLOOKUP(R5,Choixeleves!$M$12:$Z$157,3,FALSE),\"\")","v":""},{"$f":"IFERROR(VLOOKUP(R5,Choixeleves!$M$12:$Z$157,5,FALSE),\"\")","v":""},{"$f":"IFERROR(VLOOKUP(R5,Choixeleves!$M$12:$Z$157,6,FALSE),\"\")","v":""},{"$f":"IFERROR(VLOOKUP(R5,Choixeleves!$M$12:$Z$157,7,FALSE),\"\")","v":""},3,null,"Virginie_3",{"$f":"IFERROR(VLOOKUP(Y5,Choixeleves!$M$12:$Z$157,3,FALSE),\"\")","v":""},{"$f":"IFERROR(VLOOKUP(Y5,Choixeleves!$M$12:$Z$157,5,FALSE),\"\")","v":""},{"$f":"IFERROR(VLOOKUP(Y5,Choixeleves!$M$12:$Z$157,6,FALSE),\"\")","v":""},{"$f":"IFERROR(VLOOKUP(Y5,Choixeleves!$M$12:$Z$157,7,FALSE),\"\")","v":""},3,null,"Quentin_3",{"$f":"IFERROR(VLOOKUP(AF5,Choixeleves!$M$12:$Z$157,3,FALSE),\"\")","v":""},{"$f":"IFERROR(VLOOKUP(AF5,Choixeleves!$M$12:$Z$157,5,FALSE),\"\")","v":""},{"$f":"IFERROR(VLOOKUP(AF5,Choixeleves!$M$12:$Z$157,6,FALSE),\"\")","v":""},{"$f":"IFERROR(VLOOKUP(AF5,Choixeleves!$M$12:$Z$157,7,FALSE),\"\")","v":""},3,null,"Mick_3",{"$f":"IFERROR(VLOOKUP(AM5,Choixeleves!$M$12:$Z$157,3,FALSE),\"\")","v":""},{"$f":"IFERROR(VLOOKUP(AM5,Choixeleves!$M$12:$Z$157,5,FALSE),\"\")","v":""},{"$f":"IFERROR(VLOOKUP(AM5,Choixeleves!$M$12:$Z$157,6,FALSE),\"\")","v":""},{"$f":"IFERROR(VLOOKUP(AM5,Choixeleves!$M$12:$Z$157,7,FALSE),\"\")","v":""},3]
[null,null,null,null,null,null,null,null,null,null,"Rémi_4",{"$f":"IFERROR(VLOOKUP(K6,Choixeleves!$M$12:$Z$157,3,FALSE),\"\")","v":12},{"$f":"IFERROR(VLOOKUP(K6,Choixeleves!$M$12:$Z$157,5,FALSE),\"\")","v":-3.6},{"$f":"IFERROR(VLOOKUP(K6,Choixeleves!$M$12:$Z$157,6,FALSE),\"\")","v":3.6},{"$f":"IFERROR(VLOOKUP(K6,Choixeleves!$M$12:$Z$157,7,FALSE),\"\")","v":0},4,null,"Timothée_4",{"$f":"IFERROR(VLOOKUP(R6,Choixeleves!$M$12:$Z$157,3,FALSE),\"\")","v":""},{"$f":"IFERROR(VLOOKUP(R6,Choixeleves!$M$12:$Z$157,5,FALSE),\"\")","v":""},{"$f":"IFERROR(VLOOKUP(R6,Choixeleves!$M$12:$Z$157,6,FALSE),\"\")","v":""},{"$f":"IFERROR(VLOOKUP(R6,Choixeleves!$M$12:$Z$157,7,FALSE),\"\")","v":""},4,null,"Virginie_4",{"$f":"IFERROR(VLOOKUP(Y6,Choixeleves!$M$12:$Z$157,3,FALSE),\"\")","v":""},{"$f":"IFERROR(VLOOKUP(Y6,Choixeleves!$M$12:$Z$157,5,FALSE),\"\")","v":""},{"$f":"IFERROR(VLOOKUP(Y6,Choixeleves!$M$12:$Z$157,6,FALSE),\"\")","v":""},{"$f":"IFERROR(VLOOKUP(Y6,Choixeleves!$M$12:$Z$157,7,FALSE),\"\")","v":""},4,null,"Quentin_4",{"$f":"IFERROR(VLOOKUP(AF6,Choixeleves!$M$12:$Z$157,3,FALSE),\"\")","v":""},{"$f":"IFERROR(VLOOKUP(AF6,Choixeleves!$M$12:$Z$157,5,FALSE),\"\")","v":""},{"$f":"IFERROR(VLOOKUP(AF6,Choixeleves!$M$12:$Z$157,6,FALSE),\"\")","v":""},{"$f":"IFERROR(VLOOKUP(AF6,Choixeleves!$M$12:$Z$157,7,FALSE),\"\")","v":""},4,null,"Mick_4",{"$f":"IFERROR(VLOOKUP(AM6,Choixeleves!$M$12:$Z$157,3,FALSE),\"\")","v":""},{"$f":"IFERROR(VLOOKUP(AM6,Choixeleves!$M$12:$Z$157,5,FALSE),\"\")","v":""},{"$f":"IFERROR(VLOOKUP(AM6,Choixeleves!$M$12:$Z$157,6,FALSE),\"\")","v":""},{"$f":"IFERROR(VLOOKUP(AM6,Choixeleves!$M$12:$Z$157,7,FALSE),\"\")","v":""},4]
{"$rows_left_out":98}
{"sheet":"TRANSMISSION IDEALE","index":4,"n_rows":2,"n_cols":1,"rows_kept":2,"cut":false,"hidden":false,"merged":[[1,0,3,0]]}
[]
["Lien"]

{"sheet":"Choixeleves (2)","index":5,"n_rows":4,"n_cols":4,"rows_kept":4,"cut":false,"hidden":false,"merged":[]}
[null,"Classe "]
[null,{"$f":"Classeauto!B2","v":"1TU-GA"}]
[]
[null,"Elèves ->","Abraham","Amel"]

{"sheet":"MONBAREME","index":6,"n_rows":36,"n_cols":11,"rows_kept":36,"cut":false,"hidden":false,"merged":[[6,1,6,2],[0,5,2,10],[0,13,2,16],[3,1,3,2],[4,1,4,2],[5,1,5,2],[18,1,18,2],[7,1,7,2],[8,1,8,2],[9,1,9,2],[10,1,10,2],[11,1,11,2],[12,1,12,2],[13,1,13,2],[14,1,14,2],[15,1,15,2],[16,1,16,2],[17,1,17,2],[30,1,30,2],[19,1,19,2],[20,1,20,2],[21,1,21,2],[22,1,22,2],[23,1,23,2],[24,1,24,2],[25,1,25,2],[26,1,26,2],[27,1,27,2],[28,1,28,2],[29,1,29,2],[31,1,31,2],[32,1,32,2],[33,1,33,2],[34,1,34,2],[35,1,35,2]]}
[null,"Classe "]
[null,"1TU-GA",null,null,"N4"]
[]
[null,"Elèves",null,{"$f":"DEBUT!$B$4","v":0},{"$f":"DEBUT!$C$4","v":1},{"$f":"DEBUT!$D$4","v":2},{"$f":"DEBUT!$E$4","v":3},{"$f":"Tableau46[[#Headers],[C1]]","v":"C1"},{"$f":"Tableau46[[#Headers],[C2]]","v":"C2"},{"$f":"Tableau46[[#Headers],[C3]]","v":"C3"},{"$f":"Tableau46[[#Headers],[C4]]","v":"C4"}]
[{"$f":"IF($B$2=APPEL!$B$1,VLOOKUP(B5,APPEL!$C$3:$D$38,2,FALSE),IF($B$2=APPEL!$E$1,VLOOKUP(B5,APPEL!$F$3:$G$38,2,FALSE),IF($B$2=APPEL!$H$1,VLOOKUP(B5,APPEL!$I$3:$J$38,2,FALSE),IF($B$2=APPEL!$K$1,VLOOKUP(B5,APPEL!$L$3:$M$38,2,FALSE),IF($B$2=APPEL!$N$1,VLOOKUP(B5,APPEL!$O$3:$P$38,2,FALSE),IF($B$2=APPEL!$Q$1,VLOOKUP(B5,APPEL!$R$3:$S$38,2,FALSE),IF($B$2=APPEL!$T$1,VLOOKUP(B5,APPEL!$U$3:$V$38,2,FALSE),IF($B$2=APPEL!$W$1,VLOOKUP(B5,APPEL!$X$3:$Y$38,2,FALSE),IF($B$2=APPEL!$Z$1,VLOOKUP(B5,APPEL!$AA$3:$AB$38,2,FALSE))))))))))","v":"g"},{"$f":"IF($B$2=APPEL!$B$1,APPEL!C3,IF($B$2=APPEL!$E$1,APPEL!F3,IF($B$2=APPEL!$H$1,APPEL!I3,IF($B$2=APPEL!$K$1,APPEL!L3,IF($B$2=APPEL!$N$1,APPEL!O3,IF($B$2=APPEL!$Q$1,APPEL!R3,IF($B$2=APPEL!$T$1,APPEL!U3,IF($B$2=APPEL!$W$1,APPEL!X3,IF($B$2=APPEL!$Z$1,APPEL!AA3)))))))))","v":"Abraham"},null,"il a fait ça",{"$f":"IFERROR(VLOOKUP(D5,DEBUT!$B$6:$E$100,2,FALSE),\"\")","v":""},{"$f":"IFERROR(VLOOKUP(D5,DEBUT!$B$6:$E$100,3,FALSE),\"\")","v":""},{"$f":"IFERROR(VLOOKUP(D5,DEBUT!$B$6:$E$100,4,FALSE),\"\")","v":""},"Très satisfaisant",{"$f":"IFERROR(VLOOKUP(H5,DEBUT!$G$5:$J$100,2,FALSE),\"\")","v":0},{"$f":"IFERROR(VLOOKUP(H5,DEBUT!$G$5:$J$100,3,FALSE),\"\")","v":0},{"$f":"IFERROR(VLOOKUP(H5,DEBUT!$G$5:$J$100,4,FALSE),\"\")","v":0}]
[{"$f":"IF($B$2=APPEL!$B$1,VLOOKUP(B6,APPEL!$C$3:$D$38,2,FALSE),IF($B$2=APPEL!$E$1,VLOOKUP(B6,APPEL!$F$3:$G$38,2,FALSE),IF($B$2=APPEL!$H$1,VLOOKUP(B6,APPEL!$I$3:$J$38,2,FALSE),IF($B$2=APPEL!$K$1,VLOOKUP(B6,APPEL!$L$3:$M$38,2,FALSE),IF($B$2=APPEL!$N$1,VLOOKUP(B6,APPEL!$O$3:$P$38,2,FALSE),IF($B$2=APPEL!$Q$1,VLOOKUP(B6,APPEL!$R$3:$S$38,2,FALSE),IF($B$2=APPEL!$T$1,VLOOKUP(B6,APPEL!$U$3:$V$38,2,FALSE),IF($B$2=APPEL!$W$1,VLOOKUP(B6,APPEL!$X$3:$Y$38,2,FALSE),IF($B$2=APPEL!$Z$1,VLOOKUP(B6,APPEL!$AA$3:$AB$38,2,FALSE))))))))))","v":"f"},{"$f":"IF($B$2=APPEL!$B$1,APPEL!C4,IF($B$2=APPEL!$E$1,APPEL!F4,IF($B$2=APPEL!$H$1,APPEL!I4,IF($B$2=APPEL!$K$1,APPEL!L4,IF($B$2=APPEL!$N$1,APPEL!O4,IF($B$2=APPEL!$Q$1,APPEL!R4,IF($B$2=APPEL!$T$1,APPEL!U4,IF($B$2=APPEL!$W$1,APPEL!X4,IF($B$2=APPEL!$Z$1,APPEL!AA4)))))))))","v":"Aimane"},null,"7\"",{"$f":"IFERROR(VLOOKUP(D6,DEBUT!$B$6:$E$100,2,FALSE),\"\")","v":""},{"$f":"IFERROR(VLOOKUP(D6,DEBUT!$B$6:$E$100,3,FALSE),\"\")","v":""},{"$f":"IFERROR(VLOOKUP(D6,DEBUT!$B$6:$E$100,4,FALSE),\"\")","v":""},"Insuffisant",{"$f":"IFERROR(VLOOKUP(H6,DEBUT!$G$5:$J$100,2,FALSE),\"\")","v":0},{"$f":"IFERROR(VLOOKUP(H6,DEBUT!$G$5:$J$100,3,FALSE),\"\")","v":0},{"$f":"IFERROR(VLOOKUP(H6,DEBUT!$G$5:$J$100,4,FALSE),\"\")","v":0}]
{"$rows_left_out":31}
{"sheet":"MACROS","index":7,"n_rows":27,"n_cols":10,"rows_kept":27,"cut":false,"hidden":false,"merged":[[16,7,16,8]]}
[3]
["15:47:48"]
[null,"MACROS UTILISABLES SUR N'IMPORTE QUELLE FEUILLE"]
[]
[]
[]
{"$rows_left_out":22}
{"sheet":"SAELEVE1","index":8,"n_rows":19,"n_cols":11,"rows_kept":19,"cut":false,"hidden":false,"merged":[[15,2,15,10],[16,2,16,10],[17,2,17,10],[18,2,18,10],[14,9,14,10],[14,5,14,8],[13,2,13,4],[14,2,14,4],[13,9,13,10],[13,5,13,8],[7,17,7,18],[8,2,8,6],[8,7,8,10],[9,2,9,6],[9,7,9,10],[12,2,12,10],[4,2,4,6],[4,7,4,10],[5,2,7,6],[5,7,5,10],[6,7,6,10],[7,7,7,10],[2,2,3,2],[2,3,3,4],[2,6,2,9],[2,10,3,10],[3,6,3,9]]}
[null,null,null,"Situation d'apprentissage"]
[]
[null,null,{"$f":"VLOOKUP($D$3,SAMICBIS!$A$3:$T$70,4,FALSE)","v":"BAD"},"Max Tirs en 1'",null,"Obj",{"$f":"VLOOKUP($D$3,SAMICBIS!$A$3:$T$70,5,FALSE)","v":"Améliorer la qualité du tir en course"},null,null,null,{"$f":"VLOOKUP($D$3,SAMICBIS!$A$3:$T$70,2,FALSE)","v":"T1'"}]
[null,null,null,null,null,"But",{"$f":"VLOOKUP($D$3,SAMICBIS!$A$3:$T$70,6,FALSE)","v":"Marquer le plus de paniers possibles en 1 minute"}]
[null,null,"Schéma / Matériel nécessaire",null,null,null,null,"Matériel nécessaire"]
[null,null,null,null,null,null,null,{"$f":"VLOOKUP($D$3,SAMICBIS!$A$3:$T$70,13,FALSE)","v":"2 ballons (1 chacun). 1 panier. 2 plots. 1 chrono. 1 tablette."}]
{"$rows_left_out":14}
{"sheet":"REFERENTIELS","index":9,"n_rows":47,"n_cols":7,"rows_kept":47,"cut":false,"hidden":false,"merged":[[44,2,45,2],[44,3,45,3],[46,8,46,9],[25,2,26,2],[25,3,26,3],[27,2,28,2],[27,3,28,3],[29,8,29,9],[30,2,30,9],[37,2,37,3],[37,4,37,9],[38,2,38,3],[38,4,38,9],[39,4,39,5],[39,6,39,9],[40,2,41,2],[40,3,41,3],[42,2,43,2],[3,2,3,3],[4,2,4,3],[20,2,20,3],[21,2,21,3],[42,3,43,3],[3,4,3,9],[4,4,4,9],[13,2,13,9],[5,4,5,5],[5,6,5,9],[20,4,20,9],[8,3,9,3],[6,3,7,3],[6,2,7,2],[8,2,9,2],[10,2,11,2],[10,3,11,3],[12,8,12,9],[21,4,21,9],[22,4,22,5],[22,6,22,9],[23,2,24,2],[23,3,24,3]]}
[]
[]
[null,null,"APSA N3"]
[null,null,"COMPETENCES ATTENDUES",null,"PRINCIPES D’ELABORATION DE L’EPREUVE"]
[]
[null,null,"POINTS A AFFECTER","ELEMENTS A EVALUER","COMPETENCE DE NIVEAU 3 EN COURS D’ACQUISITION\nDe 0 à 09 pts",null,"COMPETENCE DE NIVEAU 3 ACQUISE\nDe 10 à 20 pts"]
{"$rows_left_out":42}
{"sheet":"APPEL","index":10,"n_rows":38,"n_cols":28,"rows_kept":38,"cut":false,"hidden":false,"merged":[[0,19,0,20],[0,22,0,23],[0,25,0,26],[0,1,0,2],[0,4,0,5],[0,7,0,8],[0,10,0,11],[0,13,0,14],[0,16,0,17]]}
[null,"1TU-GA",null,null,"1TU-GA2",null,null,"STAGE",null,null,"1EVS",null,null,"1GA",null,null,"1TU",null,null,"STAGE",null,null,"classe8",null,null,"classe9"]
[null,"NOMS","PRENOMS","sexe","NOMS","PRENOMS","sexe","NOMS","PRENOMS","sexe","NOMS","PRENOMS","sexe","NOMS","PRENOMS","sexe","NOMS","PRENOMS","sexe","NOMS","PRENOMS","sexe","NOMS","PRENOMS","sexe","NOMS","PRENOMS","sexe"]
[1,null,"Abraham","g",null,"Ali Malek","g",null,"Rémi","g"]
[2,null,"Aimane","f",null,"Aline","f",null,"Timothée","g"]
[3,null,"Amel","f",null,"Alya","f",null,"Virginie","f"]
[4,null,"Amira","f",null,"Amine","g",null,"Quentin","g"]
{"$rows_left_out":33}
{"sheet":"DEBUT","index":11,"n_rows":22,"n_cols":42,"rows_kept":22,"cut":false,"hidden":false,"merged":[[0,1,2,4],[0,11,2,16],[0,6,2,9]]}
[null,"Nombre de critères",null,null,null,null,"MON BAREME 2",null,null,null,null,"MES DONNES DE VALIDATION MODIFIABLES"]
[]
[]
["IT",0,1,2,3,4,"C1","C2","C3","C4",null,"Temps 25m",null,"Main opposée",null,"Orientation relayeur",null,"Moment transmission",null,"Communication D-R",null,"Temps /50m","DV12","DV13","DV14","DV15","DV16","DV17",null,null,null,null,null,null,null,null,"IT","0","1","2","3",4]
[-20,12,12,12,12,12,"Très inusffisant",null,null,null,null,null,null,null,null,null,null,null,null,null,null,null,null,null,null,null,null,null,null,null,null,null,null,null,null,null,-100,12,12,12,12,12]
[-1,12,12,12,12,12,"Insuffisant",null,null,null,null,3.5,null,"Oui",1,"De face",0,"Début",1,"Oui",1,6,null,null,null,null,null,null,null,null,null,null,null,null,null,null,-0.8,12,12,12,12,12]
{"$rows_left_out":17}
{"sheet":"SAMICBIS","index":12,"n_rows":5,"n_cols":20,"rows_kept":5,"cut":false,"hidden":false,"merged":[]}
[null,null,null,null,null,null,null,null,"Taille schéma PC : 1,25x2,26",null,"Taille schéma tablette : 1,85x3,4\"",null,null,null,null,null,null,null,null,"Conseil pour "]
["nom SA","n° SA","OBJ GENERAL","APSA","Obj SA","But","Type SA","Consignes","Schéma","Consignes 2","Schéma 2","Réussir","Matériel ","CR","Intérêt SA","Connaissances","Capacités","Attitudes","Complexification","Simplification"]
["Max Tirs en 1'","T1'","Améliorer la qualité du tir en course. Construire une continuité dribble-tir","BAD","Améliorer la qualité du tir en course","Marquer le plus de paniers possibles en 1 minute","Défi","Mini défi 1 contre 1. Les joueurs se placent à leur plot. AU signal d'un camarade ils dribblent pour aller shooter au panier. Que le tir soit réussi ou non, les 2 joueurs retournent faire le tour du plot en dribblant pour tenter un nouveau tir. Ils tournent pendant 1 minute. chacun compte son score en même temps que les observateurs et le relève sur la tablette à la fin. 2 nouveaux élèves passent quand la minute est finie.",null,"Consignes 2",null,"JE dribble rapidement pour pouvoir effectuer plusieurs shoots. Je m'applique sur chaque tir en m'aidant de l'angle du carré de la planche. ","2 ballons (1 chacun). 1 panier. 2 plots. 1 chrono. 1 tablette.","Je réussi au moins 3 tirs à l'arrêt et 5 tirs en course.","Intérêt SA","Cns","Cap","Att","Cplx","Simpli"]
["1000 plots",1000]
["PASSE et VA","PVA"]