{"text_format":"1","workbook":"xlsx","n_sheets":13,"sheets":["ACCUEIL","Classeauto","Choixeleves","GRAPHIQUES","TRANSMISSION IDEALE","Choixeleves (2)","MONBAREME","MACROS","SAELEVE1","REFERENTIELS","APPEL","DEBUT","SAMICBIS"],"not_rendered":{"charts":1,"images":60,"macros":1,"external_links":0,"defined_names":20,"comments":1,"pivot_tables":0},"unopened":[],"bounds":{"document_bytes":16777216,"sheet_cells":100000,"rows_first":2000,"rows_last":500,"rows_between":2000,"halvings":0,"cell_chars":16384,"cell_head_chars":4096},"cells_cut":0,"cells_raw":0,"read":"whole","date_system":"1900"}

{"sheet":"ACCUEIL","index":0,"n_rows":25,"n_cols":6,"rows_kept":25,"cut":false,"hidden":false,"merged":[]}
[]
[]
[]
[null,null,null,null,null,"1- Avant de commencer : dupliquez ce document et renommez le selon vos envies"]
[null,"ACCUEIL","CLASSES","DEBUT",null,"2- Supprimez les onglets et boutons inutiles (les colonnes et lignes aussi)"]
[null,null,null,null,null,"3- Créez votre appli"]
[]
[]
[]
[]
[null,"APP1","APP2","APP3"]
[]
[]
[]
[]
[]
[null,"SA"]
[]
[]
[]
[]
[]
[]
[]
[null,"Niveau 3","Niveau 4","Evaluation Cycle"]

{"sheet":"Classeauto","index":1,"n_rows":36,"n_cols":5,"rows_kept":36,"cut":false,"hidden":false,"merged":[[33,1,33,2],[34,1,34,2],[35,1,35,2],[3,1,3,2],[28,1,28,2],[29,1,29,2],[30,1,30,2],[31,1,31,2],[32,1,32,2],[23,1,23,2],[24,1,24,2],[25,1,25,2],[26,1,26,2],[27,1,27,2],[18,1,18,2],[19,1,19,2],[20,1,20,2],[21,1,21,2],[22,1,22,2],[13,1,13,2],[14,1,14,2],[15,1,15,2],[16,1,16,2],[17,1,17,2],[8,1,8,2],[9,1,9,2],[10,1,10,2],[11,1,11,2],[12,1,12,2],[0,17,2,20],[4,1,4,2],[5,1,5,2],[6,1,6,2],[7,1,7,2],[0,5,2,14]]}
[null,"Classe "]
[null,"1TU-GA",null,null,"N4"]
[]
[null,"Elèves"]
[{"$f":"IF($B$2=APPEL!$B$1,VLOOKUP(B5,APPEL!$C$3:$D$38,2,FALSE),IF($B$2=APPEL!$E$1,VLOOKUP(B5,APPEL!$F$3:$G$38,2,FALSE),IF($B$2=APPEL!$H$1,VLOOKUP(B5,APPEL!$I$3:$J$38,2,FALSE),IF($B$2=APPEL!$K$1,VLOOKUP(B5,APPEL!$L$3:$M$38,2,FALSE),IF($B$2=APPEL!$N$1,VLOOKUP(B5,APPEL!$O$3:$P$38,2,FALSE),IF($B$2=APPEL!$Q$1,VLOOKUP(B5,APPEL!$R$3:$S$38,2,FALSE),IF($B$2=APPEL!$T$1,VLOOKUP(B5,APPEL!$U$3:$V$38,2,FALSE),IF($B$2=APPEL!$W$1,VLOOKUP(B5,APPEL!$X$3:$Y$38,2,FALSE),IF($B$2=APPEL!$Z$1,VLOOKUP(B5,APPEL!$AA$3:$AB$38,2,FALSE))))))))))","v":"g"},{"$f":"IF($B$2=APPEL!$B$1,APPEL!C3,IF($B$2=APPEL!$E$1,APPEL!F3,IF($B$2=APPEL!$H$1,APPEL!I3,IF($B$2=APPEL!$K$1,APPEL!L3,IF($B$2=APPEL!$N$1,APPEL!O3,IF($B$2=APPEL!$Q$1,APPEL!R3,IF($B$2=APPEL!$T$1,APPEL!U3,IF($B$2=APPEL!$W$1,APPEL!X3,IF($B$2=APPEL!$Z$1,APPEL!AA3)))))))))","v":"Abraham"}]
[{"$f":"IF($B$2=APPEL!$B$1,VLOOKUP(B6,APPEL!$C$3:$D$38,2,FALSE),IF($B$2=APPEL!$E$1,VLOOKUP(B6,APPEL!$F$3:$G$38,2,FALSE),IF($B$2=APPEL!$H$1,VLOOKUP(B6,APPEL!$I$3:$J$38,2,FALSE),IF($B$2=APPEL!$K$1,VLOOKUP(B6,APPEL!$L$3:$M$38,2,FALSE),IF($B$2=APPEL!$N$1,VLOOKUP(B6,APPEL!$O$3:$P$38,2,FALSE),IF($B$2=APPEL!$Q$1,VLOOKUP(B6,APPEL!$R$3:$S$38,2,FALSE),IF($B$2=APPEL!$T$1,VLOOKUP(B6,APPEL!$U$3:$V$38,2,FALSE),IF($B$2=APPEL!$W$1,VLOOKUP(B6,APPEL!$X$3:$Y$38,2,FALSE),IF($B$2=APPEL!$Z$1,VLOOKUP(B6,APPEL!$AA$3:$AB$38,2,FALSE))))))))))","v":"f"},{"$f":"IF($B$2=APPEL!$B$1,APPEL!C4,IF($B$2=APPEL!$E$1,APPEL!F4,IF($B$2=APPEL!$H$1,APPEL!I4,IF($B$2=APPEL!$K$1,APPEL!L4,IF($B$2=APPEL!$N$1,APPEL!O4,IF($B$2=APPEL!$Q$1,APPEL!R4,IF($B$2=APPEL!$T$1,APPEL!U4,IF($B$2=APPEL!$W$1,APPEL!X4,IF($B$2=APPEL!$Z$1,APPEL!AA4)))))))))","v":"Aimane"}]
[{"$f":"IF($B$2=APPEL!$B$1,VLOOKUP(B7,APPEL!$C$3:$D$38,2,FALSE),IF($B$2=APPEL!$E$1,VLOOKUP(B7,APPEL!$F$3:$G$38,2,FALSE),IF($B$2=APPEL!$H$1,VLOOKUP(B7,APPEL!$I$3:$J$38,2,FALSE),IF($B$2=APPEL!$K$1,VLOOKUP(B7,APPEL!$L$3:$M$38,2,FALSE),IF($B$2=APPEL!$N$1,VLOOKUP(B7,APPEL!$O$3:$P$38,2,FALSE),IF($B$2=APPEL!$Q$1,VLOOKUP(B7,APPEL!$R$3:$S$38,2,FALSE),IF($B$2=APPEL!$T$1,VLOOKUP(B7,APPEL!$U$3:$V$38,2,FALSE),IF($B$2=APPEL!$W$1,VLOOKUP(B7,APPEL!$X$3:$Y$38,2,FALSE),IF($B$2=APPEL!$Z$1,VLOOKUP(B7,APPEL!$AA$3:$AB$38,2,FALSE))))))))))","v":"f"},{"$f":"IF($B$2=APPEL!$B$1,APPEL!C5,IF($B$2=APPEL!$E$1,APPEL!F5,IF($B$2=APPEL!$H$1,APPEL!I5,IF($B$2=APPEL!$K$1,APPEL!L5,IF($B$2=APPEL!$N$1,APPEL!O5,IF($B$2=APPEL!$Q$1,APPEL!R5,IF($B$2=APPEL!$T$1,APPEL!U5,IF($B$2=APPEL!$W$1,APPEL!X5,IF($B$2=APPEL!$Z$1,APPEL!AA5)))))))))","v":"Amel"}]
[{"$f":"IF($B$2=APPEL!$B$1,VLOOKUP(B8,APPEL!$C$3:$D$38,2,FALSE),IF($B$2=APPEL!$E$1,VLOOKUP(B8,APPEL!$F$3:$G$38,2,FALSE),IF($B$2=APPEL!$H$1,VLOOKUP(B8,APPEL!$I$3:$J$38,2,FALSE),IF($B$2=APPEL!$K$1,VLOOKUP(B8,APPEL!$L$3:$M$38,2,FALSE),IF($B$2=APPEL!$N$1,VLOOKUP(B8,APPEL!$O$3:$P$38,2,FALSE),IF($B$2=APPEL!$Q$1,VLOOKUP(B8,APPEL!$R$3:$S$38,2,FALSE),IF($B$2=APPEL!$T$1,VLOOKUP(B8,APPEL!$U$3:$V$38,2,FALSE),IF($B$2=APPEL!$W$1,VLOOKUP(B8,APPEL!$X$3:$Y$38,2,FALSE),IF($B$2=APPEL!$Z$1,VLOOKUP(B8,APPEL!$AA$3:$AB$38,2,FALSE))))))))))","v":"f"},{"$f":"IF($B$2=APPEL!$B$1,APPEL!C6,IF($B$2=APPEL!$E$1,APPEL!F6,IF($B$2=APPEL!$H$1,APPEL!I6,IF($B$2=APPEL!$K$1,APPEL!L6,IF($B$2=APPEL!$N$1,APPEL!O6,IF($B$2=APPEL!$Q$1,APPEL!R6,IF($B$2=APPEL!$T$1,APPEL!U6,IF($B$2=APPEL!$W$1,APPEL!X6,IF($B$2=APPEL!$Z$1,APPEL!AA6)))))))))","v":"Amira"}]
[{"$f":"IF($B$2=APPEL!$B$1,VLOOKUP(B9,APPEL!$C$3:$D$38,2,FALSE),IF($B$2=APPEL!$E$1,VLOOKUP(B9,APPEL!$F$3:$G$38,2,FALSE),IF($B$2=APPEL!$H$1,VLOOKUP(B9,APPEL!$I$3:$J$38,2,FALSE),IF($B$2=APPEL!$K$1,VLOOKUP(B9,APPEL!$L$3:$M$38,2,FALSE),IF($B$2=APPEL!$N$1,VLOOKUP(B9,APPEL!$O$3:$P$38,2,FALSE),IF($B$2=APPEL!$Q$1,VLOOKUP(B9,APPEL!$R$3:$S$38,2,FALSE),IF($B$2=APPEL!$T$1,VLOOKUP(B9,APPEL!$U$3:$V$38,2,FALSE),IF($B$2=APPEL!$W$1,VLOOKUP(B9,APPEL!$X$3:$Y$38,2,FALSE),IF($B$2=APPEL!$Z$1,VLOOKUP(B9,APPEL!$AA$3:$AB$38,2,FALSE))))))))))","v":"g"},{"$f":"IF($B$2=APPEL!$B$1,APPEL!C7,IF($B$2=APPEL!$E$1,APPEL!F7,IF($B$2=APPEL!$H$1,APPEL!I7,IF($B$2=APPEL!$K$1,APPEL!L7,IF($B$2=APPEL!$N$1,APPEL!O7,IF($B$2=APPEL!$Q$1,APPEL!R7,IF($B$2=APPEL!$T$1,APPEL!U7,IF($B$2=APPEL!$W$1,APPEL!X7,IF($B$2=APPEL!$Z$1,APPEL!AA7)))))))))","v":"Anis"}]
[{"$f":"IF($B$2=APPEL!$B$1,VLOOKUP(B10,APPEL!$C$3:$D$38,2,FALSE),IF($B$2=APPEL!$E$1,VLOOKUP(B10,APPEL!$F$3:$G$38,2,FALSE),IF($B$2=APPEL!$H$1,VLOOKUP(B10,APPEL!$I$3:$J$38,2,FALSE),IF($B$2=APPEL!$K$1,VLOOKUP(B10,APPEL!$L$3:$M$38,2,FALSE),IF($B$2=APPEL!$N$1,VLOOKUP(B10,APPEL!$O$3:$P$38,2,FALSE),IF($B$2=APPEL!$Q$1,VLOOKUP(B10,APPEL!$R$3:$S$38,2,FALSE),IF($B$2=APPEL!$T$1,VLOOKUP(B10,APPEL!$U$3:$V$38,2,FALSE),IF($B$2=APPEL!$W$1,VLOOKUP(B10,APPEL!$X$3:$Y$38,2,FALSE),IF($B$2=APPEL!$Z$1,VLOOKUP(B10,APPEL!$AA$3:$AB$38,2,FALSE))))))))))","v":"f"},{"$f":"IF($B$2=APPEL!$B$1,APPEL!C8,IF($B$2=APPEL!$E$1,APPEL!F8,IF($B$2=APPEL!$H$1,APPEL!I8,IF($B$2=APPEL!$K$1,APPEL!L8,IF($B$2=APPEL!$N$1,APPEL!O8,IF($B$2=APPEL!$Q$1,APPEL!R8,IF($B$2=APPEL!$T$1,APPEL!U8,IF($B$2=APPEL!$W$1,APPEL!X8,IF($B$2=APPEL!$Z$1,APPEL!AA8)))))))))","v":"Beyza"}]
[{"$f":"IF($B$2=APPEL!$B$1,VLOOKUP(B11,APPEL!$C$3:$D$38,2,FALSE),IF($B$2=APPEL!$E$1,VLOOKUP(B11,APPEL!$F$3:$G$38,2,FALSE),IF($B$2=APPEL!$H$1,VLOOKUP(B11,APPEL!$I$3:$J$38,2,FALSE),IF($B$2=APPEL!$K$1,VLOOKUP(B11,APPEL!$L$3:$M$38,2,FALSE),IF($B$2=APPEL!$N$1,VLOOKUP(B11,APPEL!$O$3:$P$38,2,FALSE),IF($B$2=APPEL!$Q$1,VLOOKUP(B11,APPEL!$R$3:$S$38,2,FALSE),IF($B$2=APPEL!$T$1,VLOOKUP(B11,APPEL!$U$3:$V$38,2,FALSE),IF($B$2=APPEL!$W$1,VLOOKUP(B11,APPEL!$X$3:$Y$38,2,FALSE),IF($B$2=APPEL!$Z$1,VLOOKUP(B11,APPEL!$AA$3:$AB$38,2,FALSE))))))))))","v":"g"},{"$f":"IF($B$2=APPEL!$B$1,APPEL!C9,IF($B$2=APPEL!$E$1,APPEL!F9,IF($B$2=APPEL!$H$1,APPEL!I9,IF($B$2=APPEL!$K$1,APPEL!L9,IF($B$2=APPEL!$N$1,APPEL!O9,IF($B$2=APPEL!$Q$1,APPEL!R9,IF($B$2=APPEL!$T$1,APPEL!U9,IF($B$2=APPEL!$W$1,APPEL!X9,IF($B$2=APPEL!$Z$1,APPEL!AA9)))))))))","v":"Clarky"}]
[{"$f":"IF($B$2=APPEL!$B$1,VLOOKUP(B12,APPEL!$C$3:$D$38,2,FALSE),IF($B$2=APPEL!$E$1,VLOOKUP(B12,APPEL!$F$3:$G$38,2,FALSE),IF($B$2=APPEL!$H$1,VLOOKUP(B12,APPEL!$I$3:$J$38,2,FALSE),IF($B$2=APPEL!$K$1,VLOOKUP(B12,APPEL!$L$3:$M$38,2,FALSE),IF($B$2=APPEL!$N$1,VLOOKUP(B12,APPEL!$O$3:$P$38,2,FALSE),IF($B$2=APPEL!$Q$1,VLOOKUP(B12,APPEL!$R$3:$S$38,2,FALSE),IF($B$2=APPEL!$T$1,VLOOKUP(B12,APPEL!$U$3:$V$38,2,FALSE),IF($B$2=APPEL!$W$1,VLOOKUP(B12,APPEL!$X$3:$Y$38,2,FALSE),IF($B$2=APPEL!$Z$1,VLOOKUP(B12,APPEL!$AA$3:$AB$38,2,FALSE))))))))))","v":"g"},{"$f":"IF($B$2=APPEL!$B$1,APPEL!C10,IF($B$2=APPEL!$E$1,APPEL!F10,IF($B$2=APPEL!$H$1,APPEL!I10,IF($B$2=APPEL!$K$1,APPEL!L10,IF($B$2=APPEL!$N$1,APPEL!O10,IF($B$2=APPEL!$Q$1,APPEL!R10,IF($B$2=APPEL!$T$1,APPEL!U10,IF($B$2=APPEL!$W$1,APPEL!X10,IF($B$2=APPEL!$Z$1,APPEL!AA10)))))))))","v":"Djamel"}]
[{"$f":"IF($B$2=APPEL!$B$1,VLOOKUP(B13,APPEL!$C$3:$D$38,2,FALSE),IF($B$2=APPEL!$E$1,VLOOKUP(B13,APPEL!$F$3:$G$38,2,FALSE),IF($B$2=APPEL!$H$1,VLOOKUP(B13,APPEL!$I$3:$J$38,2,FALSE),IF($B$2=APPEL!$K$1,VLOOKUP(B13,APPEL!$L$3:$M$38,2,FALSE),IF($B$2=APPEL!$N$1,VLOOKUP(B13,APPEL!$O$3:$P$38,2,FALSE),IF($B$2=APPEL!$Q$1,VLOOKUP(B13,APPEL!$R$3:$S$38,2,FALSE),IF($B$2=APPEL!$T$1,VLOOKUP(B13,APPEL!$U$3:$V$38,2,FALSE),IF($B$2=APPEL!$W$1,VLOOKUP(B13,APPEL!$X$3:$Y$38,2,FALSE),IF($B$2=APPEL!$Z$1,VLOOKUP(B13,APPEL!$AA$3:$AB$38,2,FALSE))))))))))","v":"f"},{"$f":"IF($B$2=APPEL!$B$1,APPEL!C11,IF($B$2=APPEL!$E$1,APPEL!F11,IF($B$2=APPEL!$H$1,APPEL!I11,IF($B$2=APPEL!$K$1,APPEL!L11,IF($B$2=APPEL!$N$1,APPEL!O11,IF($B$2=APPEL!$Q$1,APPEL!R11,IF($B$2=APPEL!$T$1,APPEL!U11,IF($B$2=APPEL!$W$1,APPEL!X11,IF($B$2=APPEL!$Z$1,APPEL!AA11)))))))))","v":"Dounia"}]
[{"$f":"IF($B$2=APPEL!$B$1,VLOOKUP(B14,APPEL!$C$3:$D$38,2,FALSE),IF($B$2=APPEL!$E$1,VLOOKUP(B14,APPEL!$F$3:$G$38,2,FALSE),IF($B$2=APPEL!$H$1,VLOOKUP(B14,APPEL!$I$3:$J$38,2,FALSE),IF($B$2=APPEL!$K$1,VLOOKUP(B14,APPEL!$L$3:$M$38,2,FALSE),IF($B$2=APPEL!$N$1,VLOOKUP(B14,APPEL!$O$3:$P$38,2,FALSE),IF($B$2=APPEL!$Q$1,VLOOKUP(B14,APPEL!$R$3:$S$38,2,FALSE),IF($B$2=APPEL!$T$1,VLOOKUP(B14,APPEL!$U$3:$V$38,2,FALSE),IF($B$2=APPEL!$W$1,VLOOKUP(B14,APPEL!$X$3:$Y$38,2,FALSE),IF($B$2=APPEL!$Z$1,VLOOKUP(B14,APPEL!$AA$3:$AB$38,2,FALSE))))))))))","v":"g"},{"$f":"IF($B$2=APPEL!$B$1,APPEL!C12,IF($B$2=APPEL!$E$1,APPEL!F12,IF($B$2=APPEL!$H$1,APPEL!I12,IF($B$2=APPEL!$K$1,APPEL!L12,IF($B$2=APPEL!$N$1,APPEL!O12,IF($B$2=APPEL!$Q$1,APPEL!R12,IF($B$2=APPEL!$T$1,APPEL!U12,IF($B$2=APPEL!$W$1,APPEL!X12,IF($B$2=APPEL!$Z$1,APPEL!AA12)))))))))","v":"Eyat"}]
[{"$f":"IF($B$2=APPEL!$B$1,VLOOKUP(B15,APPEL!$C$3:$D$38,2,FALSE),IF($B$2=APPEL!$E$1,VLOOKUP(B15,APPEL!$F$3:$G$38,2,FALSE),IF($B$2=APPEL!$H$1,VLOOKUP(B15,APPEL!$I$3:$J$38,2,FALSE),IF($B$2=APPEL!$K$1,VLOOKUP(B15,APPEL!$L$3:$M$38,2,FALSE),IF($B$2=APPEL!$N$1,VLOOKUP(B15,APPEL!$O$3:$P$38,2,FALSE),IF($B$2=APPEL!$Q$1,VLOOKUP(B15,APPEL!$R$3:$S$38,2,FALSE),IF($B$2=APPEL!$T$1,VLOOKUP(B15,APPEL!$U$3:$V$38,2,FALSE),IF($B$2=APPEL!$W$1,VLOOKUP(B15,APPEL!$X$3:$Y$38,2,FALSE),IF($B$2=APPEL!$Z$1,VLOOKUP(B15,APPEL!$AA$3:$AB$38,2,FALSE))))))))))","v":"f"},{"$f":"IF($B$2=APPEL!$B$1,APPEL!C13,IF($B$2=APPEL!$E$1,APPEL!F13,IF($B$2=APPEL!$H$1,APPEL!I13,IF($B$2=APPEL!$K$1,APPEL!L13,IF($B$2=APPEL!$N$1,APPEL!O13,IF($B$2=APPEL!$Q$1,APPEL!R13,IF($B$2=APPEL!$T$1,APPEL!U13,IF($B$2=APPEL!$W$1,APPEL!X13,IF($B$2=APPEL!$Z$1,APPEL!AA13)))))))))","v":"Fatima-Zohra"}]
[{"$f":"IF($B$2=APPEL!$B$1,VLOOKUP(B16,APPEL!$C$3:$D$38,2,FALSE),IF($B$2=APPEL!$E$1,VLOOKUP(B16,APPEL!$F$3:$G$38,2,FALSE),IF($B$2=APPEL!$H$1,VLOOKUP(B16,APPEL!$I$3:$J$38,2,FALSE),IF($B$2=APPEL!$K$1,VLOOKUP(B16,APPEL!$L$3:$M$38,2,FALSE),IF($B$2=APPEL!$N$1,VLOOKUP(B16,APPEL!$O$3:$P$38,2,FALSE),IF($B$2=APPEL!$Q$1,VLOOKUP(B16,APPEL!$R$3:$S$38,2,FALSE),IF($B$2=APPEL!$T$1,VLOOKUP(B16,APPEL!$U$3:$V$38,2,FALSE),IF($B$2=APPEL!$W$1,VLOOKUP(B16,APPEL!$X$3:$Y$38,2,FALSE),IF($B$2=APPEL!$Z$1,VLOOKUP(B16,APPEL!$AA$3:$AB$38,2,FALSE))))))))))","v":"f"},{"$f":"IF($B$2=APPEL!$B$1,APPEL!C14,IF($B$2=APPEL!$E$1,APPEL!F14,IF($B$2=APPEL!$H$1,APPEL!I14,IF($B$2=APPEL!$K$1,APPEL!L14,IF($B$2=APPEL!$N$1,APPEL!O14,IF($B$2=APPEL!$Q$1,APPEL!R14,IF($B$2=APPEL!$T$1,APPEL!U14,IF($B$2=APPEL!$W$1,APPEL!X14,IF($B$2=APPEL!$Z$1,APPEL!AA14)))))))))","v":"Hana"}]
[{"$f":"IF($B$2=APPEL!$B$1,VLOOKUP(B17,APPEL!$C$3:$D$38,2,FALSE),IF($B$2=APPEL!$E$1,VLOOKUP(B17,APPEL!$F$3:$G$38,2,FALSE),IF($B$2=APPEL!$H$1,VLOOKUP(B17,APPEL!$I$3:$J$38,2,FALSE),IF($B$2=APPEL!$K$1,VLOOKUP(B17,APPEL!$L$3:$M$38,2,FALSE),IF($B$2=APPEL!$N$1,VLOOKUP(B17,APPEL!$O$3:$P$38,2,FALSE),IF($B$2=APPEL!$Q$1,VLOOKUP(B17,APPEL!$R$3:$S$38,2,FALSE),IF($B$2=APPEL!$T$1,VLOOKUP(B17,APPEL!$U$3:$V$38,2,FALSE),IF($B$2=APPEL!$W$1,VLOOKUP(B17,APPEL!$X$3:$Y$38,2,FALSE),IF($B$2=APPEL!$Z$1,VLOOKUP(B17,APPEL!$AA$3:$AB$38,2,FALSE))))))))))","v":"f"},{"$f":"IF($B$2=APPEL!$B$1,APPEL!C15,IF($B$2=APPEL!$E$1,APPEL!F15,IF($B$2=APPEL!$H$1,APPEL!I15,IF($B$2=APPEL!$K$1,APPEL!L15,IF($B$2=APPEL!$N$1,APPEL!O15,IF($B$2=APPEL!$Q$1,APPEL!R15,IF($B$2=APPEL!$T$1,APPEL!U15,IF($B$2=APPEL!$W$1,APPEL!X15,IF($B$2=APPEL!$Z$1,APPEL!AA15)))))))))","v":"Ikram"}]
[{"$f":"IF($B$2=APPEL!$B$1,VLOOKUP(B18,APPEL!$C$3:$D$38,2,FALSE),IF($B$2=APPEL!$E$1,VLOOKUP(B18,APPEL!$F$3:$G$38,2,FALSE),IF($B$2=APPEL!$H$1,VLOOKUP(B18,APPEL!$I$3:$J$38,2,FALSE),IF($B$2=APPEL!$K$1,VLOOKUP(B18,APPEL!$L$3:$M$38,2,FALSE),IF($B$2=APPEL!$N$1,VLOOKUP(B18,APPEL!$O$3:$P$38,2,FALSE),IF($B$2=APPEL!$Q$1,VLOOKUP(B18,APPEL!$R$3:$S$38,2,FALSE),IF($B$2=APPEL!$T$1,VLOOKUP(B18,APPEL!$U$3:$V$38,2,FALSE),IF($B$2=APPEL!$W$1,VLOOKUP(B18,APPEL!$X$3:$Y$38,2,FALSE),IF($B$2=APPEL!$Z$1,VLOOKUP(B18,APPEL!$AA$3:$AB$38,2,FALSE))))))))))","v":"g"},{"$f":"IF($B$2=APPEL!$B$1,APPEL!C16,IF($B$2=APPEL!$E$1,APPEL!F16,IF($B$2=APPEL!$H$1,APPEL!I16,IF($B$2=APPEL!$K$1,APPEL!L16,IF($B$2=APPEL!$N$1,APPEL!O16,IF($B$2=APPEL!$Q$1,APPEL!R16,IF($B$2=APPEL!$T$1,APPEL!U16,IF($B$2=APPEL!$W$1,APPEL!X16,IF($B$2=APPEL!$Z$1,APPEL!AA16)))))))))","v":"Jairzhino"}]
[{"$f":"IF($B$2=APPEL!$B$1,VLOOKUP(B19,APPEL!$C$3:$D$38,2,FALSE),IF($B$2=APPEL!$E$1,VLOOKUP(B19,APPEL!$F$3:$G$38,2,FALSE),IF($B$2=APPEL!$H$1,VLOOKUP(B19,APPEL!$I$3:$J$38,2,FALSE),IF($B$2=APPEL!$K$1,VLOOKUP(B19,APPEL!$L$3:$M$38,2,FALSE),IF($B$2=APPEL!$N$1,VLOOKUP(B19,APPEL!$O$3:$P$38,2,FALSE),IF($B$2=APPEL!$Q$1,VLOOKUP(B19,APPEL!$R$3:$S$38,2,FALSE),IF($B$2=APPEL!$T$1,VLOOKUP(B19,APPEL!$U$3:$V$38,2,FALSE),IF($B$2=APPEL!$W$1,VLOOKUP(B19,APPEL!$X$3:$Y$38,2,FALSE),IF($B$2=APPEL!$Z$1,VLOOKUP(B19,APPEL!$AA$3:$AB$38,2,FALSE))))))))))","v":"f"},{"$f":"IF($B$2=APPEL!$B$1,APPEL!C17,IF($B$2=APPEL!$E$1,APPEL!F17,IF($B$2=APPEL!$H$1,APPEL!I17,IF($B$2=APPEL!$K$1,APPEL!L17,IF($B$2=APPEL!$N$1,APPEL!O17,IF($B$2=APPEL!$Q$1,APPEL!R17,IF($B$2=APPEL!$T$1,APPEL!U17,IF($B$2=APPEL!$W$1,APPEL!X17,IF($B$2=APPEL!$Z$1,APPEL!AA17)))))))))","v":"Mergim"}]
[{"$f":"IF($B$2=APPEL!$B$1,VLOOKUP(B20,APPEL!$C$3:$D$38,2,FALSE),IF($B$2=APPEL!$E$1,VLOOKUP(B20,APPEL!$F$3:$G$38,2,FALSE),IF($B$2=APPEL!$H$1,VLOOKUP(B20,APPEL!$I$3:$J$38,2,FALSE),IF($B$2=APPEL!$K$1,VLOOKUP(B20,APPEL!$L$3:$M$38,2,FALSE),IF($B$2=APPEL!$N$1,VLOOKUP(B20,APPEL!$O$3:$P$38,2,FALSE),IF($B$2=APPEL!$Q$1,VLOOKUP(B20,APPEL!$R$3:$S$38,2,FALSE),IF($B$2=APPEL!$T$1,VLOOKUP(B20,APPEL!$U$3:$V$38,2,FALSE),IF($B$2=APPEL!$W$1,VLOOKUP(B20,APPEL!$X$3:$Y$38,2,FALSE),IF($B$2=APPEL!$Z$1,VLOOKUP(B20,APPEL!$AA$3:$AB$38,2,FALSE))))))))))","v":"f"},{"$f":"IF($B$2=APPEL!$B$1,APPEL!C18,IF($B$2=APPEL!$E$1,APPEL!F18,IF($B$2=APPEL!$H$1,APPEL!I18,IF($B$2=APPEL!$K$1,APPEL!L18,IF($B$2=APPEL!$N$1,APPEL!O18,IF($B$2=APPEL!$Q$1,APPEL!R18,IF($B$2=APPEL!$T$1,APPEL!U18,IF($B$2=APPEL!$W$1,APPEL!X18,IF($B$2=APPEL!$Z$1,APPEL!AA18)))))))))","v":"Myriam"}]
[{"$f":"IF($B$2=APPEL!$B$1,VLOOKUP(B21,APPEL!$C$3:$D$38,2,FALSE),IF($B$2=APPEL!$E$1,VLOOKUP(B21,APPEL!$F$3:$G$38,2,FALSE),IF($B$2=APPEL!$H$1,VLOOKUP(B21,APPEL!$I$3:$J$38,2,FALSE),IF($B$2=APPEL!$K$1,VLOOKUP(B21,APPEL!$L$3:$M$38,2,FALSE),IF($B$2=APPEL!$N$1,VLOOKUP(B21,APPEL!$O$3:$P$38,2,FALSE),IF($B$2=APPEL!$Q$1,VLOOKUP(B21,APPEL!$R$3:$S$38,2,FALSE),IF($B$2=APPEL!$T$1,VLOOKUP(B21,APPEL!$U$3:$V$38,2,FALSE),IF($B$2=APPEL!$W$1,VLOOKUP(B21,APPEL!$X$3:$Y$38,2,FALSE),IF($B$2=APPEL!$Z$1,VLOOKUP(B21,APPEL!$AA$3:$AB$38,2,FALSE))))))))))","v":"f"},{"$f":"IF($B$2=APPEL!$B$1,APPEL!C19,IF($B$2=APPEL!$E$1,APPEL!F19,IF($B$2=APPEL!$H$1,APPEL!I19,IF($B$2=APPEL!$K$1,APPEL!L19,IF($B$2=APPEL!$N$1,APPEL!O19,IF($B$2=APPEL!$Q$1,APPEL!R19,IF($B$2=APPEL!$T$1,APPEL!U19,IF($B$2=APPEL!$W$1,APPEL!X19,IF($B$2=APPEL!$Z$1,APPEL!AA19)))))))))","v":"Serone"}]
[{"$f":"IF($B$2=APPEL!$B$1,VLOOKUP(B22,APPEL!$C$3:$D$38,2,FALSE),IF($B$2=APPEL!$E$1,VLOOKUP(B22,APPEL!$F$3:$G$38,2,FALSE),IF($B$2=APPEL!$H$1,VLOOKUP(B22,APPEL!$I$3:$J$38,2,FALSE),IF($B$2=APPEL!$K$1,VLOOKUP(B22,APPEL!$L$3:$M$38,2,FALSE),IF($B$2=APPEL!$N$1,VLOOKUP(B22,APPEL!$O$3:$P$38,2,FALSE),IF($B$2=APPEL!$Q$1,VLOOKUP(B22,APPEL!$R$3:$S$38,2,FALSE),IF($B$2=APPEL!$T$1,VLOOKUP(B22,APPEL!$U$3:$V$38,2,FALSE),IF($B$2=APPEL!$W$1,VLOOKUP(B22,APPEL!$X$3:$Y$38,2,FALSE),IF($B$2=APPEL!$Z$1,VLOOKUP(B22,APPEL!$AA$3:$AB$38,2,FALSE))))))))))","v":"f"},{"$f":"IF($B$2=APPEL!$B$1,APPEL!C20,IF($B$2=APPEL!$E$1,APPEL!F20,IF($B$2=APPEL!$H$1,APPEL!I20,IF($B$2=APPEL!$K$1,APPEL!L20,IF($B$2=APPEL!$N$1,APPEL!O20,IF($B$2=APPEL!$Q$1,APPEL!R20,IF($B$2=APPEL!$T$1,APPEL!U20,IF($B$2=APPEL!$W$1,APPEL!X20,IF($B$2=APPEL!$Z$1,APPEL!AA20)))))))))","v":"Suha"}]
[{"$f":"IF($B$2=APPEL!$B$1,VLOOKUP(B23,APPEL!$C$3:$D$38,2,FALSE),IF($B$2=APPEL!$E$1,VLOOKUP(B23,APPEL!$F$3:$G$38,2,FALSE),IF($B$2=APPEL!$H$1,VLOOKUP(B23,APPEL!$I$3:$J$38,2,FALSE),IF($B$2=APPEL!$K$1,VLOOKUP(B23,APPEL!$L$3:$M$38,2,FALSE),IF($B$2=APPEL!$N$1,VLOOKUP(B23,APPEL!$O$3:$P$38,2,FALSE),IF($B$2=APPEL!$Q$1,VLOOKUP(B23,APPEL!$R$3:$S$38,2,FALSE),IF($B$2=APPEL!$T$1,VLOOKUP(B23,APPEL!$U$3:$V$38,2,FALSE),IF($B$2=APPEL!$W$1,VLOOKUP(B23,APPEL!$X$3:$Y$38,2,FALSE),IF($B$2=APPEL!$Z$1,VLOOKUP(B23,APPEL!$AA$3:$AB$38,2,FALSE))))))))))","v":"g"},{"$f":"IF($B$2=APPEL!$B$1,APPEL!C21,IF($B$2=APPEL!$E$1,APPEL!F21,IF($B$2=APPEL!$H$1,APPEL!I21,IF($B$2=APPEL!$K$1,APPEL!L21,IF($B$2=APPEL!$N$1,APPEL!O21,IF($B$2=APPEL!$Q$1,APPEL!R21,IF($B$2=APPEL!$T$1,APPEL!U21,IF($B$2=APPEL!$W$1,APPEL!X21,IF($B$2=APPEL!$Z$1,APPEL!AA21)))))))))","v":"Yassine"}]
[{"$f":"IF($B$2=APPEL!$B$1,VLOOKUP(B24,APPEL!$C$3:$D$38,2,FALSE),IF($B$2=APPEL!$E$1,VLOOKUP(B24,APPEL!$F$3:$G$38,2,FALSE),IF($B$2=APPEL!$H$1,VLOOKUP(B24,APPEL!$I$3:$J$38,2,FALSE),IF($B$2=APPEL!$K$1,VLOOKUP(B24,APPEL!$L$3:$M$38,2,FALSE),IF($B$2=APPEL!$N$1,VLOOKUP(B24,APPEL!$O$3:$P$38,2,FALSE),IF($B$2=APPEL!$Q$1,VLOOKUP(B24,APPEL!$R$3:$S$38,2,FALSE),IF($B$2=APPEL!$T$1,VLOOKUP(B24,APPEL!$U$3:$V$38,2,FALSE),IF($B$2=APPEL!$W$1,VLOOKUP(B24,APPEL!$X$3:$Y$38,2,FALSE),IF($B$2=APPEL!$Z$1,VLOOKUP(B24,APPEL!$AA$3:$AB$38,2,FALSE))))))))))","v":{"$error":"#N/A"}},{"$f":"IF($B$2=APPEL!$B$1,APPEL!C22,IF($B$2=APPEL!$E$1,APPEL!F22,IF($B$2=APPEL!$H$1,APPEL!I22,IF($B$2=APPEL!$K$1,APPEL!L22,IF($B$2=APPEL!$N$1,APPEL!O22,IF($B$2=APPEL!$Q$1,APPEL!R22,IF($B$2=APPEL!$T$1,APPEL!U22,IF($B$2=APPEL!$W$1,APPEL!X22,IF($B$2=APPEL!$Z$1,APPEL!AA22)))))))))","v":0}]
[{"$f":"IF($B$2=APPEL!$B$1,VLOOKUP(B25,APPEL!$C$3:$D$38,2,FALSE),IF($B$2=APPEL!$E$1,VLOOKUP(B25,APPEL!$F$3:$G$38,2,FALSE),IF($B$2=APPEL!$H$1,VLOOKUP(B25,APPEL!$I$3:$J$38,2,FALSE),IF($B$2=APPEL!$K$1,VLOOKUP(B25,APPEL!$L$3:$M$38,2,FALSE),IF($B$2=APPEL!$N$1,VLOOKUP(B25,APPEL!$O$3:$P$38,2,FALSE),IF($B$2=APPEL!$Q$1,VLOOKUP(B25,APPEL!$R$3:$S$38,2,FALSE),IF($B$2=APPEL!$T$1,VLOOKUP(B25,APPEL!$U$3:$V$38,2,FALSE),IF($B$2=APPEL!$W$1,VLOOKUP(B25,APPEL!$X$3:$Y$38,2,FALSE),IF($B$2=APPEL!$Z$1,VLOOKUP(B25,APPEL!$AA$3:$AB$38,2,FALSE))))))))))","v":{"$error":"#N/A"}},{"$f":"IF($B$2=APPEL!$B$1,APPEL!C23,IF($B$2=APPEL!$E$1,APPEL!F23,IF($B$2=APPEL!$H$1,APPEL!I23,IF($B$2=APPEL!$K$1,APPEL!L23,IF($B$2=APPEL!$N$1,APPEL!O23,IF($B$2=APPEL!$Q$1,APPEL!R23,IF($B$2=APPEL!$T$1,APPEL!U23,IF($B$2=APPEL!$W$1,APPEL!X23,IF($B$2=APPEL!$Z$1,APPEL!AA23)))))))))","v":0}]
[{"$f":"IF($B$2=APPEL!$B$1,VLOOKUP(B26,APPEL!$C$3:$D$38,2,FALSE),IF($B$2=APPEL!$E$1,VLOOKUP(B26,APPEL!$F$3:$G$38,2,FALSE),IF($B$2=APPEL!$H$1,VLOOKUP(B26,APPEL!$I$3:$J$38,2,FALSE),IF($B$2=APPEL!$K$1,VLOOKUP(B26,APPEL!$L$3:$M$38,2,FALSE),IF($B$2=APPEL!$N$1,VLOOKUP(B26,APPEL!$O$3:$P$38,2,FALSE),IF($B$2=APPEL!$Q$1,VLOOKUP(B26,APPEL!$R$3:$S$38,2,FALSE),IF($B$2=APPEL!$T$1,VLOOKUP(B26,APPEL!$U$3:$V$38,2,FALSE),IF($B$2=APPEL!$W$1,VLOOKUP(B26,APPEL!$X$3:$Y$38,2,FALSE),IF($B$2=APPEL!$Z$1,VLOOKUP(B26,APPEL!$AA$3:$AB$38,2,FALSE))))))))))","v":{"$error":"#N/A"}},{"$f":"IF($B$2=APPEL!$B$1,APPEL!C24,IF($B$2=APPEL!$E$1,APPEL!F24,IF($B$2=APPEL!$H$1,APPEL!I24,IF($B$2=APPEL!$K$1,APPEL!L24,IF($B$2=APPEL!$N$1,APPEL!O24,IF($B$2=APPEL!$Q$1,APPEL!R24,IF($B$2=APPEL!$T$1,APPEL!U24,IF($B$2=APPEL!$W$1,APPEL!X24,IF($B$2=APPEL!$Z$1,APPEL!AA24)))))))))","v":0}]
[{"$f":"IF($B$2=APPEL!$B$1,VLOOKUP(B27,APPEL!$C$3:$D$38,2,FALSE),IF($B$2=APPEL!$E$1,VLOOKUP(B27,APPEL!$F$3:$G$38,2,FALSE),IF($B$2=APPEL!$H$1,VLOOKUP(B27,APPEL!$I$3:$J$38,2,FALSE),IF($B$2=APPEL!$K$1,VLOOKUP(B27,APPEL!$L$3:$M$38,2,FALSE),IF($B$2=APPEL!$N$1,VLOOKUP(B27,APPEL!$O$3:$P$38,2,FALSE),IF($B$2=APPEL!$Q$1,VLOOKUP(B27,APPEL!$R$3:$S$38,2,FALSE),IF($B$2=APPEL!$T$1,VLOOKUP(B27,APPEL!$U$3:$V$38,2,FALSE),IF($B$2=APPEL!$W$1,VLOOKUP(B27,APPEL!$X$3:$Y$38,2,FALSE),IF($B$2=APPEL!$Z$1,VLOOKUP(B27,APPEL!$AA$3:$AB$38,2,FALSE))))))))))","v":{"$error":"#N/A"}},{"$f":"IF($B$2=APPEL!$B$1,APPEL!C25,IF($B$2=APPEL!$E$1,APPEL!F25,IF($B$2=APPEL!$H$1,APPEL!I25,IF($B$2=APPEL!$K$1,APPEL!L25,IF($B$2=APPEL!$N$1,APPEL!O25,IF($B$2=APPEL!$Q$1,APPEL!R25,IF($B$2=APPEL!$T$1,APPEL!U25,IF($B$2=APPEL!$W$1,APPEL!X25,IF($B$2=APPEL!$Z$1,APPEL!AA25)))))))))","v":0}]
[{"$f":"IF($B$2=APPEL!$B$1,VLOOKUP(B28,APPEL!$C$3:$D$38,2,FALSE),IF($B$2=APPEL!$E$1,VLOOKUP(B28,APPEL!$F$3:$G$38,2,FALSE),IF($B$2=APPEL!$H$1,VLOOKUP(B28,APPEL!$I$3:$J$38,2,FALSE),IF($B$2=APPEL!$K$1,VLOOKUP(B28,APPEL!$L$3:$M$38,2,FALSE),IF($B$2=APPEL!$N$1,VLOOKUP(B28,APPEL!$O$3:$P$38,2,FALSE),IF($B$2=APPEL!$Q$1,VLOOKUP(B28,APPEL!$R$3:$S$38,2,FALSE),IF($B$2=APPEL!$T$1,VLOOKUP(B28,APPEL!$U$3:$V$38,2,FALSE),IF($B$2=APPEL!$W$1,VLOOKUP(B28,APPEL!$X$3:$Y$38,2,FALSE),IF($B$2=APPEL!$Z$1,VLOOKUP(B28,APPEL!$AA$3:$AB$38,2,FALSE))))))))))","v":{"$error":"#N/A"}},{"$f":"IF($B$2=APPEL!$B$1,APPEL!C26,IF($B$2=APPEL!$E$1,APPEL!F26,IF($B$2=APPEL!$H$1,APPEL!I26,IF($B$2=APPEL!$K$1,APPEL!L26,IF($B$2=APPEL!$N$1,APPEL!O26,IF($B$2=APPEL!$Q$1,APPEL!R26,IF($B$2=APPEL!$T$1,APPEL!U26,IF($B$2=APPEL!$W$1,APPEL!X26,IF($B$2=APPEL!$Z$1,APPEL!AA26)))))))))","v":0}]
[{"$f":"IF($B$2=APPEL!$B$1,VLOOKUP(B29,APPEL!$C$3:$D$38,2,FALSE),IF($B$2=APPEL!$E$1,VLOOKUP(B29,APPEL!$F$3:$G$38,2,FALSE),IF($B$2=APPEL!$H$1,VLOOKUP(B29,APPEL!$I$3:$J$38,2,FALSE),IF($B$2=APPEL!$K$1,VLOOKUP(B29,APPEL!$L$3:$M$38,2,FALSE),IF($B$2=APPEL!$N$1,VLOOKUP(B29,APPEL!$O$3:$P$38,2,FALSE),IF($B$2=APPEL!$Q$1,VLOOKUP(B29,APPEL!$R$3:$S$38,2,FALSE),IF($B$2=APPEL!$T$1,VLOOKUP(B29,APPEL!$U$3:$V$38,2,FALSE),IF($B$2=APPEL!$W$1,VLOOKUP(B29,APPEL!$X$3:$Y$38,2,FALSE),IF($B$2=APPEL!$Z$1,VLOOKUP(B29,APPEL!$AA$3:$AB$38,2,FALSE))))))))))","v":{"$error":"#N/A"}},{"$f":"IF($B$2=APPEL!$B$1,APPEL!C27,IF($B$2=APPEL!$E$1,APPEL!F27,IF($B$2=APPEL!$H$1,APPEL!I27,IF($B$2=APPEL!$K$1,APPEL!L27,IF($B$2=APPEL!$N$1,APPEL!O27,IF($B$2=APPEL!$Q$1,APPEL!R27,IF($B$2=APPEL!$T$1,APPEL!U27,IF($B$2=APPEL!$W$1,APPEL!X27,IF($B$2=APPEL!$Z$1,APPEL!AA27)))))))))","v":0}]
[{"$f":"IF($B$2=APPEL!$B$1,VLOOKUP(B30,APPEL!$C$3:$D$38,2,FALSE),IF($B$2=APPEL!$E$1,VLOOKUP(B30,APPEL!$F$3:$G$38,2,FALSE),IF($B$2=APPEL!$H$1,VLOOKUP(B30,APPEL!$I$3:$J$38,2,FALSE),IF($B$2=APPEL!$K$1,VLOOKUP(B30,APPEL!$L$3:$M$38,2,FALSE),IF($B$2=APPEL!$N$1,VLOOKUP(B30,APPEL!$O$3:$P$38,2,FALSE),IF($B$2=APPEL!$Q$1,VLOOKUP(B30,APPEL!$R$3:$S$38,2,FALSE),IF($B$2=APPEL!$T$1,VLOOKUP(B30,APPEL!$U$3:$V$38,2,FALSE),IF($B$2=APPEL!$W$1,VLOOKUP(B30,APPEL!$X$3:$Y$38,2,FALSE),IF($B$2=APPEL!$Z$1,VLOOKUP(B30,APPEL!$AA$3:$AB$38,2,FALSE))))))))))","v":{"$error":"#N/A"}},{"$f":"IF($B$2=APPEL!$B$1,APPEL!C28,IF($B$2=APPEL!$E$1,APPEL!F28,IF($B$2=APPEL!$H$1,APPEL!I28,IF($B$2=APPEL!$K$1,APPEL!L28,IF($B$2=APPEL!$N$1,APPEL!O28,IF($B$2=APPEL!$Q$1,APPEL!R28,IF($B$2=APPEL!$T$1,APPEL!U28,IF($B$2=APPEL!$W$1,APPEL!X28,IF($B$2=APPEL!$Z$1,APPEL!AA28)))))))))","v":0}]
[{"$f":"IF($B$2=APPEL!$B$1,VLOOKUP(B31,APPEL!$C$3:$D$38,2,FALSE),IF($B$2=APPEL!$E$1,VLOOKUP(B31,APPEL!$F$3:$G$38,2,FALSE),IF($B$2=APPEL!$H$1,VLOOKUP(B31,APPEL!$I$3:$J$38,2,FALSE),IF($B$2=APPEL!$K$1,VLOOKUP(B31,APPEL!$L$3:$M$38,2,FALSE),IF($B$2=APPEL!$N$1,VLOOKUP(B31,APPEL!$O$3:$P$38,2,FALSE),IF($B$2=APPEL!$Q$1,VLOOKUP(B31,APPEL!$R$3:$S$38,2,FALSE),IF($B$2=APPEL!$T$1,VLOOKUP(B31,APPEL!$U$3:$V$38,2,FALSE),IF($B$2=APPEL!$W$1,VLOOKUP(B31,APPEL!$X$3:$Y$38,2,FALSE),IF($B$2=APPEL!$Z$1,VLOOKUP(B31,APPEL!$AA$3:$AB$38,2,FALSE))))))))))","v":{"$error":"#N/A"}},{"$f":"IF($B$2=APPEL!$B$1,APPEL!C29,IF($B$2=APPEL!$E$1,APPEL!F29,IF($B$2=APPEL!$H$1,APPEL!I29,IF($B$2=APPEL!$K$1,APPEL!L29,IF($B$2=APPEL!$N$1,APPEL!O29,IF($B$2=APPEL!$Q$1,APPEL!R29,IF($B$2=APPEL!$T$1,APPEL!U29,IF($B$2=APPEL!$W$1,APPEL!X29,IF($B$2=APPEL!$Z$1,APPEL!AA29)))))))))","v":0}]
[{"$f":"IF($B$2=APPEL!$B$1,VLOOKUP(B32,APPEL!$C$3:$D$38,2,FALSE),IF($B$2=APPEL!$E$1,VLOOKUP(B32,APPEL!$F$3:$G$38,2,FALSE),IF($B$2=APPEL!$H$1,VLOOKUP(B32,APPEL!$I$3:$J$38,2,FALSE),IF($B$2=APPEL!$K$1,VLOOKUP(B32,APPEL!$L$3:$M$38,2,FALSE),IF($B$2=APPEL!$N$1,VLOOKUP(B32,APPEL!$O$3:$P$38,2,FALSE),IF($B$2=APPEL!$Q$1,VLOOKUP(B32,APPEL!$R$3:$S$38,2,FALSE),IF($B$2=APPEL!$T$1,VLOOKUP(B32,APPEL!$U$3:$V$38,2,FALSE),IF($B$2=APPEL!$W$1,VLOOKUP(B32,APPEL!$X$3:$Y$38,2,FALSE),IF($B$2=APPEL!$Z$1,VLOOKUP(B32,APPEL!$AA$3:$AB$38,2,FALSE))))))))))","v":{"$error":"#N/A"}},{"$f":"IF($B$2=APPEL!$B$1,APPEL!C30,IF($B$2=APPEL!$E$1,APPEL!F30,IF($B$2=APPEL!$H$1,APPEL!I30,IF($B$2=APPEL!$K$1,APPEL!L30,IF($B$2=APPEL!$N$1,APPEL!O30,IF($B$2=APPEL!$Q$1,APPEL!R30,IF($B$2=APPEL!$T$1,APPEL!U30,IF($B$2=APPEL!$W$1,APPEL!X30,IF($B$2=APPEL!$Z$1,APPEL!AA30)))))))))","v":0}]
[{"$f":"IF($B$2=APPEL!$B$1,VLOOKUP(B33,APPEL!$C$3:$D$38,2,FALSE),IF($B$2=APPEL!$E$1,VLOOKUP(B33,APPEL!$F$3:$G$38,2,FALSE),IF($B$2=APPEL!$H$1,VLOOKUP(B33,APPEL!$I$3:$J$38,2,FALSE),IF($B$2=APPEL!$K$1,VLOOKUP(B33,APPEL!$L$3:$M$38,2,FALSE),IF($B$2=APPEL!$N$1,VLOOKUP(B33,APPEL!$O$3:$P$38,2,FALSE),IF($B$2=APPEL!$Q$1,VLOOKUP(B33,APPEL!$R$3:$S$38,2,FALSE),IF($B$2=APPEL!$T$1,VLOOKUP(B33,APPEL!$U$3:$V$38,2,FALSE),IF($B$2=APPEL!$W$1,VLOOKUP(B33,APPEL!$X$3:$Y$38,2,FALSE),IF($B$2=APPEL!$Z$1,VLOOKUP(B33,APPEL!$AA$3:$AB$38,2,FALSE))))))))))","v":{"$error":"#N/A"}},{"$f":"IF($B$2=APPEL!$B$1,APPEL!C31,IF($B$2=APPEL!$E$1,APPEL!F31,IF($B$2=APPEL!$H$1,APPEL!I31,IF($B$2=APPEL!$K$1,APPEL!L31,IF($B$2=APPEL!$N$1,APPEL!O31,IF($B$2=APPEL!$Q$1,APPEL!R31,IF($B$2=APPEL!$T$1,APPEL!U31,IF($B$2=APPEL!$W$1,APPEL!X31,IF($B$2=APPEL!$Z$1,APPEL!AA31)))))))))","v":0}]
[{"$f":"IF($B$2=APPEL!$B$1,VLOOKUP(B34,APPEL!$C$3:$D$38,2,FALSE),IF($B$2=APPEL!$E$1,VLOOKUP(B34,APPEL!$F$3:$G$38,2,FALSE),IF($B$2=APPEL!$H$1,VLOOKUP(B34,APPEL!$I$3:$J$38,2,FALSE),IF($B$2=APPEL!$K$1,VLOOKUP(B34,APPEL!$L$3:$M$38,2,FALSE),IF($B$2=APPEL!$N$1,VLOOKUP(B34,APPEL!$O$3:$P$38,2,FALSE),IF($B$2=APPEL!$Q$1,VLOOKUP(B34,APPEL!$R$3:$S$38,2,FALSE),IF($B$2=APPEL!$T$1,VLOOKUP(B34,APPEL!$U$3:$V$38,2,FALSE),IF($B$2=APPEL!$W$1,VLOOKUP(B34,APPEL!$X$3:$Y$38,2,FALSE),IF($B$2=APPEL!$Z$1,VLOOKUP(B34,APPEL!$AA$3:$AB$38,2,FALSE))))))))))","v":{"$error":"#N/A"}},{"$f":"IF($B$2=APPEL!$B$1,APPEL!C32,IF($B$2=APPEL!$E$1,APPEL!F32,IF($B$2=APPEL!$H$1,APPEL!I32,IF($B$2=APPEL!$K$1,APPEL!L32,IF($B$2=APPEL!$N$1,APPEL!O32,IF($B$2=APPEL!$Q$1,APPEL!R32,IF($B$2=APPEL!$T$1,APPEL!U32,IF($B$2=APPEL!$W$1,APPEL!X32,IF($B$2=APPEL!$Z$1,APPEL!AA32)))))))))","v":0}]
[{"$f":"IF($B$2=APPEL!$B$1,VLOOKUP(B35,APPEL!$C$3:$D$38,2,FALSE),IF($B$2=APPEL!$E$1,VLOOKUP(B35,APPEL!$F$3:$G$38,2,FALSE),IF($B$2=APPEL!$H$1,VLOOKUP(B35,APPEL!$I$3:$J$38,2,FALSE),IF($B$2=APPEL!$K$1,VLOOKUP(B35,APPEL!$L$3:$M$38,2,FALSE),IF($B$2=APPEL!$N$1,VLOOKUP(B35,APPEL!$O$3:$P$38,2,FALSE),IF($B$2=APPEL!$Q$1,VLOOKUP(B35,APPEL!$R$3:$S$38,2,FALSE),IF($B$2=APPEL!$T$1,VLOOKUP(B35,APPEL!$U$3:$V$38,2,FALSE),IF($B$2=APPEL!$W$1,VLOOKUP(B35,APPEL!$X$3:$Y$38,2,FALSE),IF($B$2=APPEL!$Z$1,VLOOKUP(B35,APPEL!$AA$3:$AB$38,2,FALSE))))))))))","v":{"$error":"#N/A"}},{"$f":"IF($B$2=APPEL!$B$1,APPEL!C33,IF($B$2=APPEL!$E$1,APPEL!F33,IF($B$2=APPEL!$H$1,APPEL!I33,IF($B$2=APPEL!$K$1,APPEL!L33,IF($B$2=APPEL!$N$1,APPEL!O33,IF($B$2=APPEL!$Q$1,APPEL!R33,IF($B$2=APPEL!$T$1,APPEL!U33,IF($B$2=APPEL!$W$1,APPEL!X33,IF($B$2=APPEL!$Z$1,APPEL!AA33)))))))))","v":0}]
[{"$f":"IF($B$2=APPEL!$B$1,VLOOKUP(B36,APPEL!$C$3:$D$38,2,FALSE),IF($B$2=APPEL!$E$1,VLOOKUP(B36,APPEL!$F$3:$G$38,2,FALSE),IF($B$2=APPEL!$H$1,VLOOKUP(B36,APPEL!$I$3:$J$38,2,FALSE),IF($B$2=APPEL!$K$1,VLOOKUP(B36,APPEL!$L$3:$M$38,2,FALSE),IF($B$2=APPEL!$N$1,VLOOKUP(B36,APPEL!$O$3:$P$38,2,FALSE),IF($B$2=APPEL!$Q$1,VLOOKUP(B36,APPEL!$R$3:$S$38,2,FALSE),IF($B$2=APPEL!$T$1,VLOOKUP(B36,APPEL!$U$3:$V$38,2,FALSE),IF($B$2=APPEL!$W$1,VLOOKUP(B36,APPEL!$X$3:$Y$38,2,FALSE),IF($B$2=APPEL!$Z$1,VLOOKUP(B36,APPEL!$AA$3:$AB$38,2,FALSE))))))))))","v":{"$error":"#N/A"}},{"$f":"IF($B$2=APPEL!$B$1,APPEL!C34,IF($B$2=APPEL!$E$1,APPEL!F34,IF($B$2=APPEL!$H$1,APPEL!I34,IF($B$2=APPEL!$K$1,APPEL!L34,IF($B$2=APPEL!$N$1,APPEL!O34,IF($B$2=APPEL!$Q$1,APPEL!R34,IF($B$2=APPEL!$T$1,APPEL!U34,IF($B$2=APPEL!$W$1,APPEL!X34,IF($B$2=APPEL!$Z$1,APPEL!AA34)))))))))","v":0}]

{"sheet":"Choixeleves","index":2,"n_rows":109,"n_cols":20,"rows_kept":109,"cut":false,"hidden":false,"merged":[[11,3,12,3],[11,4,12,4],[11,5,12,5],[11,6,12,6],[11,7,12,7],[17,3,18,3],[17,4,18,4],[17,5,18,5],[17,6,18,6],[17,7,18,7],[17,8,18,8],[17,9,18,9],[17,10,18,10],[14,3,15,3],[23,3,24,3],[23,4,24,4],[23,5,24,5],[23,6,24,6],[23,7,24,7],[23,8,24,8],[23,9,24,9],[23,10,24,10],[20,3,21,3],[20,4,21,4],[20,5,21,5],[20,6,21,6],[20,7,21,7],[20,8,21,8],[29,3,30,3],[29,4,30,4],[29,5,30,5],[29,6,30,6],[29,7,30,7],[29,8,30,8],[29,9,30,9],[29,10,30,10],[26,3,27,3],[26,4,27,4],[26,5,27,5],[26,6,27,6],[26,7,27,7],[26,8,27,8],[35,3,36,3],[35,4,36,4],[35,5,36,5],[35,6,36,6],[35,7,36,7],[35,8,36,8],[35,9,36,9],[35,10,36,10],[32,3,33,3],[32,4,33,4],[32,5,33,5],[32,6,33,6],[32,7,33,7],[32,8,33,8],[41,3,42,3],[41,4,42,4],[41,5,42,5],[41,6,42,6],[41,7,42,7],[41,8,42,8],[41,9,42,9],[41,10,42,10],[38,3,39,3],[38,4,39,4],[38,5,39,5],[38,6,39,6],[38,7,39,7],[38,8,39,8],[47,3,48,3],[47,4,48,4],[47,5,48,5],[47,6,48,6],[47,7,48,7],[47,8,48,8],[47,9,48,9],[47,10,48,10],[44,3,45,3],[44,4,45,4],[44,5,45,5],[44,6,45,6],[44,7,45,7],[44,8,45,8],[53,3,54,3],[53,4,54,4],[53,5,54,5],[53,6,54,6],[53,7,54,7],[53,8,54,8],[53,9,54,9],[53,10,54,10],[50,3,51,3],[50,4,51,4],[50,5,51,5],[50,6,51,6],[50,7,51,7],[50,8,51,8],[4,8,5,8],[11,11,12,11],[14,4,15,4],[14,5,15,5],[14,6,15,6],[14,7,15,7],[14,8,15,8],[14,9,15,9],[50,9,51,9],[50,10,51,10],[44,9,45,9],[44,10,45,10],[38,9,39,9],[38,10,39,10],[32,9,33,9],[32,10,33,10],[26,9,27,9],[26,10,27,10],[20,9,21,9],[20,10,21,10],[14,10,15,10],[11,8,12,8],[11,9,12,9],[11,10,12,10],[41,11,42,11],[44,11,45,11],[47,11,48,11],[50,11,51,11],[53,11,54,11],[4,9,5,9],[14,11,15,11],[17,11,18,11],[20,11,21,11],[23,11,24,11],[26,11,27,11],[29,11,30,11],[32,11,33,11],[35,11,36,11],[38,11,39,11]]}
[null,"Classe "]
[null,"STAGE"]
[]
[null,"Elèves",{"$f":"B5","v":"Rémi"},{"$f":"B6","v":"Timothée"},{"$f":"B7","v":"Virginie"},{"$f":"B8","v":"Quentin"},{"$f":"B9","v":"Mick"},"Temps individuel"]
[null,"Rémi",null,null,null,null,null,3.6,null,"INDICE DE PERF"]
[null,"Timothée",null,null,null,null,null,5]
[null,"Virginie",5,null,null,null,null,7]
[null,"Quentin",12,null,null,null,null,8]
[null,"Mick",11,null,null,null,null,9]
[]
[null,null,"Temps individuel","Temps additionnel","Temps du relais réalisé","Indice de transmission","Main opposée","Orientation relayeur","Moment transmission","Communication D-R","Nombre de critères validés","Indice de perf","Prénom incrémenté","Prénom relayeur","IP","Incrementation","IT","Perf/25m","Perf/50m"]
[null,{"$f":"B5","v":"Rémi"},{"$f":"IF(B12=\"\",\"\",VLOOKUP(B12,$B$5:$H$9,7,FALSE))","v":3.6},{"$f":"SUM(C12:C13)","v":10.6},12,{"$f":"E12-D12","v":1.4000000000000004},"Oui","De profil","Début","Non",{"$f":"IFERROR(VLOOKUP(G12,barememainopposée,2,FALSE)+VLOOKUP(H12,DEBUT!$P$4:$Q$33,2,FALSE)+VLOOKUP(I12,DEBUT!$R$4:$S$33,2,FALSE)+VLOOKUP(J12,DEBUT!$T$4:$U$33,2,FALSE),\"\")","v":2},{"$f":"IFERROR(INDEX(note,MATCH(F12,indice,1),MATCH(K12,critere,1)),\"\")","v":4},{"$f":"N12&\"_\"&P12","v":"Rémi_1"},{"$f":"B12","v":"Rémi"},{"$f":"L12","v":4},{"$f":"IF(N12<>0,COUNTIF($N$12:N12,N12),\"\")","v":1},{"$f":"F12","v":1.4000000000000004},{"$f":"C12","v":3.6},{"$f":"E12","v":12},{"$f":"B13","v":"Virginie"}]
[null,"Virginie",{"$f":"IF(B13=\"\",\"\",VLOOKUP(B13,$B$5:$H$9,7,FALSE))","v":7},null,null,null,null,null,null,null,null,null,{"$f":"N13&\"_\"&P13","v":"Virginie_1"},{"$f":"B13","v":"Virginie"},{"$f":"L12","v":4},{"$f":"IF(N13<>0,COUNTIF($N$12:N13,N13),\"\")","v":1},{"$f":"F12","v":1.4000000000000004},{"$f":"C13","v":7},{"$f":"E12","v":12},{"$f":"B12","v":"Rémi"}]
[null,null,null,null,null,null,null,null,null,null,null,null,null,null,null,{"$f":"IF(N14<>0,COUNTIF($N$12:N14,N14),\"\")","v":""}]
[null,{"$f":"B13","v":"Virginie"},{"$f":"IF(B15=\"\",\"\",VLOOKUP(B15,$B$5:$H$9,7,FALSE))","v":7},{"$f":"SUM(C15:C16)","v":10.6},8,{"$f":"E15-D15","v":-2.5999999999999996},"Oui","De dos","Début","Oui",{"$f":"IFERROR(VLOOKUP(G15,barememainopposée,2,FALSE)+VLOOKUP(H15,DEBUT!$P$4:$Q$33,2,FALSE)+VLOOKUP(I15,DEBUT!$R$4:$S$33,2,FALSE)+VLOOKUP(J15,DEBUT!$T$4:$U$33,2,FALSE),\"\")","v":4},{"$f":"IFERROR(INDEX(note,MATCH(F15,indice,1),MATCH(K15,critere,1)),\"\")","v":12},"Virginie_2",{"$f":"B15","v":"Virginie"},{"$f":"L15","v":12},{"$f":"IF(N15<>0,COUNTIF($N$12:N15,N15),\"\")","v":2},{"$f":"F15","v":-2.5999999999999996},{"$f":"C15","v":7},{"$f":"E15","v":8},{"$f":"B16","v":"Rémi"}]
[null,{"$f":"B12","v":"Rémi"},3.6,null,null,null,null,null,null,null,null,null,"Rémi_2",{"$f":"B16","v":"Rémi"},{"$f":"L15","v":12},{"$f":"IF(N16<>0,COUNTIF($N$12:N16,N16),\"\")","v":2},{"$f":"F15","v":-2.5999999999999996},{"$f":"C16","v":3.6},{"$f":"E15","v":8},{"$f":"B15","v":"Virginie"}]
[null,null,null,null,null,null,null,null,null,null,null,null,"_"]
[null,"Rémi",{"$f":"IF(B18=\"\",\"\",VLOOKUP(B18,$B$5:$H$9,7,FALSE))","v":3.6},{"$f":"SUM(C18:C19)","v":3.6},null,{"$f":"E18-D18","v":-3.6},"Oui","De profil","Hors zone","Oui",{"$f":"IFERROR(VLOOKUP(G18,barememainopposée,2,FALSE)+VLOOKUP(H18,DEBUT!$P$4:$Q$33,2,FALSE)+VLOOKUP(I18,DEBUT!$R$4:$S$33,2,FALSE)+VLOOKUP(J18,DEBUT!$T$4:$U$33,2,FALSE),\"\")","v":2},{"$f":"IFERROR(INDEX(note,MATCH(F18,indice,1),MATCH(K18,critere,1)),\"\")","v":12},"Rémi_3",{"$f":"B18","v":"Rémi"},{"$f":"L18","v":12},{"$f":"IF(N18<>0,COUNTIF($N$12:N18,N18),\"\")","v":3},{"$f":"F18","v":-3.6},{"$f":"C18","v":3.6},{"$f":"E18","v":0},{"$f":"B19","v":0}]
[null,null,"",null,null,null,null,null,null,null,null,null,{"$f":"N19&\"_\"&P19","v":"0_"},0,{"$f":"L18","v":12},{"$f":"IF(N19<>0,COUNTIF($N$12:N19,N19),\"\")","v":""},{"$f":"F18","v":-3.6},"",{"$f":"E18","v":0},{"$f":"B18","v":"Rémi"}]
[null,null,null,null,null,null,null,null,null,null,null,null,null,null,null,{"$f":"IF(N20<>0,COUNTIF($N$12:N20,N20),\"\")","v":""}]
[null,{"$f":"IF(B19=\"\",\"\",B19)","v":""},{"$f":"IF(B21=\"\",\"\",VLOOKUP(B21,$B$5:$H$9,7,FALSE))","v":""},{"$f":"SUM(C21:C22)","v":3.6},null,{"$f":"E21-D21","v":-3.6},"Oui","De profil","Hors zone","Oui",{"$f":"IFERROR(VLOOKUP(G21,barememainopposée,2,FALSE)+VLOOKUP(H21,DEBUT!$P$4:$Q$33,2,FALSE)+VLOOKUP(I21,DEBUT!$R$4:$S$33,2,FALSE)+VLOOKUP(J21,DEBUT!$T$4:$U$33,2,FALSE),\"\")","v":2},{"$f":"IFERROR(INDEX(note,MATCH(F21,indice,1),MATCH(K21,critere,1)),\"\")","v":12},{"$f":"N21&\"_\"&P21","v":"_4"},{"$f":"B21","v":""},{"$f":"L21","v":12},{"$f":"IF(N21<>0,COUNTIF($N$12:N21,N21),\"\")","v":4},{"$f":"F21","v":-3.6},{"$f":"C21","v":""},{"$f":"E21","v":0},{"$f":"B22","v":"Rémi"}]
[null,{"$f":"B18","v":"Rémi"},3.6,null,null,null,null,null,null,null,null,null,"Rémi_4","Rémi",{"$f":"L21","v":12},{"$f":"IF(N22<>0,COUNTIF($N$12:N22,N22),\"\")","v":4},{"$f":"F21","v":-3.6},3.6,{"$f":"E21","v":0},{"$f":"B21","v":""}]
[null,null,null,null,null,null,null,null,null,null,null,null,"_"]
[null,null,{"$f":"IF(B24=\"\",\"\",VLOOKUP(B24,$B$5:$H$9,7,FALSE))","v":""},{"$f":"SUM(C24:C25)","v":0},null,{"$f":"E24-D24","v":0},null,null,null,null,{"$f":"IFERROR(VLOOKUP(G24,barememainopposée,2,FALSE)+VLOOKUP(H24,DEBUT!$P$4:$Q$33,2,FALSE)+VLOOKUP(I24,DEBUT!$R$4:$S$33,2,FALSE)+VLOOKUP(J24,DEBUT!$T$4:$U$33,2,FALSE),\"\")","v":""},{"$f":"IFERROR(INDEX(note,MATCH(F24,indice,1),MATCH(K24,critere,1)),\"\")","v":""},"0_",{"$f":"B24","v":0},{"$f":"L24","v":""},{"$f":"IF(N24<>0,COUNTIF($N$12:N24,N24),\"\")","v":""},{"$f":"F24","v":0},{"$f":"C24","v":""},{"$f":"E24","v":0},{"$f":"B25","v":0}]
[null,null,"",null,null,null,null,null,null,null,null,null,"0_",0,{"$f":"L24","v":""},{"$f":"IF(N25<>0,COUNTIF($N$12:N25,N25),\"\")","v":""},{"$f":"F24","v":0},"",{"$f":"E24","v":0},{"$f":"B24","v":0}]
[null,null,null,null,null,null,null,null,null,null,null,null,null,null,null,{"$f":"IF(N26<>0,COUNTIF($N$12:N26,N26),\"\")","v":""}]
[null,{"$f":"B25","v":0},{"$f":"IF(B27=\"\",\"\",VLOOKUP(B27,$B$5:$H$9,7,FALSE))","v":{"$error":"#N/A"}},{"$f":"SUM(C27:C28)","v":{"$error":"#N/A"}},null,{"$f":"E27-D27","v":{"$error":"#N/A"}},null,null,null,null,{"$f":"IFERROR(VLOOKUP(G27,barememainopposée,2,FALSE)+VLOOKUP(H27,DEBUT!$P$4:$Q$33,2,FALSE)+VLOOKUP(I27,DEBUT!$R$4:$S$33,2,FALSE)+VLOOKUP(J27,DEBUT!$T$4:$U$33,2,FALSE),\"\")","v":""},{"$f":"IFERROR(INDEX(note,MATCH(F27,indice,1),MATCH(K27,critere,1)),\"\")","v":""},{"$f":"N27&\"_\"&P27","v":"0_"},{"$f":"B27","v":0},{"$f":"L27","v":""},{"$f":"IF(N27<>0,COUNTIF($N$12:N27,N27),\"\")","v":""},{"$f":"F27","v":{"$error":"#N/A"}},{"$f":"C27","v":{"$error":"#N/A"}},{"$f":"E27","v":0},{"$f":"B28","v":0}]
[null,{"$f":"B24","v":0},{"$error":"#N/A"},null,null,null,null,null,null,null,null,null,"0_",0,{"$f":"L27","v":""},{"$f":"IF(N28<>0,COUNTIF($N$12:N28,N28),\"\")","v":""},{"$f":"F27","v":{"$error":"#N/A"}},{"$error":"#N/A"},{"$f":"E27","v":0},{"$f":"B27","v":0}]
[null,null,null,null,null,null,null,null,null,null,null,null,"_"]
[null,null,{"$f":"IF(B30=\"\",\"\",VLOOKUP(B30,$B$5:$H$9,7,FALSE))","v":""},{"$f":"SUM(C30:C31)","v":0},null,{"$f":"E30-D30","v":0},null,null,null,null,{"$f":"IFERROR(VLOOKUP(G30,barememainopposée,2,FALSE)+VLOOKUP(H30,DEBUT!$P$4:$Q$33,2,FALSE)+VLOOKUP(I30,DEBUT!$R$4:$S$33,2,FALSE)+VLOOKUP(J30,DEBUT!$T$4:$U$33,2,FALSE),\"\")","v":""},{"$f":"IFERROR(INDEX(note,MATCH(F30,indice,1),MATCH(K30,critere,1)),\"\")","v":""},"0_",{"$f":"B30","v":0},{"$f":"L30","v":""},{"$f":"IF(N30<>0,COUNTIF($N$12:N30,N30),\"\")","v":""},{"$f":"F30","v":0},{"$f":"C30","v":""},{"$f":"E30","v":0},{"$f":"B31","v":0}]
[null,null,"",null,null,null,null,null,null,null,null,null,"0_",0,{"$f":"L30","v":""},{"$f":"IF(N31<>0,COUNTIF($N$12:N31,N31),\"\")","v":""},{"$f":"F30","v":0},"",{"$f":"E30","v":0},{"$f":"B30","v":0}]
[null,null,null,null,null,null,null,null,null,null,null,null,null,null,null,{"$f":"IF(N32<>0,COUNTIF($N$12:N32,N32),\"\")","v":""}]
[null,null,{"$f":"IF(B33=\"\",\"\",VLOOKUP(B33,$B$5:$H$9,7,FALSE))","v":""},{"$f":"SUM(C33:C34)","v":0},null,{"$f":"E33-D33","v":0},null,null,null,null,{"$f":"IFERROR(VLOOKUP(G33,barememainopposée,2,FALSE)+VLOOKUP(H33,DEBUT!$P$4:$Q$33,2,FALSE)+VLOOKUP(I33,DEBUT!$R$4:$S$33,2,FALSE)+VLOOKUP(J33,DEBUT!$T$4:$U$33,2,FALSE),\"\")","v":""},{"$f":"IFERROR(INDEX(note,MATCH(F33,indice,1),MATCH(K33,critere,1)),\"\")","v":""},{"$f":"N33&\"_\"&P33","v":"0_"},{"$f":"B33","v":0},{"$f":"L33","v":""},{"$f":"IF(N33<>0,COUNTIF($N$12:N33,N33),\"\")","v":""},{"$f":"F33","v":0},{"$f":"C33","v":""},{"$f":"E33","v":0},{"$f":"B34","v":0}]
[null,null,"",null,null,null,null,null,null,null,null,null,"0_",0,{"$f":"L33","v":""},{"$f":"IF(N34<>0,COUNTIF($N$12:N34,N34),\"\")","v":""},{"$f":"F33","v":0},"",{"$f":"E33","v":0},{"$f":"B33","v":0}]
[null,null,null,null,null,null,null,null,null,null,null,null,"_"]
[null,null,{"$f":"IF(B36=\"\",\"\",VLOOKUP(B36,$B$5:$H$9,7,FALSE))","v":""},{"$f":"SUM(C36:C37)","v":0},null,{"$f":"E36-D36","v":0},null,null,null,null,{"$f":"IFERROR(VLOOKUP(G36,barememainopposée,2,FALSE)+VLOOKUP(H36,DEBUT!$P$4:$Q$33,2,FALSE)+VLOOKUP(I36,DEBUT!$R$4:$S$33,2,FALSE)+VLOOKUP(J36,DEBUT!$T$4:$U$33,2,FALSE),\"\")","v":""},{"$f":"IFERROR(INDEX(note,MATCH(F36,indice,1),MATCH(K36,critere,1)),\"\")","v":""},"0_",{"$f":"B36","v":0},{"$f":"L36","v":""},{"$f":"IF(N36<>0,COUNTIF($N$12:N36,N36),\"\")","v":""},{"$f":"F36","v":0},{"$f":"C36","v":""},{"$f":"E36","v":0},{"$f":"B37","v":0}]
[null,null,"",null,null,null,null,null,null,null,null,null,"0_",0,{"$f":"L36","v":""},{"$f":"IF(N37<>0,COUNTIF($N$12:N37,N37),\"\")","v":""},{"$f":"F36","v":0},"",{"$f":"E36","v":0},{"$f":"B36","v":0}]
[null,null,null,null,null,null,null,null,null,null,null,null,null,null,null,{"$f":"IF(N38<>0,COUNTIF($N$12:N38,N38),\"\")","v":""}]
[null,null,{"$f":"IF(B39=\"\",\"\",VLOOKUP(B39,$B$5:$H$9,7,FALSE))","v":""},{"$f":"SUM(C39:C40)","v":0},null,{"$f":"E39-D39","v":0},null,null,null,null,{"$f":"IFERROR(VLOOKUP(G39,barememainopposée,2,FALSE)+VLOOKUP(H39,DEBUT!$P$4:$Q$33,2,FALSE)+VLOOKUP(I39,DEBUT!$R$4:$S$33,2,FALSE)+VLOOKUP(J39,DEBUT!$T$4:$U$33,2,FALSE),\"\")","v":""},{"$f":"IFERROR(INDEX(note,MATCH(F39,indice,1),MATCH(K39,critere,1)),\"\")","v":""},{"$f":"N39&\"_\"&P39","v":"0_"},{"$f":"B39","v":0},{"$f":"L39","v":""},{"$f":"IF(N39<>0,COUNTIF($N$12:N39,N39),\"\")","v":""},{"$f":"F39","v":0},{"$f":"C39","v":""},{"$f":"E39","v":0},{"$f":"B40","v":0}]
[null,null,"",null,null,null,null,null,null,null,null,null,"0_",0,{"$f":"L39","v":""},{"$f":"IF(N40<>0,COUNTIF($N$12:N40,N40),\"\")","v":""},{"$f":"F39","v":0},"",{"$f":"E39","v":0},{"$f":"B39","v":0}]
[null,null,null,null,null,null,null,null,null,null,null,null,"_"]
[null,null,{"$f":"IF(B42=\"\",\"\",VLOOKUP(B42,$B$5:$H$9,7,FALSE))","v":""},{"$f":"SUM(C42:C43)","v":0},null,{"$f":"E42-D42","v":0},null,null,null,null,{"$f":"IFERROR(VLOOKUP(G42,barememainopposée,2,FALSE)+VLOOKUP(H42,DEBUT!$P$4:$Q$33,2,FALSE)+VLOOKUP(I42,DEBUT!$R$4:$S$33,2,FALSE)+VLOOKUP(J42,DEBUT!$T$4:$U$33,2,FALSE),\"\")","v":""},{"$f":"IFERROR(INDEX(note,MATCH(F42,indice,1),MATCH(K42,critere,1)),\"\")","v":""},"0_",{"$f":"B42","v":0},{"$f":"L42","v":""},{"$f":"IF(N42<>0,COUNTIF($N$12:N42,N42),\"\")","v":""},{"$f":"F42","v":0},{"$f":"C42","v":""},{"$f":"E42","v":0},{"$f":"B43","v":0}]
[null,null,"",null,null,null,null,null,null,null,null,null,"0_",0,{"$f":"L42","v":""},{"$f":"IF(N43<>0,COUNTIF($N$12:N43,N43),\"\")","v":""},{"$f":"F42","v":0},"",{"$f":"E42","v":0},{"$f":"B42","v":0}]
[null,null,null,null,null,null,null,null,null,null,null,null,null,null,null,{"$f":"IF(N44<>0,COUNTIF($N$12:N44,N44),\"\")","v":""}]
[null,null,{"$f":"IF(B45=\"\",\"\",VLOOKUP(B45,$B$5:$H$9,7,FALSE))","v":""},{"$f":"SUM(C45:C46)","v":0},null,{"$f":"E45-D45","v":0},null,null,null,null,{"$f":"IFERROR(VLOOKUP(G45,barememainopposée,2,FALSE)+VLOOKUP(H45,DEBUT!$P$4:$Q$33,2,FALSE)+VLOOKUP(I45,DEBUT!$R$4:$S$33,2,FALSE)+VLOOKUP(J45,DEBUT!$T$4:$U$33,2,FALSE),\"\")","v":""},{"$f":"IFERROR(INDEX(note,MATCH(F45,indice,1),MATCH(K45,critere,1)),\"\")","v":""},{"$f":"N45&\"_\"&P45","v":"0_"},{"$f":"B45","v":0},{"$f":"L45","v":""},{"$f":"IF(N45<>0,COUNTIF($N$12:N45,N45),\"\")","v":""},{"$f":"F45","v":0},{"$f":"C45","v":""},{"$f":"E45","v":0},{"$f":"B46","v":0}]
[null,null,"",null,null,null,null,null,null,null,null,null,"0_",0,{"$f":"L45","v":""},{"$f":"IF(N46<>0,COUNTIF($N$12:N46,N46),\"\")","v":""},{"$f":"F45","v":0},"",{"$f":"E45","v":0},{"$f":"B45","v":0}]
[null,null,null,null,null,null,null,null,null,null,null,null,"_"]
[null,null,{"$f":"IF(B48=\"\",\"\",VLOOKUP(B48,$B$5:$H$9,7,FALSE))","v":""},{"$f":"SUM(C48:C49)","v":0},null,{"$f":"E48-D48","v":0},null,null,null,null,{"$f":"IFERROR(VLOOKUP(G48,barememainopposée,2,FALSE)+VLOOKUP(H48,DEBUT!$P$4:$Q$33,2,FALSE)+VLOOKUP(I48,DEBUT!$R$4:$S$33,2,FALSE)+VLOOKUP(J48,DEBUT!$T$4:$U$33,2,FALSE),\"\")","v":""},{"$f":"IFERROR(INDEX(note,MATCH(F48,indice,1),MATCH(K48,critere,1)),\"\")","v":""},"0_",{"$f":"B48","v":0},{"$f":"L48","v":""},{"$f":"IF(N48<>0,COUNTIF($N$12:N48,N48),\"\")","v":""},{"$f":"F48","v":0},{"$f":"C48","v":""},{"$f":"E48","v":0},{"$f":"B49","v":0}]
[null,null,"",null,null,null,null,null,null,null,null,null,"0_",0,{"$f":"L48","v":""},{"$f":"IF(N49<>0,COUNTIF($N$12:N49,N49),\"\")","v":""},{"$f":"F48","v":0},"",{"$f":"E48","v":0},{"$f":"B48","v":0}]
[null,null,null,null,null,null,null,null,null,null,null,null,null,null,null,{"$f":"IF(N50<>0,COUNTIF($N$12:N50,N50),\"\")","v":""}]
[null,null,{"$f":"IF(B51=\"\",\"\",VLOOKUP(B51,$B$5:$H$9,7,FALSE))","v":""},{"$f":"SUM(C51:C52)","v":0},null,{"$f":"E51-D51","v":0},null,null,null,null,{"$f":"IFERROR(VLOOKUP(G51,barememainopposée,2,FALSE)+VLOOKUP(H51,DEBUT!$P$4:$Q$33,2,FALSE)+VLOOKUP(I51,DEBUT!$R$4:$S$33,2,FALSE)+VLOOKUP(J51,DEBUT!$T$4:$U$33,2,FALSE),\"\")","v":""},{"$f":"IFERROR(INDEX(note,MATCH(F51,indice,1),MATCH(K51,critere,1)),\"\")","v":""},{"$f":"N51&\"_\"&P51","v":"0_"},{"$f":"B51","v":0},{"$f":"L51","v":""},{"$f":"IF(N51<>0,COUNTIF($N$12:N51,N51),\"\")","v":""},{"$f":"F51","v":0},{"$f":"C51","v":""},{"$f":"E51","v":0},{"$f":"B52","v":0}]
[null,null,"",null,null,null,null,null,null,null,null,null,"0_",0,{"$f":"L51","v":""},{"$f":"IF(N52<>0,COUNTIF($N$12:N52,N52),\"\")","v":""},{"$f":"F51","v":0},"",{"$f":"E51","v":0},{"$f":"B51","v":0}]
[null,null,null,null,null,null,null,null,null,null,null,null,"_"]
[null,null,{"$f":"IF(B54=\"\",\"\",VLOOKUP(B54,$B$5:$H$9,7,FALSE))","v":""},{"$f":"SUM(C54:C55)","v":0},null,{"$f":"E54-D54","v":0},null,null,null,null,{"$f":"IFERROR(VLOOKUP(G54,barememainopposée,2,FALSE)+VLOOKUP(H54,DEBUT!$P$4:$Q$33,2,FALSE)+VLOOKUP(I54,DEBUT!$R$4:$S$33,2,FALSE)+VLOOKUP(J54,DEBUT!$T$4:$U$33,2,FALSE),\"\")","v":""},{"$f":"IFERROR(INDEX(note,MATCH(F54,indice,1),MATCH(K54,critere,1)),\"\")","v":""},"0_",{"$f":"B54","v":0},{"$f":"L54","v":""},{"$f":"IF(N54<>0,COUNTIF($N$12:N54,N54),\"\")","v":""},{"$f":"F54","v":0},{"$f":"C54","v":""},{"$f":"E54","v":0},{"$f":"B55","v":0}]
[null,null,"",null,null,null,null,null,null,null,null,null,"0_",0,{"$f":"L54","v":""},{"$f":"IF(N55<>0,COUNTIF($N$12:N55,N55),\"\")","v":""},{"$f":"F54","v":0},"",{"$f":"E54","v":0},{"$f":"B54","v":0}]
[null,null,null,null,null,null,null,null,null,null,null,null,null,null,null,{"$f":"IF(N56<>0,COUNTIF($N$12:N56,N56),\"\")","v":""}]
[null,null,null,null,null,null,null,null,null,null,null,null,{"$f":"N57&\"_\"&P57","v":"0_"},{"$f":"B57","v":0},{"$f":"L57","v":0},{"$f":"IF(N57<>0,COUNTIF($N$12:N57,N57),\"\")","v":""},{"$f":"F57","v":0},{"$f":"C57","v":0},{"$f":"E57","v":0},{"$f":"B58","v":0}]
[null,null,null,null,null,null,null,null,null,null,null,null,"0_",0,{"$f":"L57","v":0},{"$f":"IF(N58<>0,COUNTIF($N$12:N58,N58),\"\")","v":""},{"$f":"F57","v":0},0,{"$f":"E57","v":0},{"$f":"B57","v":0}]
[null,null,null,null,null,null,null,null,null,null,null,null,"_"]
[null,null,null,null,null,null,null,null,null,null,null,null,"0_",{"$f":"B60","v":0},{"$f":"L60","v":0},{"$f":"IF(N60<>0,COUNTIF($N$12:N60,N60),\"\")","v":""},{"$f":"F60","v":0},{"$f":"C60","v":0},{"$f":"E60","v":0},{"$f":"B61","v":0}]
[null,null,null,null,null,null,null,null,null,null,null,null,"0_",0,{"$f":"L60","v":0},{"$f":"IF(N61<>0,COUNTIF($N$12:N61,N61),\"\")","v":""},{"$f":"F60","v":0},0,{"$f":"E60","v":0},{"$f":"B60","v":0}]
[null,null,null,null,null,null,null,null,null,null,null,null,null,null,null,{"$f":"IF(N62<>0,COUNTIF($N$12:N62,N62),\"\")","v":""}]
[null,null,null,null,null,null,null,null,null,null,null,null,{"$f":"N63&\"_\"&P63","v":"0_"},{"$f":"B63","v":0},{"$f":"L63","v":0},{"$f":"IF(N63<>0,COUNTIF($N$12:N63,N63),\"\")","v":""},{"$f":"F63","v":0},{"$f":"C63","v":0},{"$f":"E63","v":0},{"$f":"B64","v":0}]
[null,null,null,null,null,null,null,null,null,null,null,null,"0_",0,{"$f":"L63","v":0},{"$f":"IF(N64<>0,COUNTIF($N$12:N64,N64),\"\")","v":""},{"$f":"F63","v":0},0,{"$f":"E63","v":0},{"$f":"B63","v":0}]
[null,null,null,null,null,null,null,null,null,null,null,null,"_"]
[null,null,null,null,null,null,null,null,null,null,null,null,"0_",{"$f":"B66","v":0},{"$f":"L66","v":0},{"$f":"IF(N66<>0,COUNTIF($N$12:N66,N66),\"\")","v":""},{"$f":"F66","v":0},{"$f":"C66","v":0},{"$f":"E66","v":0},{"$f":"B67","v":0}]
[null,null,null,null,null,null,null,null,null,null,null,null,"0_",0,{"$f":"L66","v":0},{"$f":"IF(N67<>0,COUNTIF($N$12:N67,N67),\"\")","v":""},{"$f":"F66","v":0},0,{"$f":"E66","v":0},{"$f":"B66","v":0}]
[null,null,null,null,null,null,null,null,null,null,null,null,null,null,null,{"$f":"IF(N68<>0,COUNTIF($N$12:N68,N68),\"\")","v":""}]
[null,null,null,null,null,null,null,null,null,null,null,null,{"$f":"N69&\"_\"&P69","v":"0_"},{"$f":"B69","v":0},{"$f":"L69","v":0},{"$f":"IF(N69<>0,COUNTIF($N$12:N69,N69),\"\")","v":""},{"$f":"F69","v":0},{"$f":"C69","v":0},{"$f":"E69","v":0},{"$f":"B70","v":0}]
[null,null,null,null,null,null,null,null,null,null,null,null,"0_",0,{"$f":"L69","v":0},{"$f":"IF(N70<>0,COUNTIF($N$12:N70,N70),\"\")","v":""},{"$f":"F69","v":0},0,{"$f":"E69","v":0},{"$f":"B69","v":0}]
[null,null,null,null,null,null,null,null,null,null,null,null,"_"]
[null,null,null,null,null,null,null,null,null,null,null,null,"0_",{"$f":"B72","v":0},{"$f":"L72","v":0},{"$f":"IF(N72<>0,COUNTIF($N$12:N72,N72),\"\")","v":""},{"$f":"F72","v":0},{"$f":"C72","v":0},{"$f":"E72","v":0},{"$f":"B73","v":0}]
[null,null,null,null,null,null,null,null,null,null,null,null,"0_",0,{"$f":"L72","v":0},{"$f":"IF(N73<>0,COUNTIF($N$12:N73,N73),\"\")","v":""},{"$f":"F72","v":0},0,{"$f":"E72","v":0},{"$f":"B72","v":0}]
[null,null,null,null,null,null,null,null,null,null,null,null,null,null,null,{"$f":"IF(N74<>0,COUNTIF($N$12:N74,N74),\"\")","v":""}]
[null,null,null,null,null,null,null,null,null,null,null,null,{"$f":"N75&\"_\"&P75","v":"0_"},{"$f":"B75","v":0},{"$f":"L75","v":0},{"$f":"IF(N75<>0,COUNTIF($N$12:N75,N75),\"\")","v":""},{"$f":"F75","v":0},{"$f":"C75","v":0},{"$f":"E75","v":0},{"$f":"B76","v":0}]
[null,null,null,null,null,null,null,null,null,null,null,null,"0_",0,{"$f":"L75","v":0},{"$f":"IF(N76<>0,COUNTIF($N$12:N76,N76),\"\")","v":""},{"$f":"F75","v":0},0,{"$f":"E75","v":0},{"$f":"B75","v":0}]
[null,null,null,null,null,null,null,null,null,null,null,null,"_"]
[null,null,null,null,null,null,null,null,null,null,null,null,"0_",{"$f":"B78","v":0},{"$f":"L78","v":0},{"$f":"IF(N78<>0,COUNTIF($N$12:N78,N78),\"\")","v":""},{"$f":"F78","v":0},{"$f":"C78","v":0},{"$f":"E78","v":0},{"$f":"B79","v":0}]
[null,null,null,null,null,null,null,null,null,null,null,null,"0_",0,{"$f":"L78","v":0},{"$f":"IF(N79<>0,COUNTIF($N$12:N79,N79),\"\")","v":""},{"$f":"F78","v":0},0,{"$f":"E78","v":0},{"$f":"B78","v":0}]
[null,null,null,null,null,null,null,null,null,null,null,null,null,null,null,{"$f":"IF(N80<>0,COUNTIF($N$12:N80,N80),\"\")","v":""}]
[null,null,null,null,null,null,null,null,null,null,null,null,{"$f":"N81&\"_\"&P81","v":"0_"},{"$f":"B81","v":0},{"$f":"L81","v":0},{"$f":"IF(N81<>0,COUNTIF($N$12:N81,N81),\"\")","v":""},{"$f":"F81","v":0},{"$f":"C81","v":0},{"$f":"E81","v":0},{"$f":"B82","v":0}]
[null,null,null,null,null,null,null,null,null,null,null,null,"0_",0,{"$f":"L81","v":0},{"$f":"IF(N82<>0,COUNTIF($N$12:N82,N82),\"\")","v":""},{"$f":"F81","v":0},0,{"$f":"E81","v":0},{"$f":"B81","v":0}]
[null,null,null,null,null,null,null,null,null,null,null,null,"_"]
[null,null,null,null,null,null,null,null,null,null,null,null,"0_",{"$f":"B84","v":0},{"$f":"L84","v":0},{"$f":"IF(N84<>0,COUNTIF($N$12:N84,N84),\"\")","v":""},{"$f":"F84","v":0},{"$f":"C84","v":0},{"$f":"E84","v":0},{"$f":"B85","v":0}]
[null,null,null,null,null,null,null,null,null,null,null,null,"0_",0,{"$f":"L84","v":0},{"$f":"IF(N85<>0,COUNTIF($N$12:N85,N85),\"\")","v":""},{"$f":"F84","v":0},0,{"$f":"E84","v":0},{"$f":"B84","v":0}]
[null,null,null,null,null,null,null,null,null,null,null,null,null,null,null,{"$f":"IF(N86<>0,COUNTIF($N$12:N86,N86),\"\")","v":""}]
[null,null,null,null,null,null,null,null,null,null,null,null,{"$f":"N87&\"_\"&P87","v":"0_"},{"$f":"B87","v":0},{"$f":"L87","v":0},{"$f":"IF(N87<>0,COUNTIF($N$12:N87,N87),\"\")","v":""},{"$f":"F87","v":0},{"$f":"C87","v":0},{"$f":"E87","v":0},{"$f":"B88","v":0}]
[null,null,null,null,null,null,null,null,null,null,null,null,"0_",0,{"$f":"L87","v":0},{"$f":"IF(N88<>0,COUNTIF($N$12:N88,N88),\"\")","v":""},{"$f":"F87","v":0},0,{"$f":"E87","v":0},{"$f":"B87","v":0}]
[null,null,null,null,null,null,null,null,null,null,null,null,"_"]
[null,null,null,null,null,null,null,null,null,null,null,null,"0_",{"$f":"B90","v":0},{"$f":"L90","v":0},{"$f":"IF(N90<>0,COUNTIF($N$12:N90,N90),\"\")","v":""},{"$f":"F90","v":0},{"$f":"C90","v":0},{"$f":"E90","v":0},{"$f":"B91","v":0}]
[null,null,null,null,null,null,null,null,null,null,null,null,"0_",0,{"$f":"L90","v":0},{"$f":"IF(N91<>0,COUNTIF($N$12:N91,N91),\"\")","v":""},{"$f":"F90","v":0},0,{"$f":"E90","v":0},{"$f":"B90","v":0}]
[null,null,null,null,null,null,null,null,null,null,null,null,null,null,null,{"$f":"IF(N92<>0,COUNTIF($N$12:N92,N92),\"\")","v":""}]
[null,null,null,null,null,null,null,null,null,null,null,null,{"$f":"N93&\"_\"&P93","v":"0_"},{"$f":"B93","v":0},{"$f":"L93","v":0},{"$f":"IF(N93<>0,COUNTIF($N$12:N93,N93),\"\")","v":""},{"$f":"F93","v":0},{"$f":"C93","v":0},{"$f":"E93","v":0},{"$f":"B94","v":0}]
[null,null,null,null,null,null,null,null,null,null,null,null,"0_",0,{"$f":"L93","v":0},{"$f":"IF(N94<>0,COUNTIF($N$12:N94,N94),\"\")","v":""},{"$f":"F93","v":0},0,{"$f":"E93","v":0},{"$f":"B93","v":0}]
[null,null,null,null,null,null,null,null,null,null,null,null,"_"]
[null,null,null,null,null,null,null,null,null,null,null,null,"0_",{"$f":"B96","v":0},{"$f":"L96","v":0},{"$f":"IF(N96<>0,COUNTIF($N$12:N96,N96),\"\")","v":""},{"$f":"F96","v":0},{"$f":"C96","v":0},{"$f":"E96","v":0},{"$f":"B97","v":0}]
[null,null,null,null,null,null,null,null,null,null,null,null,"0_",0,{"$f":"L96","v":0},{"$f":"IF(N97<>0,COUNTIF($N$12:N97,N97),\"\")","v":""},{"$f":"F96","v":0},0,{"$f":"E96","v":0},{"$f":"B96","v":0}]
[null,null,null,null,null,null,null,null,null,null,null,null,null,null,null,{"$f":"IF(N98<>0,COUNTIF($N$12:N98,N98),\"\")","v":""}]
[null,null,null,null,null,null,null,null,null,null,null,null,{"$f":"N99&\"_\"&P99","v":"0_"},{"$f":"B99","v":0},{"$f":"L99","v":0},{"$f":"IF(N99<>0,COUNTIF($N$12:N99,N99),\"\")","v":""},{"$f":"F99","v":0},{"$f":"C99","v":0},{"$f":"E99","v":0},{"$f":"B100","v":0}]
[null,null,null,null,null,null,null,null,null,null,null,null,"0_",0,{"$f":"L99","v":0},{"$f":"IF(N100<>0,COUNTIF($N$12:N100,N100),\"\")","v":""},{"$f":"F99","v":0},0,{"$f":"E99","v":0},{"$f":"B99","v":0}]
[null,null,null,null,null,null,null,null,null,null,null,null,"_"]
[null,null,null,null,null,null,null,null,null,null,null,null,"0_",{"$f":"B102","v":0},{"$f":"L102","v":0},{"$f":"IF(N102<>0,COUNTIF($N$12:N102,N102),\"\")","v":""},{"$f":"F102","v":0},{"$f":"C102","v":0},{"$f":"E102","v":0},{"$f":"B103","v":0}]
[null,null,null,null,null,null,null,null,null,null,null,null,"0_",0,{"$f":"L102","v":0},{"$f":"IF(N103<>0,COUNTIF($N$12:N103,N103),\"\")","v":""},{"$f":"F102","v":0},0,{"$f":"E102","v":0},{"$f":"B102","v":0}]
[null,null,null,null,null,null,null,null,null,null,null,null,null,null,null,{"$f":"IF(N104<>0,COUNTIF($N$12:N104,N104),\"\")","v":""}]
[null,null,null,null,null,null,null,null,null,null,null,null,{"$f":"N105&\"_\"&P105","v":"0_"},{"$f":"B105","v":0},{"$f":"L105","v":0},{"$f":"IF(N105<>0,COUNTIF($N$12:N105,N105),\"\")","v":""},{"$f":"F105","v":0},{"$f":"C105","v":0},{"$f":"E105","v":0},{"$f":"B106","v":0}]
[null,null,null,null,null,null,null,null,null,null,null,null,"0_",0,{"$f":"L105","v":0},{"$f":"IF(N106<>0,COUNTIF($N$12:N106,N106),\"\")","v":""},{"$f":"F105","v":0},0,{"$f":"E105","v":0},{"$f":"B105","v":0}]
[null,null,null,null,null,null,null,null,null,null,null,null,"_"]
[null,null,null,null,null,null,null,null,null,null,null,null,"0_",{"$f":"B108","v":0},{"$f":"L108","v":0},{"$f":"IF(N108<>0,COUNTIF($N$12:N108,N108),\"\")","v":""},{"$f":"F108","v":0},{"$f":"C108","v":0},{"$f":"E108","v":0},{"$f":"B109","v":0}]
[null,null,null,null,null,null,null,null,null,null,null,null,"0_",0,{"$f":"L108","v":0},{"$f":"IF(N109<>0,COUNTIF($N$12:N109,N109),\"\")","v":""},{"$f":"F108","v":0},0,{"$f":"E108","v":0},{"$f":"B108","v":0}]

{"sheet":"GRAPHIQUES","index":3,"n_rows":103,"n_cols":44,"rows_kept":103,"cut":false,"hidden":false,"merged":[]}
[]
[null,null,null,null,null,null,null,null,null,null,null,"IP","IT","Perf/25m","Perf/relais",null,null,null,"IP","IT","Perf/25m","Perf/relais",null,null,null,"IP","IT","Perf/25m","Perf/relais",null,null,null,"IP","IT","Perf/25m","Perf/relais",null,null,null,"IP","IT","Perf/25m","Perf/relais"]
[null,null,null,null,null,null,null,null,null,{"$f":"Choixeleves!B5","v":"Rémi"},{"$f":"$J$3&\"_\"&P3","v":"Rémi_1"},{"$f":"IFERROR(VLOOKUP(K3,Choixeleves!$M$12:$Z$157,3,FALSE),\"\")","v":4},{"$f":"IFERROR(VLOOKUP(K3,Choixeleves!$M$12:$Z$157,5,FALSE),\"\")","v":1.4000000000000004},{"$f":"IFERROR(VLOOKUP(K3,Choixeleves!$M$12:$Z$157,6,FALSE),\"\")","v":3.6},{"$f":"IFERROR(VLOOKUP(K3,Choixeleves!$M$12:$Z$157,7,FALSE),\"\")","v":12},1,{"$f":"Choixeleves!B6","v":"Timothée"},{"$f":"$Q$3&\"_\"&W3","v":"Timothée_1"},{"$f":"IFERROR(VLOOKUP(R3,Choixeleves!$M$12:$Z$157,3,FALSE),\"\")","v":""},{"$f":"IFERROR(VLOOKUP(R3,Choixeleves!$M$12:$Z$157,5,FALSE),\"\")","v":""},{"$f":"IFERROR(VLOOKUP(R3,Choixeleves!$M$12:$Z$157,6,FALSE),\"\")","v":""},{"$f":"IFERROR(VLOOKUP(R3,Choixeleves!$M$12:$Z$157,7,FALSE),\"\")","v":""},1,{"$f":"Choixeleves!B7","v":"Virginie"},{"$f":"$X$3&\"_\"&AD3","v":"Virginie_1"},{"$f":"IFERROR(VLOOKUP(Y3,Choixeleves!$M$12:$Z$157,3,FALSE),\"\")","v":4},{"$f":"IFERROR(VLOOKUP(Y3,Choixeleves!$M$12:$Z$157,5,FALSE),\"\")","v":1.4000000000000004},{"$f":"IFERROR(VLOOKUP(Y3,Choixeleves!$M$12:$Z$157,6,FALSE),\"\")","v":7},{"$f":"IFERROR(VLOOKUP(Y3,Choixeleves!$M$12:$Z$157,7,FALSE),\"\")","v":12},1,{"$f":"Choixeleves!B8","v":"Quentin"},{"$f":"$AE$3&\"_\"&AK3","v":"Quentin_1"},{"$f":"IFERROR(VLOOKUP(AF3,Choixeleves!$M$12:$Z$157,3,FALSE),\"\")","v":""},{"$f":"IFERROR(VLOOKUP(AF3,Choixeleves!$M$12:$Z$157,5,FALSE),\"\")","v":""},{"$f":"IFERROR(VLOOKUP(AF3,Choixeleves!$M$12:$Z$157,6,FALSE),\"\")","v":""},{"$f":"IFERROR(VLOOKUP(AF3,Choixeleves!$M$12:$Z$157,7,FALSE),\"\")","v":""},1,{"$f":"Choixeleves!B9","v":"Mick"},{"$f":"$AL$3&\"_\"&AR3","v":"Mick_1"},{"$f":"IFERROR(VLOOKUP(AM3,Choixeleves!$M$12:$Z$157,3,FALSE),\"\")","v":""},{"$f":"IFERROR(VLOOKUP(AM3,Choixeleves!$M$12:$Z$157,5,FALSE),\"\")","v":""},{"$f":"IFERROR(VLOOKUP(AM3,Choixeleves!$M$12:$Z$157,6,FALSE),\"\")","v":""},{"$f":"IFERROR(VLOOKUP(AM3,Choixeleves!$M$12:$Z$157,7,FALSE),\"\")","v":""},1]
[null,null,null,null,null,null,null,null,null,null,{"$f":"$J$3&\"_\"&P4","v":"Rémi_2"},{"$f":"IFERROR(VLOOKUP(K4,Choixeleves!$M$12:$Z$157,3,FALSE),\"\")","v":12},{"$f":"IFERROR(VLOOKUP(K4,Choixeleves!$M$12:$Z$157,5,FALSE),\"\")","v":-2.5999999999999996},{"$f":"IFERROR(VLOOKUP(K4,Choixeleves!$M$12:$Z$157,6,FALSE),\"\")","v":3.6},{"$f":"IFERROR(VLOOKUP(K4,Choixeleves!$M$12:$Z$157,7,FALSE),\"\")","v":8},2,null,{"$f":"$Q$3&\"_\"&W4","v":"Timothée_2"},{"$f":"IFERROR(VLOOKUP(R4,Choixeleves!$M$12:$Z$157,3,FALSE),\"\")","v":""},{"$f":"IFERROR(VLOOKUP(R4,Choixeleves!$M$12:$Z$157,5,FALSE),\"\")","v":""},{"$f":"IFERROR(VLOOKUP(R4,Choixeleves!$M$12:$Z$157,6,FALSE),\"\")","v":""},{"$f":"IFERROR(VLOOKUP(R4,Choixeleves!$M$12:$Z$157,7,FALSE),\"\")","v":""},2,null,{"$f":"$X$3&\"_\"&AD4","v":"Virginie_2"},{"$f":"IFERROR(VLOOKUP(Y4,Choixeleves!$M$12:$Z$157,3,FALSE),\"\")","v":12},{"$f":"IFERROR(VLOOKUP(Y4,Choixeleves!$M$12:$Z$157,5,FALSE),\"\")","v":-2.5999999999999996},{"$f":"IFERROR(VLOOKUP(Y4,Choixeleves!$M$12:$Z$157,6,FALSE),\"\")","v":7},{"$f":"IFERROR(VLOOKUP(Y4,Choixeleves!$M$12:$Z$157,7,FALSE),\"\")","v":8},2,null,{"$f":"$AE$3&\"_\"&AK4","v":"Quentin_2"},{"$f":"IFERROR(VLOOKUP(AF4,Choixeleves!$M$12:$Z$157,3,FALSE),\"\")","v":""},{"$f":"IFERROR(VLOOKUP(AF4,Choixeleves!$M$12:$Z$157,5,FALSE),\"\")","v":""},{"$f":"IFERROR(VLOOKUP(AF4,Choixeleves!$M$12:$Z$157,6,FALSE),\"\")","v":""},{"$f":"IFERROR(VLOOKUP(AF4,Choixeleves!$M$12:$Z$157,7,FALSE),\"\")","v":""},2,null,{"$f":"$AL$3&\"_\"&AR4","v":"Mick_2"},{"$f":"IFERROR(VLOOKUP(AM4,Choixeleves!$M$12:$Z$157,3,FALSE),\"\")","v":""},{"$f":"IFERROR(VLOOKUP(AM4,Choixeleves!$M$12:$Z$157,5,FALSE),\"\")","v":""},{"$f":"IFERROR(VLOOKUP(AM4,Choixeleves!$M$12:$Z$157,6,FALSE),\"\")","v":""},{"$f":"IFERROR(VLOOKUP(AM4,Choixeleves!$M$12:$Z$157,7,FALSE),\"\")","v":""},2]
[null,null,null,null,null,null,null,null,null,null,"Rémi_3",{"$f":"IFERROR(VLOOKUP(K5,Choixeleves!$M$12:$Z$157,3,FALSE),\"\")","v":12},{"$f":"IFERROR(VLOOKUP(K5,Choixeleves!$M$12:$Z$157,5,FALSE),\"\")","v":-3.6},{"$f":"IFERROR(VLOOKUP(K5,Choixeleves!$M$12:$Z$157,6,FALSE),\"\")","v":3.6},{"$f":"IFERROR(VLOOKUP(K5,Choixeleves!$M$12:$Z$157,7,FALSE),\"\")","v":0},3,null,"Timothée_3",{"$f":"IFERROR(VLOOKUP(R5,Choixeleves!$M$12:$Z$157,3,FALSE),\"\")","v":""},{"$f":"IFERROR(VLOOKUP(R5,Choixeleves!$M$12:$Z$157,5,FALSE),\"\")","v":""},{"$f":"IFERROR(VLOOKUP(R5,Choixeleves!$M$12:$Z$157,6,FALSE),\"\")","v":""},{"$f":"IFERROR(VLOOKUP(R5,Choixeleves!$M$12:$Z$157,7,FALSE),\"\")","v":""},3,null,"Virginie_3",{"$f":"IFERROR(VLOOKUP(Y5,Choixeleves!$M$12:$Z$157,3,FALSE),\"\")","v":""},{"$f":"IFERROR(VLOOKUP(Y5,Choixeleves!$M$12:$Z$157,5,FALSE),\"\")","v":""},{"$f":"IFERROR(VLOOKUP(Y5,Choixeleves!$M$12:$Z$157,6,FALSE),\"\")","v":""},{"$f":"IFERROR(VLOOKUP(Y5,Choixeleves!$M$12:$Z$157,7,FALSE),\"\")","v":""},3,null,"Quentin_3",{"$f":"IFERROR(VLOOKUP(AF5,Choixeleves!$M$12:$Z$157,3,FALSE),\"\")","v":""},{"$f":"IFERROR(VLOOKUP(AF5,Choixeleves!$M$12:$Z$157,5,FALSE),\"\")","v":""},{"$f":"IFERROR(VLOOKUP(AF5,Choixeleves!$M$12:$Z$157,6,FALSE),\"\")","v":""},{"$f":"IFERROR(VLOOKUP(AF5,Choixeleves!$M$12:$Z$157,7,FALSE),\"\")","v":""},3,null,"Mick_3",{"$f":"IFERROR(VLOOKUP(AM5,Choixeleves!$M$12:$Z$157,3,FALSE),\"\")","v":""},{"$f":"IFERROR(VLOOKUP(AM5,Choixeleves!$M$12:$Z$157,5,FALSE),\"\")","v":""},{"$f":"IFERROR(VLOOKUP(AM5,Choixeleves!$M$12:$Z$157,6,FALSE),\"\")","v":""},{"$f":"IFERROR(VLOOKUP(AM5,Choixeleves!$M$12:$Z$157,7,FALSE),\"\")","v":""},3]
[null,null,null,null,null,null,null,null,null,null,"Rémi_4",{"$f":"IFERROR(VLOOKUP(K6,Choixeleves!$M$12:$Z$157,3,FALSE),\"\")","v":12},{"$f":"IFERROR(VLOOKUP(K6,Choixeleves!$M$12:$Z$157,5,FALSE),\"\")","v":-3.6},{"$f":"IFERROR(VLOOKUP(K6,Choixeleves!$M$12:$Z$157,6,FALSE),\"\")","v":3.6},{"$f":"IFERROR(VLOOKUP(K6,Choixeleves!$M$12:$Z$157,7,FALSE),\"\")","v":0},4,null,"Timothée_4",{"$f":"IFERROR(VLOOKUP(R6,Choixeleves!$M$12:$Z$157,3,FALSE),\"\")","v":""},{"$f":"IFERROR(VLOOKUP(R6,Choixeleves!$M$12:$Z$157,5,FALSE),\"\")","v":""},{"$f":"IFERROR(VLOOKUP(R6,Choixeleves!$M$12:$Z$157,6,FALSE),\"\")","v":""},{"$f":"IFERROR(VLOOKUP(R6,Choixeleves!$M$12:$Z$157,7,FALSE),\"\")","v":""},4,null,"Virginie_4",{"$f":"IFERROR(VLOOKUP(Y6,Choixeleves!$M$12:$Z$157,3,FALSE),\"\")","v":""},{"$f":"IFERROR(VLOOKUP(Y6,Choixeleves!$M$12:$Z$157,5,FALSE),\"\")","v":""},{"$f":"IFERROR(VLOOKUP(Y6,Choixeleves!$M$12:$Z$157,6,FALSE),\"\")","v":""},{"$f":"IFERROR(VLOOKUP(Y6,Choixeleves!$M$12:$Z$157,7,FALSE),\"\")","v":""},4,null,"Quentin_4",{"$f":"IFERROR(VLOOKUP(AF6,Choixeleves!$M$12:$Z$157,3,FALSE),\"\")","v":""},{"$f":"IFERROR(VLOOKUP(AF6,Choixeleves!$M$12:$Z$157,5,FALSE),\"\")","v":""},{"$f":"IFERROR(VLOOKUP(AF6,Choixeleves!$M$12:$Z$157,6,FALSE),\"\")","v":""},{"$f":"IFERROR(VLOOKUP(AF6,Choixeleves!$M$12:$Z$157,7,FALSE),\"\")","v":""},4,null,"Mick_4",{"$f":"IFERROR(VLOOKUP(AM6,Choixeleves!$M$12:$Z$157,3,FALSE),\"\")","v":""},{"$f":"IFERROR(VLOOKUP(AM6,Choixeleves!$M$12:$Z$157,5,FALSE),\"\")","v":""},{"$f":"IFERROR(VLOOKUP(AM6,Choixeleves!$M$12:$Z$157,6,FALSE),\"\")","v":""},{"$f":"IFERROR(VLOOKUP(AM6,Choixeleves!$M$12:$Z$157,7,FALSE),\"\")","v":""},4]
[null,null,null,null,null,null,null,null,null,null,"Rémi_5",{"$f":"IFERROR(VLOOKUP(K7,Choixeleves!$M$12:$Z$157,3,FALSE),\"\")","v":""},{"$f":"IFERROR(VLOOKUP(K7,Choixeleves!$M$12:$Z$157,5,FALSE),\"\")","v":""},{"$f":"IFERROR(VLOOKUP(K7,Choixeleves!$M$12:$Z$157,6,FALSE),\"\")","v":""},{"$f":"IFERROR(VLOOKUP(K7,Choixeleves!$M$12:$Z$157,7,FALSE),\"\")","v":""},5,null,"Timothée_5",{"$f":"IFERROR(VLOOKUP(R7,Choixeleves!$M$12:$Z$157,3,FALSE),\"\")","v":""},{"$f":"IFERROR(VLOOKUP(R7,Choixeleves!$M$12:$Z$157,5,FALSE),\"\")","v":""},{"$f":"IFERROR(VLOOKUP(R7,Choixeleves!$M$12:$Z$157,6,FALSE),\"\")","v":""},{"$f":"IFERROR(VLOOKUP(R7,Choixeleves!$M$12:$Z$157,7,FALSE),\"\")","v":""},5,null,"Virginie_5",{"$f":"IFERROR(VLOOKUP(Y7,Choixeleves!$M$12:$Z$157,3,FALSE),\"\")","v":""},{"$f":"IFERROR(VLOOKUP(Y7,Choixeleves!$M$12:$Z$157,5,FALSE),\"\")","v":""},{"$f":"IFERROR(VLOOKUP(Y7,Choixeleves!$M$12:$Z$157,6,FALSE),\"\")","v":""},{"$f":"IFERROR(VLOOKUP(Y7,Choixeleves!$M$12:$Z$157,7,FALSE),\"\")","v":""},5,null,"Quentin_5",{"$f":"IFERROR(VLOOKUP(AF7,Choixeleves!$M$12:$Z$157,3,FALSE),\"\")","v":""},{"$f":"IFERROR(VLOOKUP(AF7,Choixeleves!$M$12:$Z$157,5,FALSE),\"\")","v":""},{"$f":"IFERROR(VLOOKUP(AF7,Choixeleves!$M$12:$Z$157,6,FALSE),\"\")","v":""},{"$f":"IFERROR(VLOOKUP(AF7,Choixeleves!$M$12:$Z$157,7,FALSE),\"\")","v":""},5,null,"Mick_5",{"$f":"IFERROR(VLOOKUP(AM7,Choixeleves!$M$12:$Z$157,3,FALSE),\"\")","v":""},{"$f":"IFERROR(VLOOKUP(AM7,Choixeleves!$M$12:$Z$157,5,FALSE),\"\")","v":""},{"$f":"IFERROR(VLOOKUP(AM7,Choixeleves!$M$12:$Z$157,6,FALSE),\"\")","v":""},{"$f":"IFERROR(VLOOKUP(AM7,Choixeleves!$M$12:$Z$157,7,FALSE),\"\")","v":""},5]
[null,null,null,null,null,null,null,null,null,null,"Rémi_6",{"$f":"IFERROR(VLOOKUP(K8,Choixeleves!$M$12:$Z$157,3,FALSE),\"\")","v":""},{"$f":"IFERROR(VLOOKUP(K8,Choixeleves!$M$12:$Z$157,5,FALSE),\"\")","v":""},{"$f":"IFERROR(VLOOKUP(K8,Choixeleves!$M$12:$Z$157,6,FALSE),\"\")","v":""},{"$f":"IFERROR(VLOOKUP(K8,Choixeleves!$M$12:$Z$157,7,FALSE),\"\")","v":""},6,null,"Timothée_6",{"$f":"IFERROR(VLOOKUP(R8,Choixeleves!$M$12:$Z$157,3,FALSE),\"\")","v":""},{"$f":"IFERROR(VLOOKUP(R8,Choixeleves!$M$12:$Z$157,5,FALSE),\"\")","v":""},{"$f":"IFERROR(VLOOKUP(R8,Choixeleves!$M$12:$Z$157,6,FALSE),\"\")","v":""},{"$f":"IFERROR(VLOOKUP(R8,Choixeleves!$M$12:$Z$157,7,FALSE),\"\")","v":""},6,null,"Virginie_6",{"$f":"IFERROR(VLOOKUP(Y8,Choixeleves!$M$12:$Z$157,3,FALSE),\"\")","v":""},{"$f":"IFERROR(VLOOKUP(Y8,Choixeleves!$M$12:$Z$157,5,FALSE),\"\")","v":""},{"$f":"IFERROR(VLOOKUP(Y8,Choixeleves!$M$12:$Z$157,6,FALSE),\"\")","v":""},{"$f":"IFERROR(VLOOKUP(Y8,Choixeleves!$M$12:$Z$157,7,FALSE),\"\")","v":""},6,null,"Quentin_6",{"$f":"IFERROR(VLOOKUP(AF8,Choixeleves!$M$12:$Z$157,3,FALSE),\"\")","v":""},{"$f":"IFERROR(VLOOKUP(AF8,Choixeleves!$M$12:$Z$157,5,FALSE),\"\")","v":""},{"$f":"IFERROR(VLOOKUP(AF8,Choixeleves!$M$12:$Z$157,6,FALSE),\"\")","v":""},{"$f":"IFERROR(VLOOKUP(AF8,Choixeleves!$M$12:$Z$157,7,FALSE),\"\")","v":""},6,null,"Mick_6",{"$f":"IFERROR(VLOOKUP(AM8,Choixeleves!$M$12:$Z$157,3,FALSE),\"\")","v":""},{"$f":"IFERROR(VLOOKUP(AM8,Choixeleves!$M$12:$Z$157,5,FALSE),\"\")","v":""},{"$f":"IFERROR(VLOOKUP(AM8,Choixeleves!$M$12:$Z$157,6,FALSE),\"\")","v":""},{"$f":"IFERROR(VLOOKUP(AM8,Choixeleves!$M$12:$Z$157,7,FALSE),\"\")","v":""},6]
[null,null,null,null,null,null,null,null,null,null,"Rémi_7",{"$f":"IFERROR(VLOOKUP(K9,Choixeleves!$M$12:$Z$157,3,FALSE),\"\")","v":""},{"$f":"IFERROR(VLOOKUP(K9,Choixeleves!$M$12:$Z$157,5,FALSE),\"\")","v":""},{"$f":"IFERROR(VLOOKUP(K9,Choixeleves!$M$12:$Z$157,6,FALSE),\"\")","v":""},{"$f":"IFERROR(VLOOKUP(K9,Choixeleves!$M$12:$Z$157,7,FALSE),\"\")","v":""},7,null,"Timothée_7",{"$f":"IFERROR(VLOOKUP(R9,Choixeleves!$M$12:$Z$157,3,FALSE),\"\")","v":""},{"$f":"IFERROR(VLOOKUP(R9,Choixeleves!$M$12:$Z$157,5,FALSE),\"\")","v":""},{"$f":"IFERROR(VLOOKUP(R9,Choixeleves!$M$12:$Z$157,6,FALSE),\"\")","v":""},{"$f":"IFERROR(VLOOKUP(R9,Choixeleves!$M$12:$Z$157,7,FALSE),\"\")","v":""},7,null,"Virginie_7",{"$f":"IFERROR(VLOOKUP(Y9,Choixeleves!$M$12:$Z$157,3,FALSE),\"\")","v":""},{"$f":"IFERROR(VLOOKUP(Y9,Choixeleves!$M$12:$Z$157,5,FALSE),\"\")","v":""},{"$f":"IFERROR(VLOOKUP(Y9,Choixeleves!$M$12:$Z$157,6,FALSE),\"\")","v":""},{"$f":"IFERROR(VLOOKUP(Y9,Choixeleves!$M$12:$Z$157,7,FALSE),\"\")","v":""},7,null,"Quentin_7",{"$f":"IFERROR(VLOOKUP(AF9,Choixeleves!$M$12:$Z$157,3,FALSE),\"\")","v":""},{"$f":"IFERROR(VLOOKUP(AF9,Choixeleves!$M$12:$Z$157,5,FALSE),\"\")","v":""},{"$f":"IFERROR(VLOOKUP(AF9,Choixeleves!$M$12:$Z$157,6,FALSE),\"\")","v":""},{"$f":"IFERROR(VLOOKUP(AF9,Choixeleves!$M$12:$Z$157,7,FALSE),\"\")","v":""},7,null,"Mick_7",{"$f":"IFERROR(VLOOKUP(AM9,Choixeleves!$M$12:$Z$157,3,FALSE),\"\")","v":""},{"$f":"IFERROR(VLOOKUP(AM9,Choixeleves!$M$12:$Z$157,5,FALSE),\"\")","v":""},{"$f":"IFERROR(VLOOKUP(AM9,Choixeleves!$M$12:$Z$157,6,FALSE),\"\")","v":""},{"$f":"IFERROR(VLOOKUP(AM9,Choixeleves!$M$12:$Z$157,7,FALSE),\"\")","v":""},7]
[null,null,null,null,null,null,null,null,null,null,"Rémi_8",{"$f":"IFERROR(VLOOKUP(K10,Choixeleves!$M$12:$Z$157,3,FALSE),\"\")","v":""},{"$f":"IFERROR(VLOOKUP(K10,Choixeleves!$M$12:$Z$157,5,FALSE),\"\")","v":""},{"$f":"IFERROR(VLOOKUP(K10,Choixeleves!$M$12:$Z$157,6,FALSE),\"\")","v":""},{"$f":"IFERROR(VLOOKUP(K10,Choixeleves!$M$12:$Z$157,7,FALSE),\"\")","v":""},8,null,"Timothée_8",{"$f":"IFERROR(VLOOKUP(R10,Choixeleves!$M$12:$Z$157,3,FALSE),\"\")","v":""},{"$f":"IFERROR(VLOOKUP(R10,Choixeleves!$M$12:$Z$157,5,FALSE),\"\")","v":""},{"$f":"IFERROR(VLOOKUP(R10,Choixeleves!$M$12:$Z$157,6,FALSE),\"\")","v":""},{"$f":"IFERROR(VLOOKUP(R10,Choixeleves!$M$12:$Z$157,7,FALSE),\"\")","v":""},8,null,"Virginie_8",{"$f":"IFERROR(VLOOKUP(Y10,Choixeleves!$M$12:$Z$157,3,FALSE),\"\")","v":""},{"$f":"IFERROR(VLOOKUP(Y10,Choixeleves!$M$12:$Z$157,5,FALSE),\"\")","v":""},{"$f":"IFERROR(VLOOKUP(Y10,Choixeleves!$M$12:$Z$157,6,FALSE),\"\")","v":""},{"$f":"IFERROR(VLOOKUP(Y10,Choixeleves!$M$12:$Z$157,7,FALSE),\"\")","v":""},8,null,"Quentin_8",{"$f":"IFERROR(VLOOKUP(AF10,Choixeleves!$M$12:$Z$157,3,FALSE),\"\")","v":""},{"$f":"IFERROR(VLOOKUP(AF10,Choixeleves!$M$12:$Z$157,5,FALSE),\"\")","v":""},{"$f":"IFERROR(VLOOKUP(AF10,Choixeleves!$M$12:$Z$157,6,FALSE),\"\")","v":""},{"$f":"IFERROR(VLOOKUP(AF10,Choixeleves!$M$12:$Z$157,7,FALSE),\"\")","v":""},8,null,"Mick_8",{"$f":"IFERROR(VLOOKUP(AM10,Choixeleves!$M$12:$Z$157,3,FALSE),\"\")","v":""},{"$f":"IFERROR(VLOOKUP(AM10,Choixeleves!$M$12:$Z$157,5,FALSE),\"\")","v":""},{"$f":"IFERROR(VLOOKUP(AM10,Choixeleves!$M$12:$Z$157,6,FALSE),\"\")","v":""},{"$f":"IFERROR(VLOOKUP(AM10,Choixeleves!$M$12:$Z$157,7,FALSE),\"\")","v":""},8]
[null,null,null,null,null,null,null,null,null,null,"Rémi_9",{"$f":"IFERROR(VLOOKUP(K11,Choixeleves!$M$12:$Z$157,3,FALSE),\"\")","v":""},{"$f":"IFERROR(VLOOKUP(K11,Choixeleves!$M$12:$Z$157,5,FALSE),\"\")","v":""},{"$f":"IFERROR(VLOOKUP(K11,Choixeleves!$M$12:$Z$157,6,FALSE),\"\")","v":""},{"$f":"IFERROR(VLOOKUP(K11,Choixeleves!$M$12:$Z$157,7,FALSE),\"\")","v":""},9,null,"Timothée_9",{"$f":"IFERROR(VLOOKUP(R11,Choixeleves!$M$12:$Z$157,3,FALSE),\"\")","v":""},{"$f":"IFERROR(VLOOKUP(R11,Choixeleves!$M$12:$Z$157,5,FALSE),\"\")","v":""},{"$f":"IFERROR(VLOOKUP(R11,Choixeleves!$M$12:$Z$157,6,FALSE),\"\")","v":""},{"$f":"IFERROR(VLOOKUP(R11,Choixeleves!$M$12:$Z$157,7,FALSE),\"\")","v":""},9,null,"Virginie_9",{"$f":"IFERROR(VLOOKUP(Y11,Choixeleves!$M$12:$Z$157,3,FALSE),\"\")","v":""},{"$f":"IFERROR(VLOOKUP(Y11,Choixeleves!$M$12:$Z$157,5,FALSE),\"\")","v":""},{"$f":"IFERROR(VLOOKUP(Y11,Choixeleves!$M$12:$Z$157,6,FALSE),\"\")","v":""},{"$f":"IFERROR(VLOOKUP(Y11,Choixeleves!$M$12:$Z$157,7,FALSE),\"\")","v":""},9,null,"Quentin_9",{"$f":"IFERROR(VLOOKUP(AF11,Choixeleves!$M$12:$Z$157,3,FALSE),\"\")","v":""},{"$f":"IFERROR(VLOOKUP(AF11,Choixeleves!$M$12:$Z$157,5,FALSE),\"\")","v":""},{"$f":"IFERROR(VLOOKUP(AF11,Choixeleves!$M$12:$Z$157,6,FALSE),\"\")","v":""},{"$f":"IFERROR(VLOOKUP(AF11,Choixeleves!$M$12:$Z$157,7,FALSE),\"\")","v":""},9,null,"Mick_9",{"$f":"IFERROR(VLOOKUP(AM11,Choixeleves!$M$12:$Z$157,3,FALSE),\"\")","v":""},{"$f":"IFERROR(VLOOKUP(AM11,Choixeleves!$M$12:$Z$157,5,FALSE),\"\")","v":""},{"$f":"IFERROR(VLOOKUP(AM11,Choixeleves!$M$12:$Z$157,6,FALSE),\"\")","v":""},{"$f":"IFERROR(VLOOKUP(AM11,Choixeleves!$M$12:$Z$157,7,FALSE),\"\")","v":""},9]
[null,null,null,null,null,null,null,null,null,null,"Rémi_10",{"$f":"IFERROR(VLOOKUP(K12,Choixeleves!$M$12:$Z$157,3,FALSE),\"\")","v":""},{"$f":"IFERROR(VLOOKUP(K12,Choixeleves!$M$12:$Z$157,5,FALSE),\"\")","v":""},{"$f":"IFERROR(VLOOKUP(K12,Choixeleves!$M$12:$Z$157,6,FALSE),\"\")","v":""},{"$f":"IFERROR(VLOOKUP(K12,Choixeleves!$M$12:$Z$157,7,FALSE),\"\")","v":""},10,null,"Timothée_10",{"$f":"IFERROR(VLOOKUP(R12,Choixeleves!$M$12:$Z$157,3,FALSE),\"\")","v":""},{"$f":"IFERROR(VLOOKUP(R12,Choixeleves!$M$12:$Z$157,5,FALSE),\"\")","v":""},{"$f":"IFERROR(VLOOKUP(R12,Choixeleves!$M$12:$Z$157,6,FALSE),\"\")","v":""},{"$f":"IFERROR(VLOOKUP(R12,Choixeleves!$M$12:$Z$157,7,FALSE),\"\")","v":""},10,null,"Virginie_10",{"$f":"IFERROR(VLOOKUP(Y12,Choixeleves!$M$12:$Z$157,3,FALSE),\"\")","v":""},{"$f":"IFERROR(VLOOKUP(Y12,Choixeleves!$M$12:$Z$157,5,FALSE),\"\")","v":""},{"$f":"IFERROR(VLOOKUP(Y12,Choixeleves!$M$12:$Z$157,6,FALSE),\"\")","v":""},{"$f":"IFERROR(VLOOKUP(Y12,Choixeleves!$M$12:$Z$157,7,FALSE),\"\")","v":""},10,null,"Quentin_10",{"$f":"IFERROR(VLOOKUP(AF12,Choixeleves!$M$12:$Z$157,3,FALSE),\"\")","v":""},{"$f":"IFERROR(VLOOKUP(AF12,Choixeleves!$M$12:$Z$157,5,FALSE),\"\")","v":""},{"$f":"IFERROR(VLOOKUP(AF12,Choixeleves!$M$12:$Z$157,6,FALSE),\"\")","v":""},{"$f":"IFERROR(VLOOKUP(AF12,Choixeleves!$M$12:$Z$157,7,FALSE),\"\")","v":""},10,null,"Mick_10",{"$f":"IFERROR(VLOOKUP(AM12,Choixeleves!$M$12:$Z$157,3,FALSE),\"\")","v":""},{"$f":"IFERROR(VLOOKUP(AM12,Choixeleves!$M$12:$Z$157,5,FALSE),\"\")","v":""},{"$f":"IFERROR(VLOOKUP(AM12,Choixeleves!$M$12:$Z$157,6,FALSE),\"\")","v":""},{"$f":"IFERROR(VLOOKUP(AM12,Choixeleves!$M$12:$Z$157,7,FALSE),\"\")","v":""},10]
[null,null,null,null,null,null,null,null,null,null,"Rémi_11",{"$f":"IFERROR(VLOOKUP(K13,Choixeleves!$M$12:$Z$157,3,FALSE),\"\")","v":""},{"$f":"IFERROR(VLOOKUP(K13,Choixeleves!$M$12:$Z$157,5,FALSE),\"\")","v":""},{"$f":"IFERROR(VLOOKUP(K13,Choixeleves!$M$12:$Z$157,6,FALSE),\"\")","v":""},{"$f":"IFERROR(VLOOKUP(K13,Choixeleves!$M$12:$Z$157,7,FALSE),\"\")","v":""},11,null,"Timothée_11",{"$f":"IFERROR(VLOOKUP(R13,Choixeleves!$M$12:$Z$157,3,FALSE),\"\")","v":""},{"$f":"IFERROR(VLOOKUP(R13,Choixeleves!$M$12:$Z$157,5,FALSE),\"\")","v":""},{"$f":"IFERROR(VLOOKUP(R13,Choixeleves!$M$12:$Z$157,6,FALSE),\"\")","v":""},{"$f":"IFERROR(VLOOKUP(R13,Choixeleves!$M$12:$Z$157,7,FALSE),\"\")","v":""},11,null,"Virginie_11",{"$f":"IFERROR(VLOOKUP(Y13,Choixeleves!$M$12:$Z$157,3,FALSE),\"\")","v":""},{"$f":"IFERROR(VLOOKUP(Y13,Choixeleves!$M$12:$Z$157,5,FALSE),\"\")","v":""},{"$f":"IFERROR(VLOOKUP(Y13,Choixeleves!$M$12:$Z$157,6,FALSE),\"\")","v":""},{"$f":"IFERROR(VLOOKUP(Y13,Choixeleves!$M$12:$Z$157,7,FALSE),\"\")","v":""},11,null,"Quentin_11",{"$f":"IFERROR(VLOOKUP(AF13,Choixeleves!$M$12:$Z$157,3,FALSE),\"\")","v":""},{"$f":"IFERROR(VLOOKUP(AF13,Choixeleves!$M$12:$Z$157,5,FALSE),\"\")","v":""},{"$f":"IFERROR(VLOOKUP(AF13,Choixeleves!$M$12:$Z$157,6,FALSE),\"\")","v":""},{"$f":"IFERROR(VLOOKUP(AF13,Choixeleves!$M$12:$Z$157,7,FALSE),\"\")","v":""},11,null,"Mick_11",{"$f":"IFERROR(VLOOKUP(AM13,Choixeleves!$M$12:$Z$157,3,FALSE),\"\")","v":""},{"$f":"IFERROR(VLOOKUP(AM13,Choixeleves!$M$12:$Z$157,5,FALSE),\"\")","v":""},{"$f":"IFERROR(VLOOKUP(AM13,Choixeleves!$M$12:$Z$157,6,FALSE),\"\")","v":""},{"$f":"IFERROR(VLOOKUP(AM13,Choixeleves!$M$12:$Z$157,7,FALSE),\"\")","v":""},11]
[null,null,null,null,null,null,null,null,null,null,"Rémi_12",{"$f":"IFERROR(VLOOKUP(K14,Choixeleves!$M$12:$Z$157,3,FALSE),\"\")","v":""},{"$f":"IFERROR(VLOOKUP(K14,Choixeleves!$M$12:$Z$157,5,FALSE),\"\")","v":""},{"$f":"IFERROR(VLOOKUP(K14,Choixeleves!$M$12:$Z$157,6,FALSE),\"\")","v":""},{"$f":"IFERROR(VLOOKUP(K14,Choixeleves!$M$12:$Z$157,7,FALSE),\"\")","v":""},12,null,"Timothée_12",{"$f":"IFERROR(VLOOKUP(R14,Choixeleves!$M$12:$Z$157,3,FALSE),\"\")","v":""},{"$f":"IFERROR(VLOOKUP(R14,Choixeleves!$M$12:$Z$157,5,FALSE),\"\")","v":""},{"$f":"IFERROR(VLOOKUP(R14,Choixeleves!$M$12:$Z$157,6,FALSE),\"\")","v":""},{"$f":"IFERROR(VLOOKUP(R14,Choixeleves!$M$12:$Z$157,7,FALSE),\"\")","v":""},12,null,"Virginie_12",{"$f":"IFERROR(VLOOKUP(Y14,Choixeleves!$M$12:$Z$157,3,FALSE),\"\")","v":""},{"$f":"IFERROR(VLOOKUP(Y14,Choixeleves!$M$12:$Z$157,5,FALSE),\"\")","v":""},{"$f":"IFERROR(VLOOKUP(Y14,Choixeleves!$M$12:$Z$157,6,FALSE),\"\")","v":""},{"$f":"IFERROR(VLOOKUP(Y14,Choixeleves!$M$12:$Z$157,7,FALSE),\"\")","v":""},12,null,"Quentin_12",{"$f":"IFERROR(VLOOKUP(AF14,Choixeleves!$M$12:$Z$157,3,FALSE),\"\")","v":""},{"$f":"IFERROR(VLOOKUP(AF14,Choixeleves!$M$12:$Z$157,5,FALSE),\"\")","v":""},{"$f":"IFERROR(VLOOKUP(AF14,Choixeleves!$M$12:$Z$157,6,FALSE),\"\")","v":""},{"$f":"IFERROR(VLOOKUP(AF14,Choixeleves!$M$12:$Z$157,7,FALSE),\"\")","v":""},12,null,"Mick_12",{"$f":"IFERROR(VLOOKUP(AM14,Choixeleves!$M$12:$Z$157,3,FALSE),\"\")","v":""},{"$f":"IFERROR(VLOOKUP(AM14,Choixeleves!$M$12:$Z$157,5,FALSE),\"\")","v":""},{"$f":"IFERROR(VLOOKUP(AM14,Choixeleves!$M$12:$Z$157,6,FALSE),\"\")","v":""},{"$f":"IFERROR(VLOOKUP(AM14,Choixeleves!$M$12:$Z$157,7,FALSE),\"\")","v":""},12]
[null,null,null,null,null,null,null,null,null,null,"Rémi_13",{"$f":"IFERROR(VLOOKUP(K15,Choixeleves!$M$12:$Z$157,3,FALSE),\"\")","v":""},{"$f":"IFERROR(VLOOKUP(K15,Choixeleves!$M$12:$Z$157,5,FALSE),\"\")","v":""},{"$f":"IFERROR(VLOOKUP(K15,Choixeleves!$M$12:$Z$157,6,FALSE),\"\")","v":""},{"$f":"IFERROR(VLOOKUP(K15,Choixeleves!$M$12:$Z$157,7,FALSE),\"\")","v":""},13,null,"Timothée_13",{"$f":"IFERROR(VLOOKUP(R15,Choixeleves!$M$12:$Z$157,3,FALSE),\"\")","v":""},{"$f":"IFERROR(VLOOKUP(R15,Choixeleves!$M$12:$Z$157,5,FALSE),\"\")","v":""},{"$f":"IFERROR(VLOOKUP(R15,Choixeleves!$M$12:$Z$157,6,FALSE),\"\")","v":""},{"$f":"IFERROR(VLOOKUP(R15,Choixeleves!$M$12:$Z$157,7,FALSE),\"\")","v":""},13,null,"Virginie_13",{"$f":"IFERROR(VLOOKUP(Y15,Choixeleves!$M$12:$Z$157,3,FALSE),\"\")","v":""},{"$f":"IFERROR(VLOOKUP(Y15,Choixeleves!$M$12:$Z$157,5,FALSE),\"\")","v":""},{"$f":"IFERROR(VLOOKUP(Y15,Choixeleves!$M$12:$Z$157,6,FALSE),\"\")","v":""},{"$f":"IFERROR(VLOOKUP(Y15,Choixeleves!$M$12:$Z$157,7,FALSE),\"\")","v":""},13,null,"Quentin_13",{"$f":"IFERROR(VLOOKUP(AF15,Choixeleves!$M$12:$Z$157,3,FALSE),\"\")","v":""},{"$f":"IFERROR(VLOOKUP(AF15,Choixeleves!$M$12:$Z$157,5,FALSE),\"\")","v":""},{"$f":"IFERROR(VLOOKUP(AF15,Choixeleves!$M$12:$Z$157,6,FALSE),\"\")","v":""},{"$f":"IFERROR(VLOOKUP(AF15,Choixeleves!$M$12:$Z$157,7,FALSE),\"\")","v":""},13,null,"Mick_13",{"$f":"IFERROR(VLOOKUP(AM15,Choixeleves!$M$12:$Z$157,3,FALSE),\"\")","v":""},{"$f":"IFERROR(VLOOKUP(AM15,Choixeleves!$M$12:$Z$157,5,FALSE),\"\")","v":""},{"$f":"IFERROR(VLOOKUP(AM15,Choixeleves!$M$12:$Z$157,6,FALSE),\"\")","v":""},{"$f":"IFERROR(VLOOKUP(AM15,Choixeleves!$M$12:$Z$157,7,FALSE),\"\")","v":""},13]
[null,null,null,null,null,null,null,null,null,null,"Rémi_14",{"$f":"IFERROR(VLOOKUP(K16,Choixeleves!$M$12:$Z$157,3,FALSE),\"\")","v":""},{"$f":"IFERROR(VLOOKUP(K16,Choixeleves!$M$12:$Z$157,5,FALSE),\"\")","v":""},{"$f":"IFERROR(VLOOKUP(K16,Choixeleves!$M$12:$Z$157,6,FALSE),\"\")","v":""},{"$f":"IFERROR(VLOOKUP(K16,Choixeleves!$M$12:$Z$157,7,FALSE),\"\")","v":""},14,null,"Timothée_14",{"$f":"IFERROR(VLOOKUP(R16,Choixeleves!$M$12:$Z$157,3,FALSE),\"\")","v":""},{"$f":"IFERROR(VLOOKUP(R16,Choixeleves!$M$12:$Z$157,5,FALSE),\"\")","v":""},{"$f":"IFERROR(VLOOKUP(R16,Choixeleves!$M$12:$Z$157,6,FALSE),\"\")","v":""},{"$f":"IFERROR(VLOOKUP(R16,Choixeleves!$M$12:$Z$157,7,FALSE),\"\")","v":""},14,null,"Virginie_14",{"$f":"IFERROR(VLOOKUP(Y16,Choixeleves!$M$12:$Z$157,3,FALSE),\"\")","v":""},{"$f":"IFERROR(VLOOKUP(Y16,Choixeleves!$M$12:$Z$157,5,FALSE),\"\")","v":""},{"$f":"IFERROR(VLOOKUP(Y16,Choixeleves!$M$12:$Z$157,6,FALSE),\"\")","v":""},{"$f":"IFERROR(VLOOKUP(Y16,Choixeleves!$M$12:$Z$157,7,FALSE),\"\")","v":""},14,null,"Quentin_14",{"$f":"IFERROR(VLOOKUP(AF16,Choixeleves!$M$12:$Z$157,3,FALSE),\"\")","v":""},{"$f":"IFERROR(VLOOKUP(AF16,Choixeleves!$M$12:$Z$157,5,FALSE),\"\")","v":""},{"$f":"IFERROR(VLOOKUP(AF16,Choixeleves!$M$12:$Z$157,6,FALSE),\"\")","v":""},{"$f":"IFERROR(VLOOKUP(AF16,Choixeleves!$M$12:$Z$157,7,FALSE),\"\")","v":""},14,null,"Mick_14",{"$f":"IFERROR(VLOOKUP(AM16,Choixeleves!$M$12:$Z$157,3,FALSE),\"\")","v":""},{"$f":"IFERROR(VLOOKUP(AM16,Choixeleves!$M$12:$Z$157,5,FALSE),\"\")","v":""},{"$f":"IFERROR(VLOOKUP(AM16,Choixeleves!$M$12:$Z$157,6,FALSE),\"\")","v":""},{"$f":"IFERROR(VLOOKUP(AM16,Choixeleves!$M$12:$Z$157,7,FALSE),\"\")","v":""},14]
[null,null,null,null,null,null,null,null,null,null,"Rémi_15",{"$f":"IFERROR(VLOOKUP(K17,Choixeleves!$M$12:$Z$157,3,FALSE),\"\")","v":""},{"$f":"IFERROR(VLOOKUP(K17,Choixeleves!$M$12:$Z$157,5,FALSE),\"\")","v":""},{"$f":"IFERROR(VLOOKUP(K17,Choixeleves!$M$12:$Z$157,6,FALSE),\"\")","v":""},{"$f":"IFERROR(VLOOKUP(K17,Choixeleves!$M$12:$Z$157,7,FALSE),\"\")","v":""},15,null,"Timothée_15",{"$f":"IFERROR(VLOOKUP(R17,Choixeleves!$M$12:$Z$157,3,FALSE),\"\")","v":""},{"$f":"IFERROR(VLOOKUP(R17,Choixeleves!$M$12:$Z$157,5,FALSE),\"\")","v":""},{"$f":"IFERROR(VLOOKUP(R17,Choixeleves!$M$12:$Z$157,6,FALSE),\"\")","v":""},{"$f":"IFERROR(VLOOKUP(R17,Choixeleves!$M$12:$Z$157,7,FALSE),\"\")","v":""},15,null,"Virginie_15",{"$f":"IFERROR(VLOOKUP(Y17,Choixeleves!$M$12:$Z$157,3,FALSE),\"\")","v":""},{"$f":"IFERROR(VLOOKUP(Y17,Choixeleves!$M$12:$Z$157,5,FALSE),\"\")","v":""},{"$f":"IFERROR(VLOOKUP(Y17,Choixeleves!$M$12:$Z$157,6,FALSE),\"\")","v":""},{"$f":"IFERROR(VLOOKUP(Y17,Choixeleves!$M$12:$Z$157,7,FALSE),\"\")","v":""},15,null,"Quentin_15",{"$f":"IFERROR(VLOOKUP(AF17,Choixeleves!$M$12:$Z$157,3,FALSE),\"\")","v":""},{"$f":"IFERROR(VLOOKUP(AF17,Choixeleves!$M$12:$Z$157,5,FALSE),\"\")","v":""},{"$f":"IFERROR(VLOOKUP(AF17,Choixeleves!$M$12:$Z$157,6,FALSE),\"\")","v":""},{"$f":"IFERROR(VLOOKUP(AF17,Choixeleves!$M$12:$Z$157,7,FALSE),\"\")","v":""},15,null,"Mick_15",{"$f":"IFERROR(VLOOKUP(AM17,Choixeleves!$M$12:$Z$157,3,FALSE),\"\")","v":""},{"$f":"IFERROR(VLOOKUP(AM17,Choixeleves!$M$12:$Z$157,5,FALSE),\"\")","v":""},{"$f":"IFERROR(VLOOKUP(AM17,Choixeleves!$M$12:$Z$157,6,FALSE),\"\")","v":""},{"$f":"IFERROR(VLOOKUP(AM17,Choixeleves!$M$12:$Z$157,7,FALSE),\"\")","v":""},15]
[null,null,null,null,null,null,null,null,null,null,"Rémi_16",{"$f":"IFERROR(VLOOKUP(K18,Choixeleves!$M$12:$Z$157,3,FALSE),\"\")","v":""},{"$f":"IFERROR(VLOOKUP(K18,Choixeleves!$M$12:$Z$157,5,FALSE),\"\")","v":""},{"$f":"IFERROR(VLOOKUP(K18,Choixeleves!$M$12:$Z$157,6,FALSE),\"\")","v":""},{"$f":"IFERROR(VLOOKUP(K18,Choixeleves!$M$12:$Z$157,7,FALSE),\"\")","v":""},16,null,"Timothée_16",{"$f":"IFERROR(VLOOKUP(R18,Choixeleves!$M$12:$Z$157,3,FALSE),\"\")","v":""},{"$f":"IFERROR(VLOOKUP(R18,Choixeleves!$M$12:$Z$157,5,FALSE),\"\")","v":""},{"$f":"IFERROR(VLOOKUP(R18,Choixeleves!$M$12:$Z$157,6,FALSE),\"\")","v":""},{"$f":"IFERROR(VLOOKUP(R18,Choixeleves!$M$12:$Z$157,7,FALSE),\"\")","v":""},16,null,"Virginie_16",{"$f":"IFERROR(VLOOKUP(Y18,Choixeleves!$M$12:$Z$157,3,FALSE),\"\")","v":""},{"$f":"IFERROR(VLOOKUP(Y18,Choixeleves!$M$12:$Z$157,5,FALSE),\"\")","v":""},{"$f":"IFERROR(VLOOKUP(Y18,Choixeleves!$M$12:$Z$157,6,FALSE),\"\")","v":""},{"$f":"IFERROR(VLOOKUP(Y18,Choixeleves!$M$12:$Z$157,7,FALSE),\"\")","v":""},16,null,"Quentin_16",{"$f":"IFERROR(VLOOKUP(AF18,Choixeleves!$M$12:$Z$157,3,FALSE),\"\")","v":""},{"$f":"IFERROR(VLOOKUP(AF18,Choixeleves!$M$12:$Z$157,5,FALSE),\"\")","v":""},{"$f":"IFERROR(VLOOKUP(AF18,Choixeleves!$M$12:$Z$157,6,FALSE),\"\")","v":""},{"$f":"IFERROR(VLOOKUP(AF18,Choixeleves!$M$12:$Z$157,7,FALSE),\"\")","v":""},16,null,"Mick_16",{"$f":"IFERROR(VLOOKUP(AM18,Choixeleves!$M$12:$Z$157,3,FALSE),\"\")","v":""},{"$f":"IFERROR(VLOOKUP(AM18,Choixeleves!$M$12:$Z$157,5,FALSE),\"\")","v":""},{"$f":"IFERROR(VLOOKUP(AM18,Choixeleves!$M$12:$Z$157,6,FALSE),\"\")","v":""},{"$f":"IFERROR(VLOOKUP(AM18,Choixeleves!$M$12:$Z$157,7,FALSE),\"\")","v":""},16]
[null,null,null,null,null,null,null,null,null,null,"Rémi_17",{"$f":"IFERROR(VLOOKUP(K19,Choixeleves!$M$12:$Z$157,3,FALSE),\"\")","v":""},{"$f":"IFERROR(VLOOKUP(K19,Choixeleves!$M$12:$Z$157,5,FALSE),\"\")","v":""},{"$f":"IFERROR(VLOOKUP(K19,Choixeleves!$M$12:$Z$157,6,FALSE),\"\")","v":""},{"$f":"IFERROR(VLOOKUP(K19,Choixeleves!$M$12:$Z$157,7,FALSE),\"\")","v":""},17,null,"Timothée_17",{"$f":"IFERROR(VLOOKUP(R19,Choixeleves!$M$12:$Z$157,3,FALSE),\"\")","v":""},{"$f":"IFERROR(VLOOKUP(R19,Choixeleves!$M$12:$Z$157,5,FALSE),\"\")","v":""},{"$f":"IFERROR(VLOOKUP(R19,Choixeleves!$M$12:$Z$157,6,FALSE),\"\")","v":""},{"$f":"IFERROR(VLOOKUP(R19,Choixeleves!$M$12:$Z$157,7,FALSE),\"\")","v":""},17,null,"Virginie_17",{"$f":"IFERROR(VLOOKUP(Y19,Choixeleves!$M$12:$Z$157,3,FALSE),\"\")","v":""},{"$f":"IFERROR(VLOOKUP(Y19,Choixeleves!$M$12:$Z$157,5,FALSE),\"\")","v":""},{"$f":"IFERROR(VLOOKUP(Y19,Choixeleves!$M$12:$Z$157,6,FALSE),\"\")","v":""},{"$f":"IFERROR(VLOOKUP(Y19,Choixeleves!$M$12:$Z$157,7,FALSE),\"\")","v":""},17,null,"Quentin_17",{"$f":"IFERROR(VLOOKUP(AF19,Choixeleves!$M$12:$Z$157,3,FALSE),\"\")","v":""},{"$f":"IFERROR(VLOOKUP(AF19,Choixeleves!$M$12:$Z$157,5,FALSE),\"\")","v":""},{"$f":"IFERROR(VLOOKUP(AF19,Choixeleves!$M$12:$Z$157,6,FALSE),\"\")","v":""},{"$f":"IFERROR(VLOOKUP(AF19,Choixeleves!$M$12:$Z$157,7,FALSE),\"\")","v":""},17,null,"Mick_17",{"$f":"IFERROR(VLOOKUP(AM19,Choixeleves!$M$12:$Z$157,3,FALSE),\"\")","v":""},{"$f":"IFERROR(VLOOKUP(AM19,Choixeleves!$M$12:$Z$157,5,FALSE),\"\")","v":""},{"$f":"IFERROR(VLOOKUP(AM19,Choixeleves!$M$12:$Z$157,6,FALSE),\"\")","v":""},{"$f":"IFERROR(VLOOKUP(AM19,Choixeleves!$M$12:$Z$157,7,FALSE),\"\")","v":""},17]
[null,null,null,null,null,null,null,null,null,null,"Rémi_18",{"$f":"IFERROR(VLOOKUP(K20,Choixeleves!$M$12:$Z$157,3,FALSE),\"\")","v":""},{"$f":"IFERROR(VLOOKUP(K20,Choixeleves!$M$12:$Z$157,5,FALSE),\"\")","v":""},{"$f":"IFERROR(VLOOKUP(K20,Choixeleves!$M$12:$Z$157,6,FALSE),\"\")","v":""},{"$f":"IFERROR(VLOOKUP(K20,Choixeleves!$M$12:$Z$157,7,FALSE),\"\")","v":""},18,null,"Timothée_18",{"$f":"IFERROR(VLOOKUP(R20,Choixeleves!$M$12:$Z$157,3,FALSE),\"\")","v":""},{"$f":"IFERROR(VLOOKUP(R20,Choixeleves!$M$12:$Z$157,5,FALSE),\"\")","v":""},{"$f":"IFERROR(VLOOKUP(R20,Choixeleves!$M$12:$Z$157,6,FALSE),\"\")","v":""},{"$f":"IFERROR(VLOOKUP(R20,Choixeleves!$M$12:$Z$157,7,FALSE),\"\")","v":""},18,null,"Virginie_18",{"$f":"IFERROR(VLOOKUP(Y20,Choixeleves!$M$12:$Z$157,3,FALSE),\"\")","v":""},{"$f":"IFERROR(VLOOKUP(Y20,Choixeleves!$M$12:$Z$157,5,FALSE),\"\")","v":""},{"$f":"IFERROR(VLOOKUP(Y20,Choixeleves!$M$12:$Z$157,6,FALSE),\"\")","v":""},{"$f":"IFERROR(VLOOKUP(Y20,Choixeleves!$M$12:$Z$157,7,FALSE),\"\")","v":""},18,null,"Quentin_18",{"$f":"IFERROR(VLOOKUP(AF20,Choixeleves!$M$12:$Z$157,3,FALSE),\"\")","v":""},{"$f":"IFERROR(VLOOKUP(AF20,Choixeleves!$M$12:$Z$157,5,FALSE),\"\")","v":""},{"$f":"IFERROR(VLOOKUP(AF20,Choixeleves!$M$12:$Z$157,6,FALSE),\"\")","v":""},{"$f":"IFERROR(VLOOKUP(AF20,Choixeleves!$M$12:$Z$157,7,FALSE),\"\")","v":""},18,null,"Mick_18",{"$f":"IFERROR(VLOOKUP(AM20,Choixeleves!$M$12:$Z$157,3,FALSE),\"\")","v":""},{"$f":"IFERROR(VLOOKUP(AM20,Choixeleves!$M$12:$Z$157,5,FALSE),\"\")","v":""},{"$f":"IFERROR(VLOOKUP(AM20,Choixeleves!$M$12:$Z$157,6,FALSE),\"\")","v":""},{"$f":"IFERROR(VLOOKUP(AM20,Choixeleves!$M$12:$Z$157,7,FALSE),\"\")","v":""},18]
[null,null,null,null,null,null,null,null,null,null,"Rémi_19",{"$f":"IFERROR(VLOOKUP(K21,Choixeleves!$M$12:$Z$157,3,FALSE),\"\")","v":""},{"$f":"IFERROR(VLOOKUP(K21,Choixeleves!$M$12:$Z$157,5,FALSE),\"\")","v":""},{"$f":"IFERROR(VLOOKUP(K21,Choixeleves!$M$12:$Z$157,6,FALSE),\"\")","v":""},{"$f":"IFERROR(VLOOKUP(K21,Choixeleves!$M$12:$Z$157,7,FALSE),\"\")","v":""},19,null,"Timothée_19",{"$f":"IFERROR(VLOOKUP(R21,Choixeleves!$M$12:$Z$157,3,FALSE),\"\")","v":""},{"$f":"IFERROR(VLOOKUP(R21,Choixeleves!$M$12:$Z$157,5,FALSE),\"\")","v":""},{"$f":"IFERROR(VLOOKUP(R21,Choixeleves!$M$12:$Z$157,6,FALSE),\"\")","v":""},{"$f":"IFERROR(VLOOKUP(R21,Choixeleves!$M$12:$Z$157,7,FALSE),\"\")","v":""},19,null,"Virginie_19",{"$f":"IFERROR(VLOOKUP(Y21,Choixeleves!$M$12:$Z$157,3,FALSE),\"\")","v":""},{"$f":"IFERROR(VLOOKUP(Y21,Choixeleves!$M$12:$Z$157,5,FALSE),\"\")","v":""},{"$f":"IFERROR(VLOOKUP(Y21,Choixeleves!$M$12:$Z$157,6,FALSE),\"\")","v":""},{"$f":"IFERROR(VLOOKUP(Y21,Choixeleves!$M$12:$Z$157,7,FALSE),\"\")","v":""},19,null,"Quentin_19",{"$f":"IFERROR(VLOOKUP(AF21,Choixeleves!$M$12:$Z$157,3,FALSE),\"\")","v":""},{"$f":"IFERROR(VLOOKUP(AF21,Choixeleves!$M$12:$Z$157,5,FALSE),\"\")","v":""},{"$f":"IFERROR(VLOOKUP(AF21,Choixeleves!$M$12:$Z$157,6,FALSE),\"\")","v":""},{"$f":"IFERROR(VLOOKUP(AF21,Choixeleves!$M$12:$Z$157,7,FALSE),\"\")","v":""},19,null,"Mick_19",{"$f":"IFERROR(VLOOKUP(AM21,Choixeleves!$M$12:$Z$157,3,FALSE),\"\")","v":""},{"$f":"IFERROR(VLOOKUP(AM21,Choixeleves!$M$12:$Z$157,5,FALSE),\"\")","v":""},{"$f":"IFERROR(VLOOKUP(AM21,Choixeleves!$M$12:$Z$157,6,FALSE),\"\")","v":""},{"$f":"IFERROR(VLOOKUP(AM21,Choixeleves!$M$12:$Z$157,7,FALSE),\"\")","v":""},19]
[null,null,null,null,null,null,null,null,null,null,"Rémi_20",{"$f":"IFERROR(VLOOKUP(K22,Choixeleves!$M$12:$Z$157,3,FALSE),\"\")","v":""},{"$f":"IFERROR(VLOOKUP(K22,Choixeleves!$M$12:$Z$157,5,FALSE),\"\")","v":""},{"$f":"IFERROR(VLOOKUP(K22,Choixeleves!$M$12:$Z$157,6,FALSE),\"\")","v":""},{"$f":"IFERROR(VLOOKUP(K22,Choixeleves!$M$12:$Z$157,7,FALSE),\"\")","v":""},20,null,"Timothée_20",{"$f":"IFERROR(VLOOKUP(R22,Choixeleves!$M$12:$Z$157,3,FALSE),\"\")","v":""},{"$f":"IFERROR(VLOOKUP(R22,Choixeleves!$M$12:$Z$157,5,FALSE),\"\")","v":""},{"$f":"IFERROR(VLOOKUP(R22,Choixeleves!$M$12:$Z$157,6,FALSE),\"\")","v":""},{"$f":"IFERROR(VLOOKUP(R22,Choixeleves!$M$12:$Z$157,7,FALSE),\"\")","v":""},20,null,"Virginie_20",{"$f":"IFERROR(VLOOKUP(Y22,Choixeleves!$M$12:$Z$157,3,FALSE),\"\")","v":""},{"$f":"IFERROR(VLOOKUP(Y22,Choixeleves!$M$12:$Z$157,5,FALSE),\"\")","v":""},{"$f":"IFERROR(VLOOKUP(Y22,Choixeleves!$M$12:$Z$157,6,FALSE),\"\")","v":""},{"$f":"IFERROR(VLOOKUP(Y22,Choixeleves!$M$12:$Z$157,7,FALSE),\"\")","v":""},20,null,"Quentin_20",{"$f":"IFERROR(VLOOKUP(AF22,Choixeleves!$M$12:$Z$157,3,FALSE),\"\")","v":""},{"$f":"IFERROR(VLOOKUP(AF22,Choixeleves!$M$12:$Z$157,5,FALSE),\"\")","v":""},{"$f":"IFERROR(VLOOKUP(AF22,Choixeleves!$M$12:$Z$157,6,FALSE),\"\")","v":""},{"$f":"IFERROR(VLOOKUP(AF22,Choixeleves!$M$12:$Z$157,7,FALSE),\"\")","v":""},20,null,"Mick_20",{"$f":"IFERROR(VLOOKUP(AM22,Choixeleves!$M$12:$Z$157,3,FALSE),\"\")","v":""},{"$f":"IFERROR(VLOOKUP(AM22,Choixeleves!$M$12:$Z$157,5,FALSE),\"\")","v":""},{"$f":"IFERROR(VLOOKUP(AM22,Choixeleves!$M$12:$Z$157,6,FALSE),\"\")","v":""},{"$f":"IFERROR(VLOOKUP(AM22,Choixeleves!$M$12:$Z$157,7,FALSE),\"\")","v":""},20]
[null,null,null,null,null,null,null,null,null,null,"Rémi_21",{"$f":"IFERROR(VLOOKUP(K23,Choixeleves!$M$12:$Z$157,3,FALSE),\"\")","v":""},{"$f":"IFERROR(VLOOKUP(K23,Choixeleves!$M$12:$Z$157,5,FALSE),\"\")","v":""},{"$f":"IFERROR(VLOOKUP(K23,Choixeleves!$M$12:$Z$157,6,FALSE),\"\")","v":""},{"$f":"IFERROR(VLOOKUP(K23,Choixeleves!$M$12:$Z$157,7,FALSE),\"\")","v":""},21,null,"Timothée_21",{"$f":"IFERROR(VLOOKUP(R23,Choixeleves!$M$12:$Z$157,3,FALSE),\"\")","v":""},{"$f":"IFERROR(VLOOKUP(R23,Choixeleves!$M$12:$Z$157,5,FALSE),\"\")","v":""},{"$f":"IFERROR(VLOOKUP(R23,Choixeleves!$M$12:$Z$157,6,FALSE),\"\")","v":""},{"$f":"IFERROR(VLOOKUP(R23,Choixeleves!$M$12:$Z$157,7,FALSE),\"\")","v":""},21,null,"Virginie_21",{"$f":"IFERROR(VLOOKUP(Y23,Choixeleves!$M$12:$Z$157,3,FALSE),\"\")","v":""},{"$f":"IFERROR(VLOOKUP(Y23,Choixeleves!$M$12:$Z$157,5,FALSE),\"\")","v":""},{"$f":"IFERROR(VLOOKUP(Y23,Choixeleves!$M$12:$Z$157,6,FALSE),\"\")","v":""},{"$f":"IFERROR(VLOOKUP(Y23,Choixeleves!$M$12:$Z$157,7,FALSE),\"\")","v":""},21,null,"Quentin_21",{"$f":"IFERROR(VLOOKUP(AF23,Choixeleves!$M$12:$Z$157,3,FALSE),\"\")","v":""},{"$f":"IFERROR(VLOOKUP(AF23,Choixeleves!$M$12:$Z$157,5,FALSE),\"\")","v":""},{"$f":"IFERROR(VLOOKUP(AF23,Choixeleves!$M$12:$Z$157,6,FALSE),\"\")","v":""},{"$f":"IFERROR(VLOOKUP(AF23,Choixeleves!$M$12:$Z$157,7,FALSE),\"\")","v":""},21,null,"Mick_21",{"$f":"IFERROR(VLOOKUP(AM23,Choixeleves!$M$12:$Z$157,3,FALSE),\"\")","v":""},{"$f":"IFERROR(VLOOKUP(AM23,Choixeleves!$M$12:$Z$157,5,FALSE),\"\")","v":""},{"$f":"IFERROR(VLOOKUP(AM23,Choixeleves!$M$12:$Z$157,6,FALSE),\"\")","v":""},{"$f":"IFERROR(VLOOKUP(AM23,Choixeleves!$M$12:$Z$157,7,FALSE),\"\")","v":""},21]
[null,null,null,null,null,null,null,null,null,null,"Rémi_22",{"$f":"IFERROR(VLOOKUP(K24,Choixeleves!$M$12:$Z$157,3,FALSE),\"\")","v":""},{"$f":"IFERROR(VLOOKUP(K24,Choixeleves!$M$12:$Z$157,5,FALSE),\"\")","v":""},{"$f":"IFERROR(VLOOKUP(K24,Choixeleves!$M$12:$Z$157,6,FALSE),\"\")","v":""},{"$f":"IFERROR(VLOOKUP(K24,Choixeleves!$M$12:$Z$157,7,FALSE),\"\")","v":""},22,null,"Timothée_22",{"$f":"IFERROR(VLOOKUP(R24,Choixeleves!$M$12:$Z$157,3,FALSE),\"\")","v":""},{"$f":"IFERROR(VLOOKUP(R24,Choixeleves!$M$12:$Z$157,5,FALSE),\"\")","v":""},{"$f":"IFERROR(VLOOKUP(R24,Choixeleves!$M$12:$Z$157,6,FALSE),\"\")","v":""},{"$f":"IFERROR(VLOOKUP(R24,Choixeleves!$M$12:$Z$157,7,FALSE),\"\")","v":""},22,null,"Virginie_22",{"$f":"IFERROR(VLOOKUP(Y24,Choixeleves!$M$12:$Z$157,3,FALSE),\"\")","v":""},{"$f":"IFERROR(VLOOKUP(Y24,Choixeleves!$M$12:$Z$157,5,FALSE),\"\")","v":""},{"$f":"IFERROR(VLOOKUP(Y24,Choixeleves!$M$12:$Z$157,6,FALSE),\"\")","v":""},{"$f":"IFERROR(VLOOKUP(Y24,Choixeleves!$M$12:$Z$157,7,FALSE),\"\")","v":""},22,null,"Quentin_22",{"$f":"IFERROR(VLOOKUP(AF24,Choixeleves!$M$12:$Z$157,3,FALSE),\"\")","v":""},{"$f":"IFERROR(VLOOKUP(AF24,Choixeleves!$M$12:$Z$157,5,FALSE),\"\")","v":""},{"$f":"IFERROR(VLOOKUP(AF24,Choixeleves!$M$12:$Z$157,6,FALSE),\"\")","v":""},{"$f":"IFERROR(VLOOKUP(AF24,Choixeleves!$M$12:$Z$157,7,FALSE),\"\")","v":""},22,null,"Mick_22",{"$f":"IFERROR(VLOOKUP(AM24,Choixeleves!$M$12:$Z$157,3,FALSE),\"\")","v":""},{"$f":"IFERROR(VLOOKUP(AM24,Choixeleves!$M$12:$Z$157,5,FALSE),\"\")","v":""},{"$f":"IFERROR(VLOOKUP(AM24,Choixeleves!$M$12:$Z$157,6,FALSE),\"\")","v":""},{"$f":"IFERROR(VLOOKUP(AM24,Choixeleves!$M$12:$Z$157,7,FALSE),\"\")","v":""},22]
[null,null,null,null,null,null,null,null,null,null,"Rémi_23",{"$f":"IFERROR(VLOOKUP(K25,Choixeleves!$M$12:$Z$157,3,FALSE),\"\")","v":""},{"$f":"IFERROR(VLOOKUP(K25,Choixeleves!$M$12:$Z$157,5,FALSE),\"\")","v":""},{"$f":"IFERROR(VLOOKUP(K25,Choixeleves!$M$12:$Z$157,6,FALSE),\"\")","v":""},{"$f":"IFERROR(VLOOKUP(K25,Choixeleves!$M$12:$Z$157,7,FALSE),\"\")","v":""},23,null,"Timothée_23",{"$f":"IFERROR(VLOOKUP(R25,Choixeleves!$M$12:$Z$157,3,FALSE),\"\")","v":""},{"$f":"IFERROR(VLOOKUP(R25,Choixeleves!$M$12:$Z$157,5,FALSE),\"\")","v":""},{"$f":"IFERROR(VLOOKUP(R25,Choixeleves!$M$12:$Z$157,6,FALSE),\"\")","v":""},{"$f":"IFERROR(VLOOKUP(R25,Choixeleves!$M$12:$Z$157,7,FALSE),\"\")","v":""},23,null,"Virginie_23",{"$f":"IFERROR(VLOOKUP(Y25,Choixeleves!$M$12:$Z$157,3,FALSE),\"\")","v":""},{"$f":"IFERROR(VLOOKUP(Y25,Choixeleves!$M$12:$Z$157,5,FALSE),\"\")","v":""},{"$f":"IFERROR(VLOOKUP(Y25,Choixeleves!$M$12:$Z$157,6,FALSE),\"\")","v":""},{"$f":"IFERROR(VLOOKUP(Y25,Choixeleves!$M$12:$Z$157,7,FALSE),\"\")","v":""},23,null,"Quentin_23",{"$f":"IFERROR(VLOOKUP(AF25,Choixeleves!$M$12:$Z$157,3,FALSE),\"\")","v":""},{"$f":"IFERROR(VLOOKUP(AF25,Choixeleves!$M$12:$Z$157,5,FALSE),\"\")","v":""},{"$f":"IFERROR(VLOOKUP(AF25,Choixeleves!$M$12:$Z$157,6,FALSE),\"\")","v":""},{"$f":"IFERROR(VLOOKUP(AF25,Choixeleves!$M$12:$Z$157,7,FALSE),\"\")","v":""},23,null,"Mick_23",{"$f":"IFERROR(VLOOKUP(AM25,Choixeleves!$M$12:$Z$157,3,FALSE),\"\")","v":""},{"$f":"IFERROR(VLOOKUP(AM25,Choixeleves!$M$12:$Z$157,5,FALSE),\"\")","v":""},{"$f":"IFERROR(VLOOKUP(AM25,Choixeleves!$M$12:$Z$157,6,FALSE),\"\")","v":""},{"$f":"IFERROR(VLOOKUP(AM25,Choixeleves!$M$12:$Z$157,7,FALSE),\"\")","v":""},23]
[null,null,null,null,null,null,null,null,null,null,"Rémi_24",{"$f":"IFERROR(VLOOKUP(K26,Choixeleves!$M$12:$Z$157,3,FALSE),\"\")","v":""},{"$f":"IFERROR(VLOOKUP(K26,Choixeleves!$M$12:$Z$157,5,FALSE),\"\")","v":""},{"$f":"IFERROR(VLOOKUP(K26,Choixeleves!$M$12:$Z$157,6,FALSE),\"\")","v":""},{"$f":"IFERROR(VLOOKUP(K26,Choixeleves!$M$12:$Z$157,7,FALSE),\"\")","v":""},24,null,"Timothée_24",{"$f":"IFERROR(VLOOKUP(R26,Choixeleves!$M$12:$Z$157,3,FALSE),\"\")","v":""},{"$f":"IFERROR(VLOOKUP(R26,Choixeleves!$M$12:$Z$157,5,FALSE),\"\")","v":""},{"$f":"IFERROR(VLOOKUP(R26,Choixeleves!$M$12:$Z$157,6,FALSE),\"\")","v":""},{"$f":"IFERROR(VLOOKUP(R26,Choixeleves!$M$12:$Z$157,7,FALSE),\"\")","v":""},24,null,"Virginie_24",{"$f":"IFERROR(VLOOKUP(Y26,Choixeleves!$M$12:$Z$157,3,FALSE),\"\")","v":""},{"$f":"IFERROR(VLOOKUP(Y26,Choixeleves!$M$12:$Z$157,5,FALSE),\"\")","v":""},{"$f":"IFERROR(VLOOKUP(Y26,Choixeleves!$M$12:$Z$157,6,FALSE),\"\")","v":""},{"$f":"IFERROR(VLOOKUP(Y26,Choixeleves!$M$12:$Z$157,7,FALSE),\"\")","v":""},24,null,"Quentin_24",{"$f":"IFERROR(VLOOKUP(AF26,Choixeleves!$M$12:$Z$157,3,FALSE),\"\")","v":""},{"$f":"IFERROR(VLOOKUP(AF26,Choixeleves!$M$12:$Z$157,5,FALSE),\"\")","v":""},{"$f":"IFERROR(VLOOKUP(AF26,Choixeleves!$M$12:$Z$157,6,FALSE),\"\")","v":""},{"$f":"IFERROR(VLOOKUP(AF26,Choixeleves!$M$12:$Z$157,7,FALSE),\"\")","v":""},24,null,"Mick_24",{"$f":"IFERROR(VLOOKUP(AM26,Choixeleves!$M$12:$Z$157,3,FALSE),\"\")","v":""},{"$f":"IFERROR(VLOOKUP(AM26,Choixeleves!$M$12:$Z$157,5,FALSE),\"\")","v":""},{"$f":"IFERROR(VLOOKUP(AM26,Choixeleves!$M$12:$Z$157,6,FALSE),\"\")","v":""},{"$f":"IFERROR(VLOOKUP(AM26,Choixeleves!$M$12:$Z$157,7,FALSE),\"\")","v":""},24]
[null,null,null,null,null,null,null,null,null,null,"Rémi_25",{"$f":"IFERROR(VLOOKUP(K27,Choixeleves!$M$12:$Z$157,3,FALSE),\"\")","v":""},{"$f":"IFERROR(VLOOKUP(K27,Choixeleves!$M$12:$Z$157,5,FALSE),\"\")","v":""},{"$f":"IFERROR(VLOOKUP(K27,Choixeleves!$M$12:$Z$157,6,FALSE),\"\")","v":""},{"$f":"IFERROR(VLOOKUP(K27,Choixeleves!$M$12:$Z$157,7,FALSE),\"\")","v":""},25,null,"Timothée_25",{"$f":"IFERROR(VLOOKUP(R27,Choixeleves!$M$12:$Z$157,3,FALSE),\"\")","v":""},{"$f":"IFERROR(VLOOKUP(R27,Choixeleves!$M$12:$Z$157,5,FALSE),\"\")","v":""},{"$f":"IFERROR(VLOOKUP(R27,Choixeleves!$M$12:$Z$157,6,FALSE),\"\")","v":""},{"$f":"IFERROR(VLOOKUP(R27,Choixeleves!$M$12:$Z$157,7,FALSE),\"\")","v":""},25,null,"Virginie_25",{"$f":"IFERROR(VLOOKUP(Y27,Choixeleves!$M$12:$Z$157,3,FALSE),\"\")","v":""},{"$f":"IFERROR(VLOOKUP(Y27,Choixeleves!$M$12:$Z$157,5,FALSE),\"\")","v":""},{"$f":"IFERROR(VLOOKUP(Y27,Choixeleves!$M$12:$Z$157,6,FALSE),\"\")","v":""},{"$f":"IFERROR(VLOOKUP(Y27,Choixeleves!$M$12:$Z$157,7,FALSE),\"\")","v":""},25,null,"Quentin_25",{"$f":"IFERROR(VLOOKUP(AF27,Choixeleves!$M$12:$Z$157,3,FALSE),\"\")","v":""},{"$f":"IFERROR(VLOOKUP(AF27,Choixeleves!$M$12:$Z$157,5,FALSE),\"\")","v":""},{"$f":"IFERROR(VLOOKUP(AF27,Choixeleves!$M$12:$Z$157,6,FALSE),\"\")","v":""},{"$f":"IFERROR(VLOOKUP(AF27,Choixeleves!$M$12:$Z$157,7,FALSE),\"\")","v":""},25,null,"Mick_25",{"$f":"IFERROR(VLOOKUP(AM27,Choixeleves!$M$12:$Z$157,3,FALSE),\"\")","v":""},{"$f":"IFERROR(VLOOKUP(AM27,Choixeleves!$M$12:$Z$157,5,FALSE),\"\")","v":""},{"$f":"IFERROR(VLOOKUP(AM27,Choixeleves!$M$12:$Z$157,6,FALSE),\"\")","v":""},{"$f":"IFERROR(VLOOKUP(AM27,Choixeleves!$M$12:$Z$157,7,FALSE),\"\")","v":""},25]
[null,null,null,null,null,null,null,null,null,null,"Rémi_26",{"$f":"IFERROR(VLOOKUP(K28,Choixeleves!$M$12:$Z$157,3,FALSE),\"\")","v":""},{"$f":"IFERROR(VLOOKUP(K28,Choixeleves!$M$12:$Z$157,5,FALSE),\"\")","v":""},{"$f":"IFERROR(VLOOKUP(K28,Choixeleves!$M$12:$Z$157,6,FALSE),\"\")","v":""},{"$f":"IFERROR(VLOOKUP(K28,Choixeleves!$M$12:$Z$157,7,FALSE),\"\")","v":""},26,null,"Timothée_26",{"$f":"IFERROR(VLOOKUP(R28,Choixeleves!$M$12:$Z$157,3,FALSE),\"\")","v":""},{"$f":"IFERROR(VLOOKUP(R28,Choixeleves!$M$12:$Z$157,5,FALSE),\"\")","v":""},{"$f":"IFERROR(VLOOKUP(R28,Choixeleves!$M$12:$Z$157,6,FALSE),\"\")","v":""},{"$f":"IFERROR(VLOOKUP(R28,Choixeleves!$M$12:$Z$157,7,FALSE),\"\")","v":""},26,null,"Virginie_26",{"$f":"IFERROR(VLOOKUP(Y28,Choixeleves!$M$12:$Z$157,3,FALSE),\"\")","v":""},{"$f":"IFERROR(VLOOKUP(Y28,Choixeleves!$M$12:$Z$157,5,FALSE),\"\")","v":""},{"$f":"IFERROR(VLOOKUP(Y28,Choixeleves!$M$12:$Z$157,6,FALSE),\"\")","v":""},{"$f":"IFERROR(VLOOKUP(Y28,Choixeleves!$M$12:$Z$157,7,FALSE),\"\")","v":""},26,null,"Quentin_26",{"$f":"IFERROR(VLOOKUP(AF28,Choixeleves!$M$12:$Z$157,3,FALSE),\"\")","v":""},{"$f":"IFERROR(VLOOKUP(AF28,Choixeleves!$M$12:$Z$157,5,FALSE),\"\")","v":""},{"$f":"IFERROR(VLOOKUP(AF28,Choixeleves!$M$12:$Z$157,6,FALSE),\"\")","v":""},{"$f":"IFERROR(VLOOKUP(AF28,Choixeleves!$M$12:$Z$157,7,FALSE),\"\")","v":""},26,null,"Mick_26",{"$f":"IFERROR(VLOOKUP(AM28,Choixeleves!$M$12:$Z$157,3,FALSE),\"\")","v":""},{"$f":"IFERROR(VLOOKUP(AM28,Choixeleves!$M$12:$Z$157,5,FALSE),\"\")","v":""},{"$f":"IFERROR(VLOOKUP(AM28,Choixeleves!$M$12:$Z$157,6,FALSE),\"\")","v":""},{"$f":"IFERROR(VLOOKUP(AM28,Choixeleves!$M$12:$Z$157,7,FALSE),\"\")","v":""},26]
[null,null,null,null,null,null,null,null,null,null,"Rémi_27",{"$f":"IFERROR(VLOOKUP(K29,Choixeleves!$M$12:$Z$157,3,FALSE),\"\")","v":""},{"$f":"IFERROR(VLOOKUP(K29,Choixeleves!$M$12:$Z$157,5,FALSE),\"\")","v":""},{"$f":"IFERROR(VLOOKUP(K29,Choixeleves!$M$12:$Z$157,6,FALSE),\"\")","v":""},{"$f":"IFERROR(VLOOKUP(K29,Choixeleves!$M$12:$Z$157,7,FALSE),\"\")","v":""},27,null,"Timothée_27",{"$f":"IFERROR(VLOOKUP(R29,Choixeleves!$M$12:$Z$157,3,FALSE),\"\")","v":""},{"$f":"IFERROR(VLOOKUP(R29,Choixeleves!$M$12:$Z$157,5,FALSE),\"\")","v":""},{"$f":"IFERROR(VLOOKUP(R29,Choixeleves!$M$12:$Z$157,6,FALSE),\"\")","v":""},{"$f":"IFERROR(VLOOKUP(R29,Choixeleves!$M$12:$Z$157,7,FALSE),\"\")","v":""},27,null,"Virginie_27",{"$f":"IFERROR(VLOOKUP(Y29,Choixeleves!$M$12:$Z$157,3,FALSE),\"\")","v":""},{"$f":"IFERROR(VLOOKUP(Y29,Choixeleves!$M$12:$Z$157,5,FALSE),\"\")","v":""},{"$f":"IFERROR(VLOOKUP(Y29,Choixeleves!$M$12:$Z$157,6,FALSE),\"\")","v":""},{"$f":"IFERROR(VLOOKUP(Y29,Choixeleves!$M$12:$Z$157,7,FALSE),\"\")","v":""},27,null,"Quentin_27",{"$f":"IFERROR(VLOOKUP(AF29,Choixeleves!$M$12:$Z$157,3,FALSE),\"\")","v":""},{"$f":"IFERROR(VLOOKUP(AF29,Choixeleves!$M$12:$Z$157,5,FALSE),\"\")","v":""},{"$f":"IFERROR(VLOOKUP(AF29,Choixeleves!$M$12:$Z$157,6,FALSE),\"\")","v":""},{"$f":"IFERROR(VLOOKUP(AF29,Choixeleves!$M$12:$Z$157,7,FALSE),\"\")","v":""},27,null,"Mick_27",{"$f":"IFERROR(VLOOKUP(AM29,Choixeleves!$M$12:$Z$157,3,FALSE),\"\")","v":""},{"$f":"IFERROR(VLOOKUP(AM29,Choixeleves!$M$12:$Z$157,5,FALSE),\"\")","v":""},{"$f":"IFERROR(VLOOKUP(AM29,Choixeleves!$M$12:$Z$157,6,FALSE),\"\")","v":""},{"$f":"IFERROR(VLOOKUP(AM29,Choixeleves!$M$12:$Z$157,7,FALSE),\"\")","v":""},27]
[null,null,null,null,null,null,null,null,null,null,"Rémi_28",{"$f":"IFERROR(VLOOKUP(K30,Choixeleves!$M$12:$Z$157,3,FALSE),\"\")","v":""},{"$f":"IFERROR(VLOOKUP(K30,Choixeleves!$M$12:$Z$157,5,FALSE),\"\")","v":""},{"$f":"IFERROR(VLOOKUP(K30,Choixeleves!$M$12:$Z$157,6,FALSE),\"\")","v":""},{"$f":"IFERROR(VLOOKUP(K30,Choixeleves!$M$12:$Z$157,7,FALSE),\"\")","v":""},28,null,"Timothée_28",{"$f":"IFERROR(VLOOKUP(R30,Choixeleves!$M$12:$Z$157,3,FALSE),\"\")","v":""},{"$f":"IFERROR(VLOOKUP(R30,Choixeleves!$M$12:$Z$157,5,FALSE),\"\")","v":""},{"$f":"IFERROR(VLOOKUP(R30,Choixeleves!$M$12:$Z$157,6,FALSE),\"\")","v":""},{"$f":"IFERROR(VLOOKUP(R30,Choixeleves!$M$12:$Z$157,7,FALSE),\"\")","v":""},28,null,"Virginie_28",{"$f":"IFERROR(VLOOKUP(Y30,Choixeleves!$M$12:$Z$157,3,FALSE),\"\")","v":""},{"$f":"IFERROR(VLOOKUP(Y30,Choixeleves!$M$12:$Z$157,5,FALSE),\"\")","v":""},{"$f":"IFERROR(VLOOKUP(Y30,Choixeleves!$M$12:$Z$157,6,FALSE),\"\")","v":""},{"$f":"IFERROR(VLOOKUP(Y30,Choixeleves!$M$12:$Z$157,7,FALSE),\"\")","v":""},28,null,"Quentin_28",{"$f":"IFERROR(VLOOKUP(AF30,Choixeleves!$M$12:$Z$157,3,FALSE),\"\")","v":""},{"$f":"IFERROR(VLOOKUP(AF30,Choixeleves!$M$12:$Z$157,5,FALSE),\"\")","v":""},{"$f":"IFERROR(VLOOKUP(AF30,Choixeleves!$M$12:$Z$157,6,FALSE),\"\")","v":""},{"$f":"IFERROR(VLOOKUP(AF30,Choixeleves!$M$12:$Z$157,7,FALSE),\"\")","v":""},28,null,"Mick_28",{"$f":"IFERROR(VLOOKUP(AM30,Choixeleves!$M$12:$Z$157,3,FALSE),\"\")","v":""},{"$f":"IFERROR(VLOOKUP(AM30,Choixeleves!$M$12:$Z$157,5,FALSE),\"\")","v":""},{"$f":"IFERROR(VLOOKUP(AM30,Choixeleves!$M$12:$Z$157,6,FALSE),\"\")","v":""},{"$f":"IFERROR(VLOOKUP(AM30,Choixeleves!$M$12:$Z$157,7,FALSE),\"\")","v":""},28]
[null,null,null,null,null,null,null,null,null,null,"Rémi_29",{"$f":"IFERROR(VLOOKUP(K31,Choixeleves!$M$12:$Z$157,3,FALSE),\"\")","v":""},{"$f":"IFERROR(VLOOKUP(K31,Choixeleves!$M$12:$Z$157,5,FALSE),\"\")","v":""},{"$f":"IFERROR(VLOOKUP(K31,Choixeleves!$M$12:$Z$157,6,FALSE),\"\")","v":""},{"$f":"IFERROR(VLOOKUP(K31,Choixeleves!$M$12:$Z$157,7,FALSE),\"\")","v":""},29,null,"Timothée_29",{"$f":"IFERROR(VLOOKUP(R31,Choixeleves!$M$12:$Z$157,3,FALSE),\"\")","v":""},{"$f":"IFERROR(VLOOKUP(R31,Choixeleves!$M$12:$Z$157,5,FALSE),\"\")","v":""},{"$f":"IFERROR(VLOOKUP(R31,Choixeleves!$M$12:$Z$157,6,FALSE),\"\")","v":""},{"$f":"IFERROR(VLOOKUP(R31,Choixeleves!$M$12:$Z$157,7,FALSE),\"\")","v":""},29,null,"Virginie_29",{"$f":"IFERROR(VLOOKUP(Y31,Choixeleves!$M$12:$Z$157,3,FALSE),\"\")","v":""},{"$f":"IFERROR(VLOOKUP(Y31,Choixeleves!$M$12:$Z$157,5,FALSE),\"\")","v":""},{"$f":"IFERROR(VLOOKUP(Y31,Choixeleves!$M$12:$Z$157,6,FALSE),\"\")","v":""},{"$f":"IFERROR(VLOOKUP(Y31,Choixeleves!$M$12:$Z$157,7,FALSE),\"\")","v":""},29,null,"Quentin_29",{"$f":"IFERROR(VLOOKUP(AF31,Choixeleves!$M$12:$Z$157,3,FALSE),\"\")","v":""},{"$f":"IFERROR(VLOOKUP(AF31,Choixeleves!$M$12:$Z$157,5,FALSE),\"\")","v":""},{"$f":"IFERROR(VLOOKUP(AF31,Choixeleves!$M$12:$Z$157,6,FALSE),\"\")","v":""},{"$f":"IFERROR(VLOOKUP(AF31,Choixeleves!$M$12:$Z$157,7,FALSE),\"\")","v":""},29,null,"Mick_29",{"$f":"IFERROR(VLOOKUP(AM31,Choixeleves!$M$12:$Z$157,3,FALSE),\"\")","v":""},{"$f":"IFERROR(VLOOKUP(AM31,Choixeleves!$M$12:$Z$157,5,FALSE),\"\")","v":""},{"$f":"IFERROR(VLOOKUP(AM31,Choixeleves!$M$12:$Z$157,6,FALSE),\"\")","v":""},{"$f":"IFERROR(VLOOKUP(AM31,Choixeleves!$M$12:$Z$157,7,FALSE),\"\")","v":""},29]
[null,null,null,null,null,null,null,null,null,null,"Rémi_30",{"$f":"IFERROR(VLOOKUP(K32,Choixeleves!$M$12:$Z$157,3,FALSE),\"\")","v":""},{"$f":"IFERROR(VLOOKUP(K32,Choixeleves!$M$12:$Z$157,5,FALSE),\"\")","v":""},{"$f":"IFERROR(VLOOKUP(K32,Choixeleves!$M$12:$Z$157,6,FALSE),\"\")","v":""},{"$f":"IFERROR(VLOOKUP(K32,Choixeleves!$M$12:$Z$157,7,FALSE),\"\")","v":""},30,null,"Timothée_30",{"$f":"IFERROR(VLOOKUP(R32,Choixeleves!$M$12:$Z$157,3,FALSE),\"\")","v":""},{"$f":"IFERROR(VLOOKUP(R32,Choixeleves!$M$12:$Z$157,5,FALSE),\"\")","v":""},{"$f":"IFERROR(VLOOKUP(R32,Choixeleves!$M$12:$Z$157,6,FALSE),\"\")","v":""},{"$f":"IFERROR(VLOOKUP(R32,Choixeleves!$M$12:$Z$157,7,FALSE),\"\")","v":""},30,null,"Virginie_30",{"$f":"IFERROR(VLOOKUP(Y32,Choixeleves!$M$12:$Z$157,3,FALSE),\"\")","v":""},{"$f":"IFERROR(VLOOKUP(Y32,Choixeleves!$M$12:$Z$157,5,FALSE),\"\")","v":""},{"$f":"IFERROR(VLOOKUP(Y32,Choixeleves!$M$12:$Z$157,6,FALSE),\"\")","v":""},{"$f":"IFERROR(VLOOKUP(Y32,Choixeleves!$M$12:$Z$157,7,FALSE),\"\")","v":""},30,null,"Quentin_30",{"$f":"IFERROR(VLOOKUP(AF32,Choixeleves!$M$12:$Z$157,3,FALSE),\"\")","v":""},{"$f":"IFERROR(VLOOKUP(AF32,Choixeleves!$M$12:$Z$157,5,FALSE),\"\")","v":""},{"$f":"IFERROR(VLOOKUP(AF32,Choixeleves!$M$12:$Z$157,6,FALSE),\"\")","v":""},{"$f":"IFERROR(VLOOKUP(AF32,Choixeleves!$M$12:$Z$157,7,FALSE),\"\")","v":""},30,null,"Mick_30",{"$f":"IFERROR(VLOOKUP(AM32,Choixeleves!$M$12:$Z$157,3,FALSE),\"\")","v":""},{"$f":"IFERROR(VLOOKUP(AM32,Choixeleves!$M$12:$Z$157,5,FALSE),\"\")","v":""},{"$f":"IFERROR(VLOOKUP(AM32,Choixeleves!$M$12:$Z$157,6,FALSE),\"\")","v":""},{"$f":"IFERROR(VLOOKUP(AM32,Choixeleves!$M$12:$Z$157,7,FALSE),\"\")","v":""},30]
[null,null,null,null,null,null,null,null,null,null,"Rémi_31",{"$f":"IFERROR(VLOOKUP(K33,Choixeleves!$M$12:$Z$157,3,FALSE),\"\")","v":""},{"$f":"IFERROR(VLOOKUP(K33,Choixeleves!$M$12:$Z$157,5,FALSE),\"\")","v":""},{"$f":"IFERROR(VLOOKUP(K33,Choixeleves!$M$12:$Z$157,6,FALSE),\"\")","v":""},{"$f":"IFERROR(VLOOKUP(K33,Choixeleves!$M$12:$Z$157,7,FALSE),\"\")","v":""},31,null,"Timothée_31",{"$f":"IFERROR(VLOOKUP(R33,Choixeleves!$M$12:$Z$157,3,FALSE),\"\")","v":""},{"$f":"IFERROR(VLOOKUP(R33,Choixeleves!$M$12:$Z$157,5,FALSE),\"\")","v":""},{"$f":"IFERROR(VLOOKUP(R33,Choixeleves!$M$12:$Z$157,6,FALSE),\"\")","v":""},{"$f":"IFERROR(VLOOKUP(R33,Choixeleves!$M$12:$Z$157,7,FALSE),\"\")","v":""},31,null,"Virginie_31",{"$f":"IFERROR(VLOOKUP(Y33,Choixeleves!$M$12:$Z$157,3,FALSE),\"\")","v":""},{"$f":"IFERROR(VLOOKUP(Y33,Choixeleves!$M$12:$Z$157,5,FALSE),\"\")","v":""},{"$f":"IFERROR(VLOOKUP(Y33,Choixeleves!$M$12:$Z$157,6,FALSE),\"\")","v":""},{"$f":"IFERROR(VLOOKUP(Y33,Choixeleves!$M$12:$Z$157,7,FALSE),\"\")","v":""},31,null,"Quentin_31",{"$f":"IFERROR(VLOOKUP(AF33,Choixeleves!$M$12:$Z$157,3,FALSE),\"\")","v":""},{"$f":"IFERROR(VLOOKUP(AF33,Choixeleves!$M$12:$Z$157,5,FALSE),\"\")","v":""},{"$f":"IFERROR(VLOOKUP(AF33,Choixeleves!$M$12:$Z$157,6,FALSE),\"\")","v":""},{"$f":"IFERROR(VLOOKUP(AF33,Choixeleves!$M$12:$Z$157,7,FALSE),\"\")","v":""},31,null,"Mick_31",{"$f":"IFERROR(VLOOKUP(AM33,Choixeleves!$M$12:$Z$157,3,FALSE),\"\")","v":""},{"$f":"IFERROR(VLOOKUP(AM33,Choixeleves!$M$12:$Z$157,5,FALSE),\"\")","v":""},{"$f":"IFERROR(VLOOKUP(AM33,Choixeleves!$M$12:$Z$157,6,FALSE),\"\")","v":""},{"$f":"IFERROR(VLOOKUP(AM33,Choixeleves!$M$12:$Z$157,7,FALSE),\"\")","v":""},31]
[null,null,null,null,null,null,null,null,null,null,"Rémi_32",{"$f":"IFERROR(VLOOKUP(K34,Choixeleves!$M$12:$Z$157,3,FALSE),\"\")","v":""},{"$f":"IFERROR(VLOOKUP(K34,Choixeleves!$M$12:$Z$157,5,FALSE),\"\")","v":""},{"$f":"IFERROR(VLOOKUP(K34,Choixeleves!$M$12:$Z$157,6,FALSE),\"\")","v":""},{"$f":"IFERROR(VLOOKUP(K34,Choixeleves!$M$12:$Z$157,7,FALSE),\"\")","v":""},32,null,"Timothée_32",{"$f":"IFERROR(VLOOKUP(R34,Choixeleves!$M$12:$Z$157,3,FALSE),\"\")","v":""},{"$f":"IFERROR(VLOOKUP(R34,Choixeleves!$M$12:$Z$157,5,FALSE),\"\")","v":""},{"$f":"IFERROR(VLOOKUP(R34,Choixeleves!$M$12:$Z$157,6,FALSE),\"\")","v":""},{"$f":"IFERROR(VLOOKUP(R34,Choixeleves!$M$12:$Z$157,7,FALSE),\"\")","v":""},32,null,"Virginie_32",{"$f":"IFERROR(VLOOKUP(Y34,Choixeleves!$M$12:$Z$157,3,FALSE),\"\")","v":""},{"$f":"IFERROR(VLOOKUP(Y34,Choixeleves!$M$12:$Z$157,5,FALSE),\"\")","v":""},{"$f":"IFERROR(VLOOKUP(Y34,Choixeleves!$M$12:$Z$157,6,FALSE),\"\")","v":""},{"$f":"IFERROR(VLOOKUP(Y34,Choixeleves!$M$12:$Z$157,7,FALSE),\"\")","v":""},32,null,"Quentin_32",{"$f":"IFERROR(VLOOKUP(AF34,Choixeleves!$M$12:$Z$157,3,FALSE),\"\")","v":""},{"$f":"IFERROR(VLOOKUP(AF34,Choixeleves!$M$12:$Z$157,5,FALSE),\"\")","v":""},{"$f":"IFERROR(VLOOKUP(AF34,Choixeleves!$M$12:$Z$157,6,FALSE),\"\")","v":""},{"$f":"IFERROR(VLOOKUP(AF34,Choixeleves!$M$12:$Z$157,7,FALSE),\"\")","v":""},32,null,"Mick_32",{"$f":"IFERROR(VLOOKUP(AM34,Choixeleves!$M$12:$Z$157,3,FALSE),\"\")","v":""},{"$f":"IFERROR(VLOOKUP(AM34,Choixeleves!$M$12:$Z$157,5,FALSE),\"\")","v":""},{"$f":"IFERROR(VLOOKUP(AM34,Choixeleves!$M$12:$Z$157,6,FALSE),\"\")","v":""},{"$f":"IFERROR(VLOOKUP(AM34,Choixeleves!$M$12:$Z$157,7,FALSE),\"\")","v":""},32]
[null,null,null,null,null,null,null,null,null,null,"Rémi_33",{"$f":"IFERROR(VLOOKUP(K35,Choixeleves!$M$12:$Z$157,3,FALSE),\"\")","v":""},{"$f":"IFERROR(VLOOKUP(K35,Choixeleves!$M$12:$Z$157,5,FALSE),\"\")","v":""},{"$f":"IFERROR(VLOOKUP(K35,Choixeleves!$M$12:$Z$157,6,FALSE),\"\")","v":""},{"$f":"IFERROR(VLOOKUP(K35,Choixeleves!$M$12:$Z$157,7,FALSE),\"\")","v":""},33,null,"Timothée_33",{"$f":"IFERROR(VLOOKUP(R35,Choixeleves!$M$12:$Z$157,3,FALSE),\"\")","v":""},{"$f":"IFERROR(VLOOKUP(R35,Choixeleves!$M$12:$Z$157,5,FALSE),\"\")","v":""},{"$f":"IFERROR(VLOOKUP(R35,Choixeleves!$M$12:$Z$157,6,FALSE),\"\")","v":""},{"$f":"IFERROR(VLOOKUP(R35,Choixeleves!$M$12:$Z$157,7,FALSE),\"\")","v":""},33,null,"Virginie_33",{"$f":"IFERROR(VLOOKUP(Y35,Choixeleves!$M$12:$Z$157,3,FALSE),\"\")","v":""},{"$f":"IFERROR(VLOOKUP(Y35,Choixeleves!$M$12:$Z$157,5,FALSE),\"\")","v":""},{"$f":"IFERROR(VLOOKUP(Y35,Choixeleves!$M$12:$Z$157,6,FALSE),\"\")","v":""},{"$f":"IFERROR(VLOOKUP(Y35,Choixeleves!$M$12:$Z$157,7,FALSE),\"\")","v":""},33,null,"Quentin_33",{"$f":"IFERROR(VLOOKUP(AF35,Choixeleves!$M$12:$Z$157,3,FALSE),\"\")","v":""},{"$f":"IFERROR(VLOOKUP(AF35,Choixeleves!$M$12:$Z$157,5,FALSE),\"\")","v":""},{"$f":"IFERROR(VLOOKUP(AF35,Choixeleves!$M$12:$Z$157,6,FALSE),\"\")","v":""},{"$f":"IFERROR(VLOOKUP(AF35,Choixeleves!$M$12:$Z$157,7,FALSE),\"\")","v":""},33,null,"Mick_33",{"$f":"IFERROR(VLOOKUP(AM35,Choixeleves!$M$12:$Z$157,3,FALSE),\"\")","v":""},{"$f":"IFERROR(VLOOKUP(AM35,Choixeleves!$M$12:$Z$157,5,FALSE),\"\")","v":""},{"$f":"IFERROR(VLOOKUP(AM35,Choixeleves!$M$12:$Z$157,6,FALSE),\"\")","v":""},{"$f":"IFERROR(VLOOKUP(AM35,Choixeleves!$M$12:$Z$157,7,FALSE),\"\")","v":""},33]
[null,null,null,null,null,null,null,null,null,null,"Rémi_34",{"$f":"IFERROR(VLOOKUP(K36,Choixeleves!$M$12:$Z$157,3,FALSE),\"\")","v":""},{"$f":"IFERROR(VLOOKUP(K36,Choixeleves!$M$12:$Z$157,5,FALSE),\"\")","v":""},{"$f":"IFERROR(VLOOKUP(K36,Choixeleves!$M$12:$Z$157,6,FALSE),\"\")","v":""},{"$f":"IFERROR(VLOOKUP(K36,Choixeleves!$M$12:$Z$157,7,FALSE),\"\")","v":""},34,null,"Timothée_34",{"$f":"IFERROR(VLOOKUP(R36,Choixeleves!$M$12:$Z$157,3,FALSE),\"\")","v":""},{"$f":"IFERROR(VLOOKUP(R36,Choixeleves!$M$12:$Z$157,5,FALSE),\"\")","v":""},{"$f":"IFERROR(VLOOKUP(R36,Choixeleves!$M$12:$Z$157,6,FALSE),\"\")","v":""},{"$f":"IFERROR(VLOOKUP(R36,Choixeleves!$M$12:$Z$157,7,FALSE),\"\")","v":""},34,null,"Virginie_34",{"$f":"IFERROR(VLOOKUP(Y36,Choixeleves!$M$12:$Z$157,3,FALSE),\"\")","v":""},{"$f":"IFERROR(VLOOKUP(Y36,Choixeleves!$M$12:$Z$157,5,FALSE),\"\")","v":""},{"$f":"IFERROR(VLOOKUP(Y36,Choixeleves!$M$12:$Z$157,6,FALSE),\"\")","v":""},{"$f":"IFERROR(VLOOKUP(Y36,Choixeleves!$M$12:$Z$157,7,FALSE),\"\")","v":""},34,null,"Quentin_34",{"$f":"IFERROR(VLOOKUP(AF36,Choixeleves!$M$12:$Z$157,3,FALSE),\"\")","v":""},{"$f":"IFERROR(VLOOKUP(AF36,Choixeleves!$M$12:$Z$157,5,FALSE),\"\")","v":""},{"$f":"IFERROR(VLOOKUP(AF36,Choixeleves!$M$12:$Z$157,6,FALSE),\"\")","v":""},{"$f":"IFERROR(VLOOKUP(AF36,Choixeleves!$M$12:$Z$157,7,FALSE),\"\")","v":""},34,null,"Mick_34",{"$f":"IFERROR(VLOOKUP(AM36,Choixeleves!$M$12:$Z$157,3,FALSE),\"\")","v":""},{"$f":"IFERROR(VLOOKUP(AM36,Choixeleves!$M$12:$Z$157,5,FALSE),\"\")","v":""},{"$f":"IFERROR(VLOOKUP(AM36,Choixeleves!$M$12:$Z$157,6,FALSE),\"\")","v":""},{"$f":"IFERROR(VLOOKUP(AM36,Choixeleves!$M$12:$Z$157,7,FALSE),\"\")","v":""},34]
[null,null,null,null,null,null,null,null,null,null,"Rémi_35",{"$f":"IFERROR(VLOOKUP(K37,Choixeleves!$M$12:$Z$157,3,FALSE),\"\")","v":""},{"$f":"IFERROR(VLOOKUP(K37,Choixeleves!$M$12:$Z$157,5,FALSE),\"\")","v":""},{"$f":"IFERROR(VLOOKUP(K37,Choixeleves!$M$12:$Z$157,6,FALSE),\"\")","v":""},{"$f":"IFERROR(VLOOKUP(K37,Choixeleves!$M$12:$Z$157,7,FALSE),\"\")","v":""},35,null,"Timothée_35",{"$f":"IFERROR(VLOOKUP(R37,Choixeleves!$M$12:$Z$157,3,FALSE),\"\")","v":""},{"$f":"IFERROR(VLOOKUP(R37,Choixeleves!$M$12:$Z$157,5,FALSE),\"\")","v":""},{"$f":"IFERROR(VLOOKUP(R37,Choixeleves!$M$12:$Z$157,6,FALSE),\"\")","v":""},{"$f":"IFERROR(VLOOKUP(R37,Choixeleves!$M$12:$Z$157,7,FALSE),\"\")","v":""},35,null,"Virginie_35",{"$f":"IFERROR(VLOOKUP(Y37,Choixeleves!$M$12:$Z$157,3,FALSE),\"\")","v":""},{"$f":"IFERROR(VLOOKUP(Y37,Choixeleves!$M$12:$Z$157,5,FALSE),\"\")","v":""},{"$f":"IFERROR(VLOOKUP(Y37,Choixeleves!$M$12:$Z$157,6,FALSE),\"\")","v":""},{"$f":"IFERROR(VLOOKUP(Y37,Choixeleves!$M$12:$Z$157,7,FALSE),\"\")","v":""},35,null,"Quentin_35",{"$f":"IFERROR(VLOOKUP(AF37,Choixeleves!$M$12:$Z$157,3,FALSE),\"\")","v":""},{"$f":"IFERROR(VLOOKUP(AF37,Choixeleves!$M$12:$Z$157,5,FALSE),\"\")","v":""},{"$f":"IFERROR(VLOOKUP(AF37,Choixeleves!$M$12:$Z$157,6,FALSE),\"\")","v":""},{"$f":"IFERROR(VLOOKUP(AF37,Choixeleves!$M$12:$Z$157,7,FALSE),\"\")","v":""},35,null,"Mick_35",{"$f":"IFERROR(VLOOKUP(AM37,Choixeleves!$M$12:$Z$157,3,FALSE),\"\")","v":""},{"$f":"IFERROR(VLOOKUP(AM37,Choixeleves!$M$12:$Z$157,5,FALSE),\"\")","v":""},{"$f":"IFERROR(VLOOKUP(AM37,Choixeleves!$M$12:$Z$157,6,FALSE),\"\")","v":""},{"$f":"IFERROR(VLOOKUP(AM37,Choixeleves!$M$12:$Z$157,7,FALSE),\"\")","v":""},35]
[null,null,null,null,null,null,null,null,null,null,"Rémi_36",{"$f":"IFERROR(VLOOKUP(K38,Choixeleves!$M$12:$Z$157,3,FALSE),\"\")","v":""},{"$f":"IFERROR(VLOOKUP(K38,Choixeleves!$M$12:$Z$157,5,FALSE),\"\")","v":""},{"$f":"IFERROR(VLOOKUP(K38,Choixeleves!$M$12:$Z$157,6,FALSE),\"\")","v":""},{"$f":"IFERROR(VLOOKUP(K38,Choixeleves!$M$12:$Z$157,7,FALSE),\"\")","v":""},36,null,"Timothée_36",{"$f":"IFERROR(VLOOKUP(R38,Choixeleves!$M$12:$Z$157,3,FALSE),\"\")","v":""},{"$f":"IFERROR(VLOOKUP(R38,Choixeleves!$M$12:$Z$157,5,FALSE),\"\")","v":""},{"$f":"IFERROR(VLOOKUP(R38,Choixeleves!$M$12:$Z$157,6,FALSE),\"\")","v":""},{"$f":"IFERROR(VLOOKUP(R38,Choixeleves!$M$12:$Z$157,7,FALSE),\"\")","v":""},36,null,"Virginie_36",{"$f":"IFERROR(VLOOKUP(Y38,Choixeleves!$M$12:$Z$157,3,FALSE),\"\")","v":""},{"$f":"IFERROR(VLOOKUP(Y38,Choixeleves!$M$12:$Z$157,5,FALSE),\"\")","v":""},{"$f":"IFERROR(VLOOKUP(Y38,Choixeleves!$M$12:$Z$157,6,FALSE),\"\")","v":""},{"$f":"IFERROR(VLOOKUP(Y38,Choixeleves!$M$12:$Z$157,7,FALSE),\"\")","v":""},36,null,"Quentin_36",{"$f":"IFERROR(VLOOKUP(AF38,Choixeleves!$M$12:$Z$157,3,FALSE),\"\")","v":""},{"$f":"IFERROR(VLOOKUP(AF38,Choixeleves!$M$12:$Z$157,5,FALSE),\"\")","v":""},{"$f":"IFERROR(VLOOKUP(AF38,Choixeleves!$M$12:$Z$157,6,FALSE),\"\")","v":""},{"$f":"IFERROR(VLOOKUP(AF38,Choixeleves!$M$12:$Z$157,7,FALSE),\"\")","v":""},36,null,"Mick_36",{"$f":"IFERROR(VLOOKUP(AM38,Choixeleves!$M$12:$Z$157,3,FALSE),\"\")","v":""},{"$f":"IFERROR(VLOOKUP(AM38,Choixeleves!$M$12:$Z$157,5,FALSE),\"\")","v":""},{"$f":"IFERROR(VLOOKUP(AM38,Choixeleves!$M$12:$Z$157,6,FALSE),\"\")","v":""},{"$f":"IFERROR(VLOOKUP(AM38,Choixeleves!$M$12:$Z$157,7,FALSE),\"\")","v":""},36]
[null,null,null,null,null,null,null,null,null,null,"Rémi_37",{"$f":"IFERROR(VLOOKUP(K39,Choixeleves!$M$12:$Z$157,3,FALSE),\"\")","v":""},{"$f":"IFERROR(VLOOKUP(K39,Choixeleves!$M$12:$Z$157,5,FALSE),\"\")","v":""},{"$f":"IFERROR(VLOOKUP(K39,Choixeleves!$M$12:$Z$157,6,FALSE),\"\")","v":""},{"$f":"IFERROR(VLOOKUP(K39,Choixeleves!$M$12:$Z$157,7,FALSE),\"\")","v":""},37,null,"Timothée_37",{"$f":"IFERROR(VLOOKUP(R39,Choixeleves!$M$12:$Z$157,3,FALSE),\"\")","v":""},{"$f":"IFERROR(VLOOKUP(R39,Choixeleves!$M$12:$Z$157,5,FALSE),\"\")","v":""},{"$f":"IFERROR(VLOOKUP(R39,Choixeleves!$M$12:$Z$157,6,FALSE),\"\")","v":""},{"$f":"IFERROR(VLOOKUP(R39,Choixeleves!$M$12:$Z$157,7,FALSE),\"\")","v":""},37,null,"Virginie_37",{"$f":"IFERROR(VLOOKUP(Y39,Choixeleves!$M$12:$Z$157,3,FALSE),\"\")","v":""},{"$f":"IFERROR(VLOOKUP(Y39,Choixeleves!$M$12:$Z$157,5,FALSE),\"\")","v":""},{"$f":"IFERROR(VLOOKUP(Y39,Choixeleves!$M$12:$Z$157,6,FALSE),\"\")","v":""},{"$f":"IFERROR(VLOOKUP(Y39,Choixeleves!$M$12:$Z$157,7,FALSE),\"\")","v":""},37,null,"Quentin_37",{"$f":"IFERROR(VLOOKUP(AF39,Choixeleves!$M$12:$Z$157,3,FALSE),\"\")","v":""},{"$f":"IFERROR(VLOOKUP(AF39,Choixeleves!$M$12:$Z$157,5,FALSE),\"\")","v":""},{"$f":"IFERROR(VLOOKUP(AF39,Choixeleves!$M$12:$Z$157,6,FALSE),\"\")","v":""},{"$f":"IFERROR(VLOOKUP(AF39,Choixeleves!$M$12:$Z$157,7,FALSE),\"\")","v":""},37,null,"Mick_37",{"$f":"IFERROR(VLOOKUP(AM39,Choixeleves!$M$12:$Z$157,3,FALSE),\"\")","v":""},{"$f":"IFERROR(VLOOKUP(AM39,Choixeleves!$M$12:$Z$157,5,FALSE),\"\")","v":""},{"$f":"IFERROR(VLOOKUP(AM39,Choixeleves!$M$12:$Z$157,6,FALSE),\"\")","v":""},{"$f":"IFERROR(VLOOKUP(AM39,Choixeleves!$M$12:$Z$157,7,FALSE),\"\")","v":""},37]
[null,null,null,null,null,null,null,null,null,null,"Rémi_38",{"$f":"IFERROR(VLOOKUP(K40,Choixeleves!$M$12:$Z$157,3,FALSE),\"\")","v":""},{"$f":"IFERROR(VLOOKUP(K40,Choixeleves!$M$12:$Z$157,5,FALSE),\"\")","v":""},{"$f":"IFERROR(VLOOKUP(K40,Choixeleves!$M$12:$Z$157,6,FALSE),\"\")","v":""},{"$f":"IFERROR(VLOOKUP(K40,Choixeleves!$M$12:$Z$157,7,FALSE),\"\")","v":""},38,null,"Timothée_38",{"$f":"IFERROR(VLOOKUP(R40,Choixeleves!$M$12:$Z$157,3,FALSE),\"\")","v":""},{"$f":"IFERROR(VLOOKUP(R40,Choixeleves!$M$12:$Z$157,5,FALSE),\"\")","v":""},{"$f":"IFERROR(VLOOKUP(R40,Choixeleves!$M$12:$Z$157,6,FALSE),\"\")","v":""},{"$f":"IFERROR(VLOOKUP(R40,Choixeleves!$M$12:$Z$157,7,FALSE),\"\")","v":""},38,null,"Virginie_38",{"$f":"IFERROR(VLOOKUP(Y40,Choixeleves!$M$12:$Z$157,3,FALSE),\"\")","v":""},{"$f":"IFERROR(VLOOKUP(Y40,Choixeleves!$M$12:$Z$157,5,FALSE),\"\")","v":""},{"$f":"IFERROR(VLOOKUP(Y40,Choixeleves!$M$12:$Z$157,6,FALSE),\"\")","v":""},{"$f":"IFERROR(VLOOKUP(Y40,Choixeleves!$M$12:$Z$157,7,FALSE),\"\")","v":""},38,null,"Quentin_38",{"$f":"IFERROR(VLOOKUP(AF40,Choixeleves!$M$12:$Z$157,3,FALSE),\"\")","v":""},{"$f":"IFERROR(VLOOKUP(AF40,Choixeleves!$M$12:$Z$157,5,FALSE),\"\")","v":""},{"$f":"IFERROR(VLOOKUP(AF40,Choixeleves!$M$12:$Z$157,6,FALSE),\"\")","v":""},{"$f":"IFERROR(VLOOKUP(AF40,Choixeleves!$M$12:$Z$157,7,FALSE),\"\")","v":""},38,null,"Mick_38",{"$f":"IFERROR(VLOOKUP(AM40,Choixeleves!$M$12:$Z$157,3,FALSE),\"\")","v":""},{"$f":"IFERROR(VLOOKUP(AM40,Choixeleves!$M$12:$Z$157,5,FALSE),\"\")","v":""},{"$f":"IFERROR(VLOOKUP(AM40,Choixeleves!$M$12:$Z$157,6,FALSE),\"\")","v":""},{"$f":"IFERROR(VLOOKUP(AM40,Choixeleves!$M$12:$Z$157,7,FALSE),\"\")","v":""},38]
[null,null,null,null,null,null,null,null,null,null,"Rémi_39",{"$f":"IFERROR(VLOOKUP(K41,Choixeleves!$M$12:$Z$157,3,FALSE),\"\")","v":""},{"$f":"IFERROR(VLOOKUP(K41,Choixeleves!$M$12:$Z$157,5,FALSE),\"\")","v":""},{"$f":"IFERROR(VLOOKUP(K41,Choixeleves!$M$12:$Z$157,6,FALSE),\"\")","v":""},{"$f":"IFERROR(VLOOKUP(K41,Choixeleves!$M$12:$Z$157,7,FALSE),\"\")","v":""},39,null,"Timothée_39",{"$f":"IFERROR(VLOOKUP(R41,Choixeleves!$M$12:$Z$157,3,FALSE),\"\")","v":""},{"$f":"IFERROR(VLOOKUP(R41,Choixeleves!$M$12:$Z$157,5,FALSE),\"\")","v":""},{"$f":"IFERROR(VLOOKUP(R41,Choixeleves!$M$12:$Z$157,6,FALSE),\"\")","v":""},{"$f":"IFERROR(VLOOKUP(R41,Choixeleves!$M$12:$Z$157,7,FALSE),\"\")","v":""},39,null,"Virginie_39",{"$f":"IFERROR(VLOOKUP(Y41,Choixeleves!$M$12:$Z$157,3,FALSE),\"\")","v":""},{"$f":"IFERROR(VLOOKUP(Y41,Choixeleves!$M$12:$Z$157,5,FALSE),\"\")","v":""},{"$f":"IFERROR(VLOOKUP(Y41,Choixeleves!$M$12:$Z$157,6,FALSE),\"\")","v":""},{"$f":"IFERROR(VLOOKUP(Y41,Choixeleves!$M$12:$Z$157,7,FALSE),\"\")","v":""},39,null,"Quentin_39",{"$f":"IFERROR(VLOOKUP(AF41,Choixeleves!$M$12:$Z$157,3,FALSE),\"\")","v":""},{"$f":"IFERROR(VLOOKUP(AF41,Choixeleves!$M$12:$Z$157,5,FALSE),\"\")","v":""},{"$f":"IFERROR(VLOOKUP(AF41,Choixeleves!$M$12:$Z$157,6,FALSE),\"\")","v":""},{"$f":"IFERROR(VLOOKUP(AF41,Choixeleves!$M$12:$Z$157,7,FALSE),\"\")","v":""},39,null,"Mick_39",{"$f":"IFERROR(VLOOKUP(AM41,Choixeleves!$M$12:$Z$157,3,FALSE),\"\")","v":""},{"$f":"IFERROR(VLOOKUP(AM41,Choixeleves!$M$12:$Z$157,5,FALSE),\"\")","v":""},{"$f":"IFERROR(VLOOKUP(AM41,Choixeleves!$M$12:$Z$157,6,FALSE),\"\")","v":""},{"$f":"IFERROR(VLOOKUP(AM41,Choixeleves!$M$12:$Z$157,7,FALSE),\"\")","v":""},39]
[null,null,null,null,null,null,null,null,null,null,"Rémi_40",{"$f":"IFERROR(VLOOKUP(K42,Choixeleves!$M$12:$Z$157,3,FALSE),\"\")","v":""},{"$f":"IFERROR(VLOOKUP(K42,Choixeleves!$M$12:$Z$157,5,FALSE),\"\")","v":""},{"$f":"IFERROR(VLOOKUP(K42,Choixeleves!$M$12:$Z$157,6,FALSE),\"\")","v":""},{"$f":"IFERROR(VLOOKUP(K42,Choixeleves!$M$12:$Z$157,7,FALSE),\"\")","v":""},40,null,"Timothée_40",{"$f":"IFERROR(VLOOKUP(R42,Choixeleves!$M$12:$Z$157,3,FALSE),\"\")","v":""},{"$f":"IFERROR(VLOOKUP(R42,Choixeleves!$M$12:$Z$157,5,FALSE),\"\")","v":""},{"$f":"IFERROR(VLOOKUP(R42,Choixeleves!$M$12:$Z$157,6,FALSE),\"\")","v":""},{"$f":"IFERROR(VLOOKUP(R42,Choixeleves!$M$12:$Z$157,7,FALSE),\"\")","v":""},40,null,"Virginie_40",{"$f":"IFERROR(VLOOKUP(Y42,Choixeleves!$M$12:$Z$157,3,FALSE),\"\")","v":""},{"$f":"IFERROR(VLOOKUP(Y42,Choixeleves!$M$12:$Z$157,5,FALSE),\"\")","v":""},{"$f":"IFERROR(VLOOKUP(Y42,Choixeleves!$M$12:$Z$157,6,FALSE),\"\")","v":""},{"$f":"IFERROR(VLOOKUP(Y42,Choixeleves!$M$12:$Z$157,7,FALSE),\"\")","v":""},40,null,"Quentin_40",{"$f":"IFERROR(VLOOKUP(AF42,Choixeleves!$M$12:$Z$157,3,FALSE),\"\")","v":""},{"$f":"IFERROR(VLOOKUP(AF42,Choixeleves!$M$12:$Z$157,5,FALSE),\"\")","v":""},{"$f":"IFERROR(VLOOKUP(AF42,Choixeleves!$M$12:$Z$157,6,FALSE),\"\")","v":""},{"$f":"IFERROR(VLOOKUP(AF42,Choixeleves!$M$12:$Z$157,7,FALSE),\"\")","v":""},40,null,"Mick_40",{"$f":"IFERROR(VLOOKUP(AM42,Choixeleves!$M$12:$Z$157,3,FALSE),\"\")","v":""},{"$f":"IFERROR(VLOOKUP(AM42,Choixeleves!$M$12:$Z$157,5,FALSE),\"\")","v":""},{"$f":"IFERROR(VLOOKUP(AM42,Choixeleves!$M$12:$Z$157,6,FALSE),\"\")","v":""},{"$f":"IFERROR(VLOOKUP(AM42,Choixeleves!$M$12:$Z$157,7,FALSE),\"\")","v":""},40]
[null,null,null,null,null,null,null,null,null,null,"Rémi_41",{"$f":"IFERROR(VLOOKUP(K43,Choixeleves!$M$12:$Z$157,3,FALSE),\"\")","v":""},{"$f":"IFERROR(VLOOKUP(K43,Choixeleves!$M$12:$Z$157,5,FALSE),\"\")","v":""},{"$f":"IFERROR(VLOOKUP(K43,Choixeleves!$M$12:$Z$157,6,FALSE),\"\")","v":""},{"$f":"IFERROR(VLOOKUP(K43,Choixeleves!$M$12:$Z$157,7,FALSE),\"\")","v":""},41,null,"Timothée_41",{"$f":"IFERROR(VLOOKUP(R43,Choixeleves!$M$12:$Z$157,3,FALSE),\"\")","v":""},{"$f":"IFERROR(VLOOKUP(R43,Choixeleves!$M$12:$Z$157,5,FALSE),\"\")","v":""},{"$f":"IFERROR(VLOOKUP(R43,Choixeleves!$M$12:$Z$157,6,FALSE),\"\")","v":""},{"$f":"IFERROR(VLOOKUP(R43,Choixeleves!$M$12:$Z$157,7,FALSE),\"\")","v":""},41,null,"Virginie_41",{"$f":"IFERROR(VLOOKUP(Y43,Choixeleves!$M$12:$Z$157,3,FALSE),\"\")","v":""},{"$f":"IFERROR(VLOOKUP(Y43,Choixeleves!$M$12:$Z$157,5,FALSE),\"\")","v":""},{"$f":"IFERROR(VLOOKUP(Y43,Choixeleves!$M$12:$Z$157,6,FALSE),\"\")","v":""},{"$f":"IFERROR(VLOOKUP(Y43,Choixeleves!$M$12:$Z$157,7,FALSE),\"\")","v":""},41,null,"Quentin_41",{"$f":"IFERROR(VLOOKUP(AF43,Choixeleves!$M$12:$Z$157,3,FALSE),\"\")","v":""},{"$f":"IFERROR(VLOOKUP(AF43,Choixeleves!$M$12:$Z$157,5,FALSE),\"\")","v":""},{"$f":"IFERROR(VLOOKUP(AF43,Choixeleves!$M$12:$Z$157,6,FALSE),\"\")","v":""},{"$f":"IFERROR(VLOOKUP(AF43,Choixeleves!$M$12:$Z$157,7,FALSE),\"\")","v":""},41,null,"Mick_41",{"$f":"IFERROR(VLOOKUP(AM43,Choixeleves!$M$12:$Z$157,3,FALSE),\"\")","v":""},{"$f":"IFERROR(VLOOKUP(AM43,Choixeleves!$M$12:$Z$157,5,FALSE),\"\")","v":""},{"$f":"IFERROR(VLOOKUP(AM43,Choixeleves!$M$12:$Z$157,6,FALSE),\"\")","v":""},{"$f":"IFERROR(VLOOKUP(AM43,Choixeleves!$M$12:$Z$157,7,FALSE),\"\")","v":""},41]
[null,null,null,null,null,null,null,null,null,null,"Rémi_42",{"$f":"IFERROR(VLOOKUP(K44,Choixeleves!$M$12:$Z$157,3,FALSE),\"\")","v":""},{"$f":"IFERROR(VLOOKUP(K44,Choixeleves!$M$12:$Z$157,5,FALSE),\"\")","v":""},{"$f":"IFERROR(VLOOKUP(K44,Choixeleves!$M$12:$Z$157,6,FALSE),\"\")","v":""},{"$f":"IFERROR(VLOOKUP(K44,Choixeleves!$M$12:$Z$157,7,FALSE),\"\")","v":""},42,null,"Timothée_42",{"$f":"IFERROR(VLOOKUP(R44,Choixeleves!$M$12:$Z$157,3,FALSE),\"\")","v":""},{"$f":"IFERROR(VLOOKUP(R44,Choixeleves!$M$12:$Z$157,5,FALSE),\"\")","v":""},{"$f":"IFERROR(VLOOKUP(R44,Choixeleves!$M$12:$Z$157,6,FALSE),\"\")","v":""},{"$f":"IFERROR(VLOOKUP(R44,Choixeleves!$M$12:$Z$157,7,FALSE),\"\")","v":""},42,null,"Virginie_42",{"$f":"IFERROR(VLOOKUP(Y44,Choixeleves!$M$12:$Z$157,3,FALSE),\"\")","v":""},{"$f":"IFERROR(VLOOKUP(Y44,Choixeleves!$M$12:$Z$157,5,FALSE),\"\")","v":""},{"$f":"IFERROR(VLOOKUP(Y44,Choixeleves!$M$12:$Z$157,6,FALSE),\"\")","v":""},{"$f":"IFERROR(VLOOKUP(Y44,Choixeleves!$M$12:$Z$157,7,FALSE),\"\")","v":""},42,null,"Quentin_42",{"$f":"IFERROR(VLOOKUP(AF44,Choixeleves!$M$12:$Z$157,3,FALSE),\"\")","v":""},{"$f":"IFERROR(VLOOKUP(AF44,Choixeleves!$M$12:$Z$157,5,FALSE),\"\")","v":""},{"$f":"IFERROR(VLOOKUP(AF44,Choixeleves!$M$12:$Z$157,6,FALSE),\"\")","v":""},{"$f":"IFERROR(VLOOKUP(AF44,Choixeleves!$M$12:$Z$157,7,FALSE),\"\")","v":""},42,null,"Mick_42",{"$f":"IFERROR(VLOOKUP(AM44,Choixeleves!$M$12:$Z$157,3,FALSE),\"\")","v":""},{"$f":"IFERROR(VLOOKUP(AM44,Choixeleves!$M$12:$Z$157,5,FALSE),\"\")","v":""},{"$f":"IFERROR(VLOOKUP(AM44,Choixeleves!$M$12:$Z$157,6,FALSE),\"\")","v":""},{"$f":"IFERROR(VLOOKUP(AM44,Choixeleves!$M$12:$Z$157,7,FALSE),\"\")","v":""},42]
[null,null,null,null,null,null,null,null,null,null,"Rémi_43",{"$f":"IFERROR(VLOOKUP(K45,Choixeleves!$M$12:$Z$157,3,FALSE),\"\")","v":""},{"$f":"IFERROR(VLOOKUP(K45,Choixeleves!$M$12:$Z$157,5,FALSE),\"\")","v":""},{"$f":"IFERROR(VLOOKUP(K45,Choixeleves!$M$12:$Z$157,6,FALSE),\"\")","v":""},{"$f":"IFERROR(VLOOKUP(K45,Choixeleves!$M$12:$Z$157,7,FALSE),\"\")","v":""},43,null,"Timothée_43",{"$f":"IFERROR(VLOOKUP(R45,Choixeleves!$M$12:$Z$157,3,FALSE),\"\")","v":""},{"$f":"IFERROR(VLOOKUP(R45,Choixeleves!$M$12:$Z$157,5,FALSE),\"\")","v":""},{"$f":"IFERROR(VLOOKUP(R45,Choixeleves!$M$12:$Z$157,6,FALSE),\"\")","v":""},{"$f":"IFERROR(VLOOKUP(R45,Choixeleves!$M$12:$Z$157,7,FALSE),\"\")","v":""},43,null,"Virginie_43",{"$f":"IFERROR(VLOOKUP(Y45,Choixeleves!$M$12:$Z$157,3,FALSE),\"\")","v":""},{"$f":"IFERROR(VLOOKUP(Y45,Choixeleves!$M$12:$Z$157,5,FALSE),\"\")","v":""},{"$f":"IFERROR(VLOOKUP(Y45,Choixeleves!$M$12:$Z$157,6,FALSE),\"\")","v":""},{"$f":"IFERROR(VLOOKUP(Y45,Choixeleves!$M$12:$Z$157,7,FALSE),\"\")","v":""},43,null,"Quentin_43",{"$f":"IFERROR(VLOOKUP(AF45,Choixeleves!$M$12:$Z$157,3,FALSE),\"\")","v":""},{"$f":"IFERROR(VLOOKUP(AF45,Choixeleves!$M$12:$Z$157,5,FALSE),\"\")","v":""},{"$f":"IFERROR(VLOOKUP(AF45,Choixeleves!$M$12:$Z$157,6,FALSE),\"\")","v":""},{"$f":"IFERROR(VLOOKUP(AF45,Choixeleves!$M$12:$Z$157,7,FALSE),\"\")","v":""},43,null,"Mick_43",{"$f":"IFERROR(VLOOKUP(AM45,Choixeleves!$M$12:$Z$157,3,FALSE),\"\")","v":""},{"$f":"IFERROR(VLOOKUP(AM45,Choixeleves!$M$12:$Z$157,5,FALSE),\"\")","v":""},{"$f":"IFERROR(VLOOKUP(AM45,Choixeleves!$M$12:$Z$157,6,FALSE),\"\")","v":""},{"$f":"IFERROR(VLOOKUP(AM45,Choixeleves!$M$12:$Z$157,7,FALSE),\"\")","v":""},43]
[null,null,null,null,null,null,null,null,null,null,"Rémi_44",{"$f":"IFERROR(VLOOKUP(K46,Choixeleves!$M$12:$Z$157,3,FALSE),\"\")","v":""},{"$f":"IFERROR(VLOOKUP(K46,Choixeleves!$M$12:$Z$157,5,FALSE),\"\")","v":""},{"$f":"IFERROR(VLOOKUP(K46,Choixeleves!$M$12:$Z$157,6,FALSE),\"\")","v":""},{"$f":"IFERROR(VLOOKUP(K46,Choixeleves!$M$12:$Z$157,7,FALSE),\"\")","v":""},44,null,"Timothée_44",{"$f":"IFERROR(VLOOKUP(R46,Choixeleves!$M$12:$Z$157,3,FALSE),\"\")","v":""},{"$f":"IFERROR(VLOOKUP(R46,Choixeleves!$M$12:$Z$157,5,FALSE),\"\")","v":""},{"$f":"IFERROR(VLOOKUP(R46,Choixeleves!$M$12:$Z$157,6,FALSE),\"\")","v":""},{"$f":"IFERROR(VLOOKUP(R46,Choixeleves!$M$12:$Z$157,7,FALSE),\"\")","v":""},44,null,"Virginie_44",{"$f":"IFERROR(VLOOKUP(Y46,Choixeleves!$M$12:$Z$157,3,FALSE),\"\")","v":""},{"$f":"IFERROR(VLOOKUP(Y46,Choixeleves!$M$12:$Z$157,5,FALSE),\"\")","v":""},{"$f":"IFERROR(VLOOKUP(Y46,Choixeleves!$M$12:$Z$157,6,FALSE),\"\")","v":""},{"$f":"IFERROR(VLOOKUP(Y46,Choixeleves!$M$12:$Z$157,7,FALSE),\"\")","v":""},44,null,"Quentin_44",{"$f":"IFERROR(VLOOKUP(AF46,Choixeleves!$M$12:$Z$157,3,FALSE),\"\")","v":""},{"$f":"IFERROR(VLOOKUP(AF46,Choixeleves!$M$12:$Z$157,5,FALSE),\"\")","v":""},{"$f":"IFERROR(VLOOKUP(AF46,Choixeleves!$M$12:$Z$157,6,FALSE),\"\")","v":""},{"$f":"IFERROR(VLOOKUP(AF46,Choixeleves!$M$12:$Z$157,7,FALSE),\"\")","v":""},44,null,"Mick_44",{"$f":"IFERROR(VLOOKUP(AM46,Choixeleves!$M$12:$Z$157,3,FALSE),\"\")","v":""},{"$f":"IFERROR(VLOOKUP(AM46,Choixeleves!$M$12:$Z$157,5,FALSE),\"\")","v":""},{"$f":"IFERROR(VLOOKUP(AM46,Choixeleves!$M$12:$Z$157,6,FALSE),\"\")","v":""},{"$f":"IFERROR(VLOOKUP(AM46,Choixeleves!$M$12:$Z$157,7,FALSE),\"\")","v":""},44]
[null,null,null,null,null,null,null,null,null,null,"Rémi_45",{"$f":"IFERROR(VLOOKUP(K47,Choixeleves!$M$12:$Z$157,3,FALSE),\"\")","v":""},{"$f":"IFERROR(VLOOKUP(K47,Choixeleves!$M$12:$Z$157,5,FALSE),\"\")","v":""},{"$f":"IFERROR(VLOOKUP(K47,Choixeleves!$M$12:$Z$157,6,FALSE),\"\")","v":""},{"$f":"IFERROR(VLOOKUP(K47,Choixeleves!$M$12:$Z$157,7,FALSE),\"\")","v":""},45,null,"Timothée_45",{"$f":"IFERROR(VLOOKUP(R47,Choixeleves!$M$12:$Z$157,3,FALSE),\"\")","v":""},{"$f":"IFERROR(VLOOKUP(R47,Choixeleves!$M$12:$Z$157,5,FALSE),\"\")","v":""},{"$f":"IFERROR(VLOOKUP(R47,Choixeleves!$M$12:$Z$157,6,FALSE),\"\")","v":""},{"$f":"IFERROR(VLOOKUP(R47,Choixeleves!$M$12:$Z$157,7,FALSE),\"\")","v":""},45,null,"Virginie_45",{"$f":"IFERROR(VLOOKUP(Y47,Choixeleves!$M$12:$Z$157,3,FALSE),\"\")","v":""},{"$f":"IFERROR(VLOOKUP(Y47,Choixeleves!$M$12:$Z$157,5,FALSE),\"\")","v":""},{"$f":"IFERROR(VLOOKUP(Y47,Choixeleves!$M$12:$Z$157,6,FALSE),\"\")","v":""},{"$f":"IFERROR(VLOOKUP(Y47,Choixeleves!$M$12:$Z$157,7,FALSE),\"\")","v":""},45,null,"Quentin_45",{"$f":"IFERROR(VLOOKUP(AF47,Choixeleves!$M$12:$Z$157,3,FALSE),\"\")","v":""},{"$f":"IFERROR(VLOOKUP(AF47,Choixeleves!$M$12:$Z$157,5,FALSE),\"\")","v":""},{"$f":"IFERROR(VLOOKUP(AF47,Choixeleves!$M$12:$Z$157,6,FALSE),\"\")","v":""},{"$f":"IFERROR(VLOOKUP(AF47,Choixeleves!$M$12:$Z$157,7,FALSE),\"\")","v":""},45,null,"Mick_45",{"$f":"IFERROR(VLOOKUP(AM47,Choixeleves!$M$12:$Z$157,3,FALSE),\"\")","v":""},{"$f":"IFERROR(VLOOKUP(AM47,Choixeleves!$M$12:$Z$157,5,FALSE),\"\")","v":""},{"$f":"IFERROR(VLOOKUP(AM47,Choixeleves!$M$12:$Z$157,6,FALSE),\"\")","v":""},{"$f":"IFERROR(VLOOKUP(AM47,Choixeleves!$M$12:$Z$157,7,FALSE),\"\")","v":""},45]
[null,null,null,null,null,null,null,null,null,null,"Rémi_46",{"$f":"IFERROR(VLOOKUP(K48,Choixeleves!$M$12:$Z$157,3,FALSE),\"\")","v":""},{"$f":"IFERROR(VLOOKUP(K48,Choixeleves!$M$12:$Z$157,5,FALSE),\"\")","v":""},{"$f":"IFERROR(VLOOKUP(K48,Choixeleves!$M$12:$Z$157,6,FALSE),\"\")","v":""},{"$f":"IFERROR(VLOOKUP(K48,Choixeleves!$M$12:$Z$157,7,FALSE),\"\")","v":""},46,null,"Timothée_46",{"$f":"IFERROR(VLOOKUP(R48,Choixeleves!$M$12:$Z$157,3,FALSE),\"\")","v":""},{"$f":"IFERROR(VLOOKUP(R48,Choixeleves!$M$12:$Z$157,5,FALSE),\"\")","v":""},{"$f":"IFERROR(VLOOKUP(R48,Choixeleves!$M$12:$Z$157,6,FALSE),\"\")","v":""},{"$f":"IFERROR(VLOOKUP(R48,Choixeleves!$M$12:$Z$157,7,FALSE),\"\")","v":""},46,null,"Virginie_46",{"$f":"IFERROR(VLOOKUP(Y48,Choixeleves!$M$12:$Z$157,3,FALSE),\"\")","v":""},{"$f":"IFERROR(VLOOKUP(Y48,Choixeleves!$M$12:$Z$157,5,FALSE),\"\")","v":""},{"$f":"IFERROR(VLOOKUP(Y48,Choixeleves!$M$12:$Z$157,6,FALSE),\"\")","v":""},{"$f":"IFERROR(VLOOKUP(Y48,Choixeleves!$M$12:$Z$157,7,FALSE),\"\")","v":""},46,null,"Quentin_46",{"$f":"IFERROR(VLOOKUP(AF48,Choixeleves!$M$12:$Z$157,3,FALSE),\"\")","v":""},{"$f":"IFERROR(VLOOKUP(AF48,Choixeleves!$M$12:$Z$157,5,FALSE),\"\")","v":""},{"$f":"IFERROR(VLOOKUP(AF48,Choixeleves!$M$12:$Z$157,6,FALSE),\"\")","v":""},{"$f":"IFERROR(VLOOKUP(AF48,Choixeleves!$M$12:$Z$157,7,FALSE),\"\")","v":""},46,null,"Mick_46",{"$f":"IFERROR(VLOOKUP(AM48,Choixeleves!$M$12:$Z$157,3,FALSE),\"\")","v":""},{"$f":"IFERROR(VLOOKUP(AM48,Choixeleves!$M$12:$Z$157,5,FALSE),\"\")","v":""},{"$f":"IFERROR(VLOOKUP(AM48,Choixeleves!$M$12:$Z$157,6,FALSE),\"\")","v":""},{"$f":"IFERROR(VLOOKUP(AM48,Choixeleves!$M$12:$Z$157,7,FALSE),\"\")","v":""},46]
[null,null,null,null,null,null,null,null,null,null,"Rémi_47",{"$f":"IFERROR(VLOOKUP(K49,Choixeleves!$M$12:$Z$157,3,FALSE),\"\")","v":""},{"$f":"IFERROR(VLOOKUP(K49,Choixeleves!$M$12:$Z$157,5,FALSE),\"\")","v":""},{"$f":"IFERROR(VLOOKUP(K49,Choixeleves!$M$12:$Z$157,6,FALSE),\"\")","v":""},{"$f":"IFERROR(VLOOKUP(K49,Choixeleves!$M$12:$Z$157,7,FALSE),\"\")","v":""},47,null,"Timothée_47",{"$f":"IFERROR(VLOOKUP(R49,Choixeleves!$M$12:$Z$157,3,FALSE),\"\")","v":""},{"$f":"IFERROR(VLOOKUP(R49,Choixeleves!$M$12:$Z$157,5,FALSE),\"\")","v":""},{"$f":"IFERROR(VLOOKUP(R49,Choixeleves!$M$12:$Z$157,6,FALSE),\"\")","v":""},{"$f":"IFERROR(VLOOKUP(R49,Choixeleves!$M$12:$Z$157,7,FALSE),\"\")","v":""},47,null,"Virginie_47",{"$f":"IFERROR(VLOOKUP(Y49,Choixeleves!$M$12:$Z$157,3,FALSE),\"\")","v":""},{"$f":"IFERROR(VLOOKUP(Y49,Choixeleves!$M$12:$Z$157,5,FALSE),\"\")","v":""},{"$f":"IFERROR(VLOOKUP(Y49,Choixeleves!$M$12:$Z$157,6,FALSE),\"\")","v":""},{"$f":"IFERROR(VLOOKUP(Y49,Choixeleves!$M$12:$Z$157,7,FALSE),\"\")","v":""},47,null,"Quentin_47",{"$f":"IFERROR(VLOOKUP(AF49,Choixeleves!$M$12:$Z$157,3,FALSE),\"\")","v":""},{"$f":"IFERROR(VLOOKUP(AF49,Choixeleves!$M$12:$Z$157,5,FALSE),\"\")","v":""},{"$f":"IFERROR(VLOOKUP(AF49,Choixeleves!$M$12:$Z$157,6,FALSE),\"\")","v":""},{"$f":"IFERROR(VLOOKUP(AF49,Choixeleves!$M$12:$Z$157,7,FALSE),\"\")","v":""},47,null,"Mick_47",{"$f":"IFERROR(VLOOKUP(AM49,Choixeleves!$M$12:$Z$157,3,FALSE),\"\")","v":""},{"$f":"IFERROR(VLOOKUP(AM49,Choixeleves!$M$12:$Z$157,5,FALSE),\"\")","v":""},{"$f":"IFERROR(VLOOKUP(AM49,Choixeleves!$M$12:$Z$157,6,FALSE),\"\")","v":""},{"$f":"IFERROR(VLOOKUP(AM49,Choixeleves!$M$12:$Z$157,7,FALSE),\"\")","v":""},47]
[null,null,null,null,null,null,null,null,null,null,"Rémi_48",{"$f":"IFERROR(VLOOKUP(K50,Choixeleves!$M$12:$Z$157,3,FALSE),\"\")","v":""},{"$f":"IFERROR(VLOOKUP(K50,Choixeleves!$M$12:$Z$157,5,FALSE),\"\")","v":""},{"$f":"IFERROR(VLOOKUP(K50,Choixeleves!$M$12:$Z$157,6,FALSE),\"\")","v":""},{"$f":"IFERROR(VLOOKUP(K50,Choixeleves!$M$12:$Z$157,7,FALSE),\"\")","v":""},48,null,"Timothée_48",{"$f":"IFERROR(VLOOKUP(R50,Choixeleves!$M$12:$Z$157,3,FALSE),\"\")","v":""},{"$f":"IFERROR(VLOOKUP(R50,Choixeleves!$M$12:$Z$157,5,FALSE),\"\")","v":""},{"$f":"IFERROR(VLOOKUP(R50,Choixeleves!$M$12:$Z$157,6,FALSE),\"\")","v":""},{"$f":"IFERROR(VLOOKUP(R50,Choixeleves!$M$12:$Z$157,7,FALSE),\"\")","v":""},48,null,"Virginie_48",{"$f":"IFERROR(VLOOKUP(Y50,Choixeleves!$M$12:$Z$157,3,FALSE),\"\")","v":""},{"$f":"IFERROR(VLOOKUP(Y50,Choixeleves!$M$12:$Z$157,5,FALSE),\"\")","v":""},{"$f":"IFERROR(VLOOKUP(Y50,Choixeleves!$M$12:$Z$157,6,FALSE),\"\")","v":""},{"$f":"IFERROR(VLOOKUP(Y50,Choixeleves!$M$12:$Z$157,7,FALSE),\"\")","v":""},48,null,"Quentin_48",{"$f":"IFERROR(VLOOKUP(AF50,Choixeleves!$M$12:$Z$157,3,FALSE),\"\")","v":""},{"$f":"IFERROR(VLOOKUP(AF50,Choixeleves!$M$12:$Z$157,5,FALSE),\"\")","v":""},{"$f":"IFERROR(VLOOKUP(AF50,Choixeleves!$M$12:$Z$157,6,FALSE),\"\")","v":""},{"$f":"IFERROR(VLOOKUP(AF50,Choixeleves!$M$12:$Z$157,7,FALSE),\"\")","v":""},48,null,"Mick_48",{"$f":"IFERROR(VLOOKUP(AM50,Choixeleves!$M$12:$Z$157,3,FALSE),\"\")","v":""},{"$f":"IFERROR(VLOOKUP(AM50,Choixeleves!$M$12:$Z$157,5,FALSE),\"\")","v":""},{"$f":"IFERROR(VLOOKUP(AM50,Choixeleves!$M$12:$Z$157,6,FALSE),\"\")","v":""},{"$f":"IFERROR(VLOOKUP(AM50,Choixeleves!$M$12:$Z$157,7,FALSE),\"\")","v":""},48]
[null,null,null,null,null,null,null,null,null,null,"Rémi_49",{"$f":"IFERROR(VLOOKUP(K51,Choixeleves!$M$12:$Z$157,3,FALSE),\"\")","v":""},{"$f":"IFERROR(VLOOKUP(K51,Choixeleves!$M$12:$Z$157,5,FALSE),\"\")","v":""},{"$f":"IFERROR(VLOOKUP(K51,Choixeleves!$M$12:$Z$157,6,FALSE),\"\")","v":""},{"$f":"IFERROR(VLOOKUP(K51,Choixeleves!$M$12:$Z$157,7,FALSE),\"\")","v":""},49,null,"Timothée_49",{"$f":"IFERROR(VLOOKUP(R51,Choixeleves!$M$12:$Z$157,3,FALSE),\"\")","v":""},{"$f":"IFERROR(VLOOKUP(R51,Choixeleves!$M$12:$Z$157,5,FALSE),\"\")","v":""},{"$f":"IFERROR(VLOOKUP(R51,Choixeleves!$M$12:$Z$157,6,FALSE),\"\")","v":""},{"$f":"IFERROR(VLOOKUP(R51,Choixeleves!$M$12:$Z$157,7,FALSE),\"\")","v":""},49,null,"Virginie_49",{"$f":"IFERROR(VLOOKUP(Y51,Choixeleves!$M$12:$Z$157,3,FALSE),\"\")","v":""},{"$f":"IFERROR(VLOOKUP(Y51,Choixeleves!$M$12:$Z$157,5,FALSE),\"\")","v":""},{"$f":"IFERROR(VLOOKUP(Y51,Choixeleves!$M$12:$Z$157,6,FALSE),\"\")","v":""},{"$f":"IFERROR(VLOOKUP(Y51,Choixeleves!$M$12:$Z$157,7,FALSE),\"\")","v":""},49,null,"Quentin_49",{"$f":"IFERROR(VLOOKUP(AF51,Choixeleves!$M$12:$Z$157,3,FALSE),\"\")","v":""},{"$f":"IFERROR(VLOOKUP(AF51,Choixeleves!$M$12:$Z$157,5,FALSE),\"\")","v":""},{"$f":"IFERROR(VLOOKUP(AF51,Choixeleves!$M$12:$Z$157,6,FALSE),\"\")","v":""},{"$f":"IFERROR(VLOOKUP(AF51,Choixeleves!$M$12:$Z$157,7,FALSE),\"\")","v":""},49,null,"Mick_49",{"$f":"IFERROR(VLOOKUP(AM51,Choixeleves!$M$12:$Z$157,3,FALSE),\"\")","v":""},{"$f":"IFERROR(VLOOKUP(AM51,Choixeleves!$M$12:$Z$157,5,FALSE),\"\")","v":""},{"$f":"IFERROR(VLOOKUP(AM51,Choixeleves!$M$12:$Z$157,6,FALSE),\"\")","v":""},{"$f":"IFERROR(VLOOKUP(AM51,Choixeleves!$M$12:$Z$157,7,FALSE),\"\")","v":""},49]
[null,null,null,null,null,null,null,null,null,null,"Rémi_50",{"$f":"IFERROR(VLOOKUP(K52,Choixeleves!$M$12:$Z$157,3,FALSE),\"\")","v":""},{"$f":"IFERROR(VLOOKUP(K52,Choixeleves!$M$12:$Z$157,5,FALSE),\"\")","v":""},{"$f":"IFERROR(VLOOKUP(K52,Choixeleves!$M$12:$Z$157,6,FALSE),\"\")","v":""},{"$f":"IFERROR(VLOOKUP(K52,Choixeleves!$M$12:$Z$157,7,FALSE),\"\")","v":""},50,null,"Timothée_50",{"$f":"IFERROR(VLOOKUP(R52,Choixeleves!$M$12:$Z$157,3,FALSE),\"\")","v":""},{"$f":"IFERROR(VLOOKUP(R52,Choixeleves!$M$12:$Z$157,5,FALSE),\"\")","v":""},{"$f":"IFERROR(VLOOKUP(R52,Choixeleves!$M$12:$Z$157,6,FALSE),\"\")","v":""},{"$f":"IFERROR(VLOOKUP(R52,Choixeleves!$M$12:$Z$157,7,FALSE),\"\")","v":""},50,null,"Virginie_50",{"$f":"IFERROR(VLOOKUP(Y52,Choixeleves!$M$12:$Z$157,3,FALSE),\"\")","v":""},{"$f":"IFERROR(VLOOKUP(Y52,Choixeleves!$M$12:$Z$157,5,FALSE),\"\")","v":""},{"$f":"IFERROR(VLOOKUP(Y52,Choixeleves!$M$12:$Z$157,6,FALSE),\"\")","v":""},{"$f":"IFERROR(VLOOKUP(Y52,Choixeleves!$M$12:$Z$157,7,FALSE),\"\")","v":""},50,null,"Quentin_50",{"$f":"IFERROR(VLOOKUP(AF52,Choixeleves!$M$12:$Z$157,3,FALSE),\"\")","v":""},{"$f":"IFERROR(VLOOKUP(AF52,Choixeleves!$M$12:$Z$157,5,FALSE),\"\")","v":""},{"$f":"IFERROR(VLOOKUP(AF52,Choixeleves!$M$12:$Z$157,6,FALSE),\"\")","v":""},{"$f":"IFERROR(VLOOKUP(AF52,Choixeleves!$M$12:$Z$157,7,FALSE),\"\")","v":""},50,null,"Mick_50",{"$f":"IFERROR(VLOOKUP(AM52,Choixeleves!$M$12:$Z$157,3,FALSE),\"\")","v":""},{"$f":"IFERROR(VLOOKUP(AM52,Choixeleves!$M$12:$Z$157,5,FALSE),\"\")","v":""},{"$f":"IFERROR(VLOOKUP(AM52,Choixeleves!$M$12:$Z$157,6,FALSE),\"\")","v":""},{"$f":"IFERROR(VLOOKUP(AM52,Choixeleves!$M$12:$Z$157,7,FALSE),\"\")","v":""},50]
[null,null,null,null,null,null,null,null,null,null,"Rémi_51",{"$f":"IFERROR(VLOOKUP(K53,Choixeleves!$M$12:$Z$157,3,FALSE),\"\")","v":""},{"$f":"IFERROR(VLOOKUP(K53,Choixeleves!$M$12:$Z$157,5,FALSE),\"\")","v":""},{"$f":"IFERROR(VLOOKUP(K53,Choixeleves!$M$12:$Z$157,6,FALSE),\"\")","v":""},{"$f":"IFERROR(VLOOKUP(K53,Choixeleves!$M$12:$Z$157,7,FALSE),\"\")","v":""},51,null,"Timothée_51",{"$f":"IFERROR(VLOOKUP(R53,Choixeleves!$M$12:$Z$157,3,FALSE),\"\")","v":""},{"$f":"IFERROR(VLOOKUP(R53,Choixeleves!$M$12:$Z$157,5,FALSE),\"\")","v":""},{"$f":"IFERROR(VLOOKUP(R53,Choixeleves!$M$12:$Z$157,6,FALSE),\"\")","v":""},{"$f":"IFERROR(VLOOKUP(R53,Choixeleves!$M$12:$Z$157,7,FALSE),\"\")","v":""},51,null,"Virginie_51",{"$f":"IFERROR(VLOOKUP(Y53,Choixeleves!$M$12:$Z$157,3,FALSE),\"\")","v":""},{"$f":"IFERROR(VLOOKUP(Y53,Choixeleves!$M$12:$Z$157,5,FALSE),\"\")","v":""},{"$f":"IFERROR(VLOOKUP(Y53,Choixeleves!$M$12:$Z$157,6,FALSE),\"\")","v":""},{"$f":"IFERROR(VLOOKUP(Y53,Choixeleves!$M$12:$Z$157,7,FALSE),\"\")","v":""},51,null,"Quentin_51",{"$f":"IFERROR(VLOOKUP(AF53,Choixeleves!$M$12:$Z$157,3,FALSE),\"\")","v":""},{"$f":"IFERROR(VLOOKUP(AF53,Choixeleves!$M$12:$Z$157,5,FALSE),\"\")","v":""},{"$f":"IFERROR(VLOOKUP(AF53,Choixeleves!$M$12:$Z$157,6,FALSE),\"\")","v":""},{"$f":"IFERROR(VLOOKUP(AF53,Choixeleves!$M$12:$Z$157,7,FALSE),\"\")","v":""},51,null,"Mick_51",{"$f":"IFERROR(VLOOKUP(AM53,Choixeleves!$M$12:$Z$157,3,FALSE),\"\")","v":""},{"$f":"IFERROR(VLOOKUP(AM53,Choixeleves!$M$12:$Z$157,5,FALSE),\"\")","v":""},{"$f":"IFERROR(VLOOKUP(AM53,Choixeleves!$M$12:$Z$157,6,FALSE),\"\")","v":""},{"$f":"IFERROR(VLOOKUP(AM53,Choixeleves!$M$12:$Z$157,7,FALSE),\"\")","v":""},51]
[null,null,null,null,null,null,null,null,null,null,"Rémi_52",{"$f":"IFERROR(VLOOKUP(K54,Choixeleves!$M$12:$Z$157,3,FALSE),\"\")","v":""},{"$f":"IFERROR(VLOOKUP(K54,Choixeleves!$M$12:$Z$157,5,FALSE),\"\")","v":""},{"$f":"IFERROR(VLOOKUP(K54,Choixeleves!$M$12:$Z$157,6,FALSE),\"\")","v":""},{"$f":"IFERROR(VLOOKUP(K54,Choixeleves!$M$12:$Z$157,7,FALSE),\"\")","v":""},52,null,"Timothée_52",{"$f":"IFERROR(VLOOKUP(R54,Choixeleves!$M$12:$Z$157,3,FALSE),\"\")","v":""},{"$f":"IFERROR(VLOOKUP(R54,Choixeleves!$M$12:$Z$157,5,FALSE),\"\")","v":""},{"$f":"IFERROR(VLOOKUP(R54,Choixeleves!$M$12:$Z$157,6,FALSE),\"\")","v":""},{"$f":"IFERROR(VLOOKUP(R54,Choixeleves!$M$12:$Z$157,7,FALSE),\"\")","v":""},52,null,"Virginie_52",{"$f":"IFERROR(VLOOKUP(Y54,Choixeleves!$M$12:$Z$157,3,FALSE),\"\")","v":""},{"$f":"IFERROR(VLOOKUP(Y54,Choixeleves!$M$12:$Z$157,5,FALSE),\"\")","v":""},{"$f":"IFERROR(VLOOKUP(Y54,Choixeleves!$M$12:$Z$157,6,FALSE),\"\")","v":""},{"$f":"IFERROR(VLOOKUP(Y54,Choixeleves!$M$12:$Z$157,7,FALSE),\"\")","v":""},52,null,"Quentin_52",{"$f":"IFERROR(VLOOKUP(AF54,Choixeleves!$M$12:$Z$157,3,FALSE),\"\")","v":""},{"$f":"IFERROR(VLOOKUP(AF54,Choixeleves!$M$12:$Z$157,5,FALSE),\"\")","v":""},{"$f":"IFERROR(VLOOKUP(AF54,Choixeleves!$M$12:$Z$157,6,FALSE),\"\")","v":""},{"$f":"IFERROR(VLOOKUP(AF54,Choixeleves!$M$12:$Z$157,7,FALSE),\"\")","v":""},52,null,"Mick_52",{"$f":"IFERROR(VLOOKUP(AM54,Choixeleves!$M$12:$Z$157,3,FALSE),\"\")","v":""},{"$f":"IFERROR(VLOOKUP(AM54,Choixeleves!$M$12:$Z$157,5,FALSE),\"\")","v":""},{"$f":"IFERROR(VLOOKUP(AM54,Choixeleves!$M$12:$Z$157,6,FALSE),\"\")","v":""},{"$f":"IFERROR(VLOOKUP(AM54,Choixeleves!$M$12:$Z$157,7,FALSE),\"\")","v":""},52]
[null,null,null,null,null,null,null,null,null,null,"Rémi_53",{"$f":"IFERROR(VLOOKUP(K55,Choixeleves!$M$12:$Z$157,3,FALSE),\"\")","v":""},{"$f":"IFERROR(VLOOKUP(K55,Choixeleves!$M$12:$Z$157,5,FALSE),\"\")","v":""},{"$f":"IFERROR(VLOOKUP(K55,Choixeleves!$M$12:$Z$157,6,FALSE),\"\")","v":""},{"$f":"IFERROR(VLOOKUP(K55,Choixeleves!$M$12:$Z$157,7,FALSE),\"\")","v":""},53,null,"Timothée_53",{"$f":"IFERROR(VLOOKUP(R55,Choixeleves!$M$12:$Z$157,3,FALSE),\"\")","v":""},{"$f":"IFERROR(VLOOKUP(R55,Choixeleves!$M$12:$Z$157,5,FALSE),\"\")","v":""},{"$f":"IFERROR(VLOOKUP(R55,Choixeleves!$M$12:$Z$157,6,FALSE),\"\")","v":""},{"$f":"IFERROR(VLOOKUP(R55,Choixeleves!$M$12:$Z$157,7,FALSE),\"\")","v":""},53,null,"Virginie_53",{"$f":"IFERROR(VLOOKUP(Y55,Choixeleves!$M$12:$Z$157,3,FALSE),\"\")","v":""},{"$f":"IFERROR(VLOOKUP(Y55,Choixeleves!$M$12:$Z$157,5,FALSE),\"\")","v":""},{"$f":"IFERROR(VLOOKUP(Y55,Choixeleves!$M$12:$Z$157,6,FALSE),\"\")","v":""},{"$f":"IFERROR(VLOOKUP(Y55,Choixeleves!$M$12:$Z$157,7,FALSE),\"\")","v":""},53,null,"Quentin_53",{"$f":"IFERROR(VLOOKUP(AF55,Choixeleves!$M$12:$Z$157,3,FALSE),\"\")","v":""},{"$f":"IFERROR(VLOOKUP(AF55,Choixeleves!$M$12:$Z$157,5,FALSE),\"\")","v":""},{"$f":"IFERROR(VLOOKUP(AF55,Choixeleves!$M$12:$Z$157,6,FALSE),\"\")","v":""},{"$f":"IFERROR(VLOOKUP(AF55,Choixeleves!$M$12:$Z$157,7,FALSE),\"\")","v":""},53,null,"Mick_53",{"$f":"IFERROR(VLOOKUP(AM55,Choixeleves!$M$12:$Z$157,3,FALSE),\"\")","v":""},{"$f":"IFERROR(VLOOKUP(AM55,Choixeleves!$M$12:$Z$157,5,FALSE),\"\")","v":""},{"$f":"IFERROR(VLOOKUP(AM55,Choixeleves!$M$12:$Z$157,6,FALSE),\"\")","v":""},{"$f":"IFERROR(VLOOKUP(AM55,Choixeleves!$M$12:$Z$157,7,FALSE),\"\")","v":""},53]
[null,null,null,null,null,null,null,null,null,null,"Rémi_54",{"$f":"IFERROR(VLOOKUP(K56,Choixeleves!$M$12:$Z$157,3,FALSE),\"\")","v":""},{"$f":"IFERROR(VLOOKUP(K56,Choixeleves!$M$12:$Z$157,5,FALSE),\"\")","v":""},{"$f":"IFERROR(VLOOKUP(K56,Choixeleves!$M$12:$Z$157,6,FALSE),\"\")","v":""},{"$f":"IFERROR(VLOOKUP(K56,Choixeleves!$M$12:$Z$157,7,FALSE),\"\")","v":""},54,null,"Timothée_54",{"$f":"IFERROR(VLOOKUP(R56,Choixeleves!$M$12:$Z$157,3,FALSE),\"\")","v":""},{"$f":"IFERROR(VLOOKUP(R56,Choixeleves!$M$12:$Z$157,5,FALSE),\"\")","v":""},{"$f":"IFERROR(VLOOKUP(R56,Choixeleves!$M$12:$Z$157,6,FALSE),\"\")","v":""},{"$f":"IFERROR(VLOOKUP(R56,Choixeleves!$M$12:$Z$157,7,FALSE),\"\")","v":""},54,null,"Virginie_54",{"$f":"IFERROR(VLOOKUP(Y56,Choixeleves!$M$12:$Z$157,3,FALSE),\"\")","v":""},{"$f":"IFERROR(VLOOKUP(Y56,Choixeleves!$M$12:$Z$157,5,FALSE),\"\")","v":""},{"$f":"IFERROR(VLOOKUP(Y56,Choixeleves!$M$12:$Z$157,6,FALSE),\"\")","v":""},{"$f":"IFERROR(VLOOKUP(Y56,Choixeleves!$M$12:$Z$157,7,FALSE),\"\")","v":""},54,null,"Quentin_54",{"$f":"IFERROR(VLOOKUP(AF56,Choixeleves!$M$12:$Z$157,3,FALSE),\"\")","v":""},{"$f":"IFERROR(VLOOKUP(AF56,Choixeleves!$M$12:$Z$157,5,FALSE),\"\")","v":""},{"$f":"IFERROR(VLOOKUP(AF56,Choixeleves!$M$12:$Z$157,6,FALSE),\"\")","v":""},{"$f":"IFERROR(VLOOKUP(AF56,Choixeleves!$M$12:$Z$157,7,FALSE),\"\")","v":""},54,null,"Mick_54",{"$f":"IFERROR(VLOOKUP(AM56,Choixeleves!$M$12:$Z$157,3,FALSE),\"\")","v":""},{"$f":"IFERROR(VLOOKUP(AM56,Choixeleves!$M$12:$Z$157,5,FALSE),\"\")","v":""},{"$f":"IFERROR(VLOOKUP(AM56,Choixeleves!$M$12:$Z$157,6,FALSE),\"\")","v":""},{"$f":"IFERROR(VLOOKUP(AM56,Choixeleves!$M$12:$Z$157,7,FALSE),\"\")","v":""},54]
[null,null,null,null,null,null,null,null,null,null,"Rémi_55",{"$f":"IFERROR(VLOOKUP(K57,Choixeleves!$M$12:$Z$157,3,FALSE),\"\")","v":""},{"$f":"IFERROR(VLOOKUP(K57,Choixeleves!$M$12:$Z$157,5,FALSE),\"\")","v":""},{"$f":"IFERROR(VLOOKUP(K57,Choixeleves!$M$12:$Z$157,6,FALSE),\"\")","v":""},{"$f":"IFERROR(VLOOKUP(K57,Choixeleves!$M$12:$Z$157,7,FALSE),\"\")","v":""},55,null,"Timothée_55",{"$f":"IFERROR(VLOOKUP(R57,Choixeleves!$M$12:$Z$157,3,FALSE),\"\")","v":""},{"$f":"IFERROR(VLOOKUP(R57,Choixeleves!$M$12:$Z$157,5,FALSE),\"\")","v":""},{"$f":"IFERROR(VLOOKUP(R57,Choixeleves!$M$12:$Z$157,6,FALSE),\"\")","v":""},{"$f":"IFERROR(VLOOKUP(R57,Choixeleves!$M$12:$Z$157,7,FALSE),\"\")","v":""},55,null,"Virginie_55",{"$f":"IFERROR(VLOOKUP(Y57,Choixeleves!$M$12:$Z$157,3,FALSE),\"\")","v":""},{"$f":"IFERROR(VLOOKUP(Y57,Choixeleves!$M$12:$Z$157,5,FALSE),\"\")","v":""},{"$f":"IFERROR(VLOOKUP(Y57,Choixeleves!$M$12:$Z$157,6,FALSE),\"\")","v":""},{"$f":"IFERROR(VLOOKUP(Y57,Choixeleves!$M$12:$Z$157,7,FALSE),\"\")","v":""},55,null,"Quentin_55",{"$f":"IFERROR(VLOOKUP(AF57,Choixeleves!$M$12:$Z$157,3,FALSE),\"\")","v":""},{"$f":"IFERROR(VLOOKUP(AF57,Choixeleves!$M$12:$Z$157,5,FALSE),\"\")","v":""},{"$f":"IFERROR(VLOOKUP(AF57,Choixeleves!$M$12:$Z$157,6,FALSE),\"\")","v":""},{"$f":"IFERROR(VLOOKUP(AF57,Choixeleves!$M$12:$Z$157,7,FALSE),\"\")","v":""},55,null,"Mick_55",{"$f":"IFERROR(VLOOKUP(AM57,Choixeleves!$M$12:$Z$157,3,FALSE),\"\")","v":""},{"$f":"IFERROR(VLOOKUP(AM57,Choixeleves!$M$12:$Z$157,5,FALSE),\"\")","v":""},{"$f":"IFERROR(VLOOKUP(AM57,Choixeleves!$M$12:$Z$157,6,FALSE),\"\")","v":""},{"$f":"IFERROR(VLOOKUP(AM57,Choixeleves!$M$12:$Z$157,7,FALSE),\"\")","v":""},55]
[null,null,null,null,null,null,null,null,null,null,"Rémi_56",{"$f":"IFERROR(VLOOKUP(K58,Choixeleves!$M$12:$Z$157,3,FALSE),\"\")","v":""},{"$f":"IFERROR(VLOOKUP(K58,Choixeleves!$M$12:$Z$157,5,FALSE),\"\")","v":""},{"$f":"IFERROR(VLOOKUP(K58,Choixeleves!$M$12:$Z$157,6,FALSE),\"\")","v":""},{"$f":"IFERROR(VLOOKUP(K58,Choixeleves!$M$12:$Z$157,7,FALSE),\"\")","v":""},56,null,"Timothée_56",{"$f":"IFERROR(VLOOKUP(R58,Choixeleves!$M$12:$Z$157,3,FALSE),\"\")","v":""},{"$f":"IFERROR(VLOOKUP(R58,Choixeleves!$M$12:$Z$157,5,FALSE),\"\")","v":""},{"$f":"IFERROR(VLOOKUP(R58,Choixeleves!$M$12:$Z$157,6,FALSE),\"\")","v":""},{"$f":"IFERROR(VLOOKUP(R58,Choixeleves!$M$12:$Z$157,7,FALSE),\"\")","v":""},56,null,"Virginie_56",{"$f":"IFERROR(VLOOKUP(Y58,Choixeleves!$M$12:$Z$157,3,FALSE),\"\")","v":""},{"$f":"IFERROR(VLOOKUP(Y58,Choixeleves!$M$12:$Z$157,5,FALSE),\"\")","v":""},{"$f":"IFERROR(VLOOKUP(Y58,Choixeleves!$M$12:$Z$157,6,FALSE),\"\")","v":""},{"$f":"IFERROR(VLOOKUP(Y58,Choixeleves!$M$12:$Z$157,7,FALSE),\"\")","v":""},56,null,"Quentin_56",{"$f":"IFERROR(VLOOKUP(AF58,Choixeleves!$M$12:$Z$157,3,FALSE),\"\")","v":""},{"$f":"IFERROR(VLOOKUP(AF58,Choixeleves!$M$12:$Z$157,5,FALSE),\"\")","v":""},{"$f":"IFERROR(VLOOKUP(AF58,Choixeleves!$M$12:$Z$157,6,FALSE),\"\")","v":""},{"$f":"IFERROR(VLOOKUP(AF58,Choixeleves!$M$12:$Z$157,7,FALSE),\"\")","v":""},56,null,"Mick_56",{"$f":"IFERROR(VLOOKUP(AM58,Choixeleves!$M$12:$Z$157,3,FALSE),\"\")","v":""},{"$f":"IFERROR(VLOOKUP(AM58,Choixeleves!$M$12:$Z$157,5,FALSE),\"\")","v":""},{"$f":"IFERROR(VLOOKUP(AM58,Choixeleves!$M$12:$Z$157,6,FALSE),\"\")","v":""},{"$f":"IFERROR(VLOOKUP(AM58,Choixeleves!$M$12:$Z$157,7,FALSE),\"\")","v":""},56]
[null,null,null,null,null,null,null,null,null,null,"Rémi_57",{"$f":"IFERROR(VLOOKUP(K59,Choixeleves!$M$12:$Z$157,3,FALSE),\"\")","v":""},{"$f":"IFERROR(VLOOKUP(K59,Choixeleves!$M$12:$Z$157,5,FALSE),\"\")","v":""},{"$f":"IFERROR(VLOOKUP(K59,Choixeleves!$M$12:$Z$157,6,FALSE),\"\")","v":""},{"$f":"IFERROR(VLOOKUP(K59,Choixeleves!$M$12:$Z$157,7,FALSE),\"\")","v":""},57,null,"Timothée_57",{"$f":"IFERROR(VLOOKUP(R59,Choixeleves!$M$12:$Z$157,3,FALSE),\"\")","v":""},{"$f":"IFERROR(VLOOKUP(R59,Choixeleves!$M$12:$Z$157,5,FALSE),\"\")","v":""},{"$f":"IFERROR(VLOOKUP(R59,Choixeleves!$M$12:$Z$157,6,FALSE),\"\")","v":""},{"$f":"IFERROR(VLOOKUP(R59,Choixeleves!$M$12:$Z$157,7,FALSE),\"\")","v":""},57,null,"Virginie_57",{"$f":"IFERROR(VLOOKUP(Y59,Choixeleves!$M$12:$Z$157,3,FALSE),\"\")","v":""},{"$f":"IFERROR(VLOOKUP(Y59,Choixeleves!$M$12:$Z$157,5,FALSE),\"\")","v":""},{"$f":"IFERROR(VLOOKUP(Y59,Choixeleves!$M$12:$Z$157,6,FALSE),\"\")","v":""},{"$f":"IFERROR(VLOOKUP(Y59,Choixeleves!$M$12:$Z$157,7,FALSE),\"\")","v":""},57,null,"Quentin_57",{"$f":"IFERROR(VLOOKUP(AF59,Choixeleves!$M$12:$Z$157,3,FALSE),\"\")","v":""},{"$f":"IFERROR(VLOOKUP(AF59,Choixeleves!$M$12:$Z$157,5,FALSE),\"\")","v":""},{"$f":"IFERROR(VLOOKUP(AF59,Choixeleves!$M$12:$Z$157,6,FALSE),\"\")","v":""},{"$f":"IFERROR(VLOOKUP(AF59,Choixeleves!$M$12:$Z$157,7,FALSE),\"\")","v":""},57,null,"Mick_57",{"$f":"IFERROR(VLOOKUP(AM59,Choixeleves!$M$12:$Z$157,3,FALSE),\"\")","v":""},{"$f":"IFERROR(VLOOKUP(AM59,Choixeleves!$M$12:$Z$157,5,FALSE),\"\")","v":""},{"$f":"IFERROR(VLOOKUP(AM59,Choixeleves!$M$12:$Z$157,6,FALSE),\"\")","v":""},{"$f":"IFERROR(VLOOKUP(AM59,Choixeleves!$M$12:$Z$157,7,FALSE),\"\")","v":""},57]
[null,null,null,null,null,null,null,null,null,null,"Rémi_58",{"$f":"IFERROR(VLOOKUP(K60,Choixeleves!$M$12:$Z$157,3,FALSE),\"\")","v":""},{"$f":"IFERROR(VLOOKUP(K60,Choixeleves!$M$12:$Z$157,5,FALSE),\"\")","v":""},{"$f":"IFERROR(VLOOKUP(K60,Choixeleves!$M$12:$Z$157,6,FALSE),\"\")","v":""},{"$f":"IFERROR(VLOOKUP(K60,Choixeleves!$M$12:$Z$157,7,FALSE),\"\")","v":""},58,null,"Timothée_58",{"$f":"IFERROR(VLOOKUP(R60,Choixeleves!$M$12:$Z$157,3,FALSE),\"\")","v":""},{"$f":"IFERROR(VLOOKUP(R60,Choixeleves!$M$12:$Z$157,5,FALSE),\"\")","v":""},{"$f":"IFERROR(VLOOKUP(R60,Choixeleves!$M$12:$Z$157,6,FALSE),\"\")","v":""},{"$f":"IFERROR(VLOOKUP(R60,Choixeleves!$M$12:$Z$157,7,FALSE),\"\")","v":""},58,null,"Virginie_58",{"$f":"IFERROR(VLOOKUP(Y60,Choixeleves!$M$12:$Z$157,3,FALSE),\"\")","v":""},{"$f":"IFERROR(VLOOKUP(Y60,Choixeleves!$M$12:$Z$157,5,FALSE),\"\")","v":""},{"$f":"IFERROR(VLOOKUP(Y60,Choixeleves!$M$12:$Z$157,6,FALSE),\"\")","v":""},{"$f":"IFERROR(VLOOKUP(Y60,Choixeleves!$M$12:$Z$157,7,FALSE),\"\")","v":""},58,null,"Quentin_58",{"$f":"IFERROR(VLOOKUP(AF60,Choixeleves!$M$12:$Z$157,3,FALSE),\"\")","v":""},{"$f":"IFERROR(VLOOKUP(AF60,Choixeleves!$M$12:$Z$157,5,FALSE),\"\")","v":""},{"$f":"IFERROR(VLOOKUP(AF60,Choixeleves!$M$12:$Z$157,6,FALSE),\"\")","v":""},{"$f":"IFERROR(VLOOKUP(AF60,Choixeleves!$M$12:$Z$157,7,FALSE),\"\")","v":""},58,null,"Mick_58",{"$f":"IFERROR(VLOOKUP(AM60,Choixeleves!$M$12:$Z$157,3,FALSE),\"\")","v":""},{"$f":"IFERROR(VLOOKUP(AM60,Choixeleves!$M$12:$Z$157,5,FALSE),\"\")","v":""},{"$f":"IFERROR(VLOOKUP(AM60,Choixeleves!$M$12:$Z$157,6,FALSE),\"\")","v":""},{"$f":"IFERROR(VLOOKUP(AM60,Choixeleves!$M$12:$Z$157,7,FALSE),\"\")","v":""},58]
[null,null,null,null,null,null,null,null,null,null,"Rémi_59",{"$f":"IFERROR(VLOOKUP(K61,Choixeleves!$M$12:$Z$157,3,FALSE),\"\")","v":""},{"$f":"IFERROR(VLOOKUP(K61,Choixeleves!$M$12:$Z$157,5,FALSE),\"\")","v":""},{"$f":"IFERROR(VLOOKUP(K61,Choixeleves!$M$12:$Z$157,6,FALSE),\"\")","v":""},{"$f":"IFERROR(VLOOKUP(K61,Choixeleves!$M$12:$Z$157,7,FALSE),\"\")","v":""},59,null,"Timothée_59",{"$f":"IFERROR(VLOOKUP(R61,Choixeleves!$M$12:$Z$157,3,FALSE),\"\")","v":""},{"$f":"IFERROR(VLOOKUP(R61,Choixeleves!$M$12:$Z$157,5,FALSE),\"\")","v":""},{"$f":"IFERROR(VLOOKUP(R61,Choixeleves!$M$12:$Z$157,6,FALSE),\"\")","v":""},{"$f":"IFERROR(VLOOKUP(R61,Choixeleves!$M$12:$Z$157,7,FALSE),\"\")","v":""},59,null,"Virginie_59",{"$f":"IFERROR(VLOOKUP(Y61,Choixeleves!$M$12:$Z$157,3,FALSE),\"\")","v":""},{"$f":"IFERROR(VLOOKUP(Y61,Choixeleves!$M$12:$Z$157,5,FALSE),\"\")","v":""},{"$f":"IFERROR(VLOOKUP(Y61,Choixeleves!$M$12:$Z$157,6,FALSE),\"\")","v":""},{"$f":"IFERROR(VLOOKUP(Y61,Choixeleves!$M$12:$Z$157,7,FALSE),\"\")","v":""},59,null,"Quentin_59",{"$f":"IFERROR(VLOOKUP(AF61,Choixeleves!$M$12:$Z$157,3,FALSE),\"\")","v":""},{"$f":"IFERROR(VLOOKUP(AF61,Choixeleves!$M$12:$Z$157,5,FALSE),\"\")","v":""},{"$f":"IFERROR(VLOOKUP(AF61,Choixeleves!$M$12:$Z$157,6,FALSE),\"\")","v":""},{"$f":"IFERROR(VLOOKUP(AF61,Choixeleves!$M$12:$Z$157,7,FALSE),\"\")","v":""},59,null,"Mick_59",{"$f":"IFERROR(VLOOKUP(AM61,Choixeleves!$M$12:$Z$157,3,FALSE),\"\")","v":""},{"$f":"IFERROR(VLOOKUP(AM61,Choixeleves!$M$12:$Z$157,5,FALSE),\"\")","v":""},{"$f":"IFERROR(VLOOKUP(AM61,Choixeleves!$M$12:$Z$157,6,FALSE),\"\")","v":""},{"$f":"IFERROR(VLOOKUP(AM61,Choixeleves!$M$12:$Z$157,7,FALSE),\"\")","v":""},59]
[null,null,null,null,null,null,null,null,null,null,"Rémi_60",{"$f":"IFERROR(VLOOKUP(K62,Choixeleves!$M$12:$Z$157,3,FALSE),\"\")","v":""},{"$f":"IFERROR(VLOOKUP(K62,Choixeleves!$M$12:$Z$157,5,FALSE),\"\")","v":""},{"$f":"IFERROR(VLOOKUP(K62,Choixeleves!$M$12:$Z$157,6,FALSE),\"\")","v":""},{"$f":"IFERROR(VLOOKUP(K62,Choixeleves!$M$12:$Z$157,7,FALSE),\"\")","v":""},60,null,"Timothée_60",{"$f":"IFERROR(VLOOKUP(R62,Choixeleves!$M$12:$Z$157,3,FALSE),\"\")","v":""},{"$f":"IFERROR(VLOOKUP(R62,Choixeleves!$M$12:$Z$157,5,FALSE),\"\")","v":""},{"$f":"IFERROR(VLOOKUP(R62,Choixeleves!$M$12:$Z$157,6,FALSE),\"\")","v":""},{"$f":"IFERROR(VLOOKUP(R62,Choixeleves!$M$12:$Z$157,7,FALSE),\"\")","v":""},60,null,"Virginie_60",{"$f":"IFERROR(VLOOKUP(Y62,Choixeleves!$M$12:$Z$157,3,FALSE),\"\")","v":""},{"$f":"IFERROR(VLOOKUP(Y62,Choixeleves!$M$12:$Z$157,5,FALSE),\"\")","v":""},{"$f":"IFERROR(VLOOKUP(Y62,Choixeleves!$M$12:$Z$157,6,FALSE),\"\")","v":""},{"$f":"IFERROR(VLOOKUP(Y62,Choixeleves!$M$12:$Z$157,7,FALSE),\"\")","v":""},60,null,"Quentin_60",{"$f":"IFERROR(VLOOKUP(AF62,Choixeleves!$M$12:$Z$157,3,FALSE),\"\")","v":""},{"$f":"IFERROR(VLOOKUP(AF62,Choixeleves!$M$12:$Z$157,5,FALSE),\"\")","v":""},{"$f":"IFERROR(VLOOKUP(AF62,Choixeleves!$M$12:$Z$157,6,FALSE),\"\")","v":""},{"$f":"IFERROR(VLOOKUP(AF62,Choixeleves!$M$12:$Z$157,7,FALSE),\"\")","v":""},60,null,"Mick_60",{"$f":"IFERROR(VLOOKUP(AM62,Choixeleves!$M$12:$Z$157,3,FALSE),\"\")","v":""},{"$f":"IFERROR(VLOOKUP(AM62,Choixeleves!$M$12:$Z$157,5,FALSE),\"\")","v":""},{"$f":"IFERROR(VLOOKUP(AM62,Choixeleves!$M$12:$Z$157,6,FALSE),\"\")","v":""},{"$f":"IFERROR(VLOOKUP(AM62,Choixeleves!$M$12:$Z$157,7,FALSE),\"\")","v":""},60]
[null,null,null,null,null,null,null,null,null,null,"Rémi_61",{"$f":"IFERROR(VLOOKUP(K63,Choixeleves!$M$12:$Z$157,3,FALSE),\"\")","v":""},{"$f":"IFERROR(VLOOKUP(K63,Choixeleves!$M$12:$Z$157,5,FALSE),\"\")","v":""},{"$f":"IFERROR(VLOOKUP(K63,Choixeleves!$M$12:$Z$157,6,FALSE),\"\")","v":""},{"$f":"IFERROR(VLOOKUP(K63,Choixeleves!$M$12:$Z$157,7,FALSE),\"\")","v":""},61,null,"Timothée_61",{"$f":"IFERROR(VLOOKUP(R63,Choixeleves!$M$12:$Z$157,3,FALSE),\"\")","v":""},{"$f":"IFERROR(VLOOKUP(R63,Choixeleves!$M$12:$Z$157,5,FALSE),\"\")","v":""},{"$f":"IFERROR(VLOOKUP(R63,Choixeleves!$M$12:$Z$157,6,FALSE),\"\")","v":""},{"$f":"IFERROR(VLOOKUP(R63,Choixeleves!$M$12:$Z$157,7,FALSE),\"\")","v":""},61,null,"Virginie_61",{"$f":"IFERROR(VLOOKUP(Y63,Choixeleves!$M$12:$Z$157,3,FALSE),\"\")","v":""},{"$f":"IFERROR(VLOOKUP(Y63,Choixeleves!$M$12:$Z$157,5,FALSE),\"\")","v":""},{"$f":"IFERROR(VLOOKUP(Y63,Choixeleves!$M$12:$Z$157,6,FALSE),\"\")","v":""},{"$f":"IFERROR(VLOOKUP(Y63,Choixeleves!$M$12:$Z$157,7,FALSE),\"\")","v":""},61,null,"Quentin_61",{"$f":"IFERROR(VLOOKUP(AF63,Choixeleves!$M$12:$Z$157,3,FALSE),\"\")","v":""},{"$f":"IFERROR(VLOOKUP(AF63,Choixeleves!$M$12:$Z$157,5,FALSE),\"\")","v":""},{"$f":"IFERROR(VLOOKUP(AF63,Choixeleves!$M$12:$Z$157,6,FALSE),\"\")","v":""},{"$f":"IFERROR(VLOOKUP(AF63,Choixeleves!$M$12:$Z$157,7,FALSE),\"\")","v":""},61,null,"Mick_61",{"$f":"IFERROR(VLOOKUP(AM63,Choixeleves!$M$12:$Z$157,3,FALSE),\"\")","v":""},{"$f":"IFERROR(VLOOKUP(AM63,Choixeleves!$M$12:$Z$157,5,FALSE),\"\")","v":""},{"$f":"IFERROR(VLOOKUP(AM63,Choixeleves!$M$12:$Z$157,6,FALSE),\"\")","v":""},{"$f":"IFERROR(VLOOKUP(AM63,Choixeleves!$M$12:$Z$157,7,FALSE),\"\")","v":""},61]
[null,null,null,null,null,null,null,null,null,null,"Rémi_62",{"$f":"IFERROR(VLOOKUP(K64,Choixeleves!$M$12:$Z$157,3,FALSE),\"\")","v":""},{"$f":"IFERROR(VLOOKUP(K64,Choixeleves!$M$12:$Z$157,5,FALSE),\"\")","v":""},{"$f":"IFERROR(VLOOKUP(K64,Choixeleves!$M$12:$Z$157,6,FALSE),\"\")","v":""},{"$f":"IFERROR(VLOOKUP(K64,Choixeleves!$M$12:$Z$157,7,FALSE),\"\")","v":""},62,null,"Timothée_62",{"$f":"IFERROR(VLOOKUP(R64,Choixeleves!$M$12:$Z$157,3,FALSE),\"\")","v":""},{"$f":"IFERROR(VLOOKUP(R64,Choixeleves!$M$12:$Z$157,5,FALSE),\"\")","v":""},{"$f":"IFERROR(VLOOKUP(R64,Choixeleves!$M$12:$Z$157,6,FALSE),\"\")","v":""},{"$f":"IFERROR(VLOOKUP(R64,Choixeleves!$M$12:$Z$157,7,FALSE),\"\")","v":""},62,null,"Virginie_62",{"$f":"IFERROR(VLOOKUP(Y64,Choixeleves!$M$12:$Z$157,3,FALSE),\"\")","v":""},{"$f":"IFERROR(VLOOKUP(Y64,Choixeleves!$M$12:$Z$157,5,FALSE),\"\")","v":""},{"$f":"IFERROR(VLOOKUP(Y64,Choixeleves!$M$12:$Z$157,6,FALSE),\"\")","v":""},{"$f":"IFERROR(VLOOKUP(Y64,Choixeleves!$M$12:$Z$157,7,FALSE),\"\")","v":""},62,null,"Quentin_62",{"$f":"IFERROR(VLOOKUP(AF64,Choixeleves!$M$12:$Z$157,3,FALSE),\"\")","v":""},{"$f":"IFERROR(VLOOKUP(AF64,Choixeleves!$M$12:$Z$157,5,FALSE),\"\")","v":""},{"$f":"IFERROR(VLOOKUP(AF64,Choixeleves!$M$12:$Z$157,6,FALSE),\"\")","v":""},{"$f":"IFERROR(VLOOKUP(AF64,Choixeleves!$M$12:$Z$157,7,FALSE),\"\")","v":""},62,null,"Mick_62",{"$f":"IFERROR(VLOOKUP(AM64,Choixeleves!$M$12:$Z$157,3,FALSE),\"\")","v":""},{"$f":"IFERROR(VLOOKUP(AM64,Choixeleves!$M$12:$Z$157,5,FALSE),\"\")","v":""},{"$f":"IFERROR(VLOOKUP(AM64,Choixeleves!$M$12:$Z$157,6,FALSE),\"\")","v":""},{"$f":"IFERROR(VLOOKUP(AM64,Choixeleves!$M$12:$Z$157,7,FALSE),\"\")","v":""},62]
[null,null,null,null,null,null,null,null,null,null,"Rémi_63",{"$f":"IFERROR(VLOOKUP(K65,Choixeleves!$M$12:$Z$157,3,FALSE),\"\")","v":""},{"$f":"IFERROR(VLOOKUP(K65,Choixeleves!$M$12:$Z$157,5,FALSE),\"\")","v":""},{"$f":"IFERROR(VLOOKUP(K65,Choixeleves!$M$12:$Z$157,6,FALSE),\"\")","v":""},{"$f":"IFERROR(VLOOKUP(K65,Choixeleves!$M$12:$Z$157,7,FALSE),\"\")","v":""},63,null,"Timothée_63",{"$f":"IFERROR(VLOOKUP(R65,Choixeleves!$M$12:$Z$157,3,FALSE),\"\")","v":""},{"$f":"IFERROR(VLOOKUP(R65,Choixeleves!$M$12:$Z$157,5,FALSE),\"\")","v":""},{"$f":"IFERROR(VLOOKUP(R65,Choixeleves!$M$12:$Z$157,6,FALSE),\"\")","v":""},{"$f":"IFERROR(VLOOKUP(R65,Choixeleves!$M$12:$Z$157,7,FALSE),\"\")","v":""},63,null,"Virginie_63",{"$f":"IFERROR(VLOOKUP(Y65,Choixeleves!$M$12:$Z$157,3,FALSE),\"\")","v":""},{"$f":"IFERROR(VLOOKUP(Y65,Choixeleves!$M$12:$Z$157,5,FALSE),\"\")","v":""},{"$f":"IFERROR(VLOOKUP(Y65,Choixeleves!$M$12:$Z$157,6,FALSE),\"\")","v":""},{"$f":"IFERROR(VLOOKUP(Y65,Choixeleves!$M$12:$Z$157,7,FALSE),\"\")","v":""},63,null,"Quentin_63",{"$f":"IFERROR(VLOOKUP(AF65,Choixeleves!$M$12:$Z$157,3,FALSE),\"\")","v":""},{"$f":"IFERROR(VLOOKUP(AF65,Choixeleves!$M$12:$Z$157,5,FALSE),\"\")","v":""},{"$f":"IFERROR(VLOOKUP(AF65,Choixeleves!$M$12:$Z$157,6,FALSE),\"\")","v":""},{"$f":"IFERROR(VLOOKUP(AF65,Choixeleves!$M$12:$Z$157,7,FALSE),\"\")","v":""},63,null,"Mick_63",{"$f":"IFERROR(VLOOKUP(AM65,Choixeleves!$M$12:$Z$157,3,FALSE),\"\")","v":""},{"$f":"IFERROR(VLOOKUP(AM65,Choixeleves!$M$12:$Z$157,5,FALSE),\"\")","v":""},{"$f":"IFERROR(VLOOKUP(AM65,Choixeleves!$M$12:$Z$157,6,FALSE),\"\")","v":""},{"$f":"IFERROR(VLOOKUP(AM65,Choixeleves!$M$12:$Z$157,7,FALSE),\"\")","v":""},63]
[null,null,null,null,null,null,null,null,null,null,"Rémi_64",{"$f":"IFERROR(VLOOKUP(K66,Choixeleves!$M$12:$Z$157,3,FALSE),\"\")","v":""},{"$f":"IFERROR(VLOOKUP(K66,Choixeleves!$M$12:$Z$157,5,FALSE),\"\")","v":""},{"$f":"IFERROR(VLOOKUP(K66,Choixeleves!$M$12:$Z$157,6,FALSE),\"\")","v":""},{"$f":"IFERROR(VLOOKUP(K66,Choixeleves!$M$12:$Z$157,7,FALSE),\"\")","v":""},64,null,"Timothée_64",{"$f":"IFERROR(VLOOKUP(R66,Choixeleves!$M$12:$Z$157,3,FALSE),\"\")","v":""},{"$f":"IFERROR(VLOOKUP(R66,Choixeleves!$M$12:$Z$157,5,FALSE),\"\")","v":""},{"$f":"IFERROR(VLOOKUP(R66,Choixeleves!$M$12:$Z$157,6,FALSE),\"\")","v":""},{"$f":"IFERROR(VLOOKUP(R66,Choixeleves!$M$12:$Z$157,7,FALSE),\"\")","v":""},64,null,"Virginie_64",{"$f":"IFERROR(VLOOKUP(Y66,Choixeleves!$M$12:$Z$157,3,FALSE),\"\")","v":""},{"$f":"IFERROR(VLOOKUP(Y66,Choixeleves!$M$12:$Z$157,5,FALSE),\"\")","v":""},{"$f":"IFERROR(VLOOKUP(Y66,Choixeleves!$M$12:$Z$157,6,FALSE),\"\")","v":""},{"$f":"IFERROR(VLOOKUP(Y66,Choixeleves!$M$12:$Z$157,7,FALSE),\"\")","v":""},64,null,"Quentin_64",{"$f":"IFERROR(VLOOKUP(AF66,Choixeleves!$M$12:$Z$157,3,FALSE),\"\")","v":""},{"$f":"IFERROR(VLOOKUP(AF66,Choixeleves!$M$12:$Z$157,5,FALSE),\"\")","v":""},{"$f":"IFERROR(VLOOKUP(AF66,Choixeleves!$M$12:$Z$157,6,FALSE),\"\")","v":""},{"$f":"IFERROR(VLOOKUP(AF66,Choixeleves!$M$12:$Z$157,7,FALSE),\"\")","v":""},64,null,"Mick_64",{"$f":"IFERROR(VLOOKUP(AM66,Choixeleves!$M$12:$Z$157,3,FALSE),\"\")","v":""},{"$f":"IFERROR(VLOOKUP(AM66,Choixeleves!$M$12:$Z$157,5,FALSE),\"\")","v":""},{"$f":"IFERROR(VLOOKUP(AM66,Choixeleves!$M$12:$Z$157,6,FALSE),\"\")","v":""},{"$f":"IFERROR(VLOOKUP(AM66,Choixeleves!$M$12:$Z$157,7,FALSE),\"\")","v":""},64]
[null,null,null,null,null,null,null,null,null,null,"Rémi_65",{"$f":"IFERROR(VLOOKUP(K67,Choixeleves!$M$12:$Z$157,3,FALSE),\"\")","v":""},{"$f":"IFERROR(VLOOKUP(K67,Choixeleves!$M$12:$Z$157,5,FALSE),\"\")","v":""},{"$f":"IFERROR(VLOOKUP(K67,Choixeleves!$M$12:$Z$157,6,FALSE),\"\")","v":""},{"$f":"IFERROR(VLOOKUP(K67,Choixeleves!$M$12:$Z$157,7,FALSE),\"\")","v":""},65,null,"Timothée_65",{"$f":"IFERROR(VLOOKUP(R67,Choixeleves!$M$12:$Z$157,3,FALSE),\"\")","v":""},{"$f":"IFERROR(VLOOKUP(R67,Choixeleves!$M$12:$Z$157,5,FALSE),\"\")","v":""},{"$f":"IFERROR(VLOOKUP(R67,Choixeleves!$M$12:$Z$157,6,FALSE),\"\")","v":""},{"$f":"IFERROR(VLOOKUP(R67,Choixeleves!$M$12:$Z$157,7,FALSE),\"\")","v":""},65,null,"Virginie_65",{"$f":"IFERROR(VLOOKUP(Y67,Choixeleves!$M$12:$Z$157,3,FALSE),\"\")","v":""},{"$f":"IFERROR(VLOOKUP(Y67,Choixeleves!$M$12:$Z$157,5,FALSE),\"\")","v":""},{"$f":"IFERROR(VLOOKUP(Y67,Choixeleves!$M$12:$Z$157,6,FALSE),\"\")","v":""},{"$f":"IFERROR(VLOOKUP(Y67,Choixeleves!$M$12:$Z$157,7,FALSE),\"\")","v":""},65,null,"Quentin_65",{"$f":"IFERROR(VLOOKUP(AF67,Choixeleves!$M$12:$Z$157,3,FALSE),\"\")","v":""},{"$f":"IFERROR(VLOOKUP(AF67,Choixeleves!$M$12:$Z$157,5,FALSE),\"\")","v":""},{"$f":"IFERROR(VLOOKUP(AF67,Choixeleves!$M$12:$Z$157,6,FALSE),\"\")","v":""},{"$f":"IFERROR(VLOOKUP(AF67,Choixeleves!$M$12:$Z$157,7,FALSE),\"\")","v":""},65,null,"Mick_65",{"$f":"IFERROR(VLOOKUP(AM67,Choixeleves!$M$12:$Z$157,3,FALSE),\"\")","v":""},{"$f":"IFERROR(VLOOKUP(AM67,Choixeleves!$M$12:$Z$157,5,FALSE),\"\")","v":""},{"$f":"IFERROR(VLOOKUP(AM67,Choixeleves!$M$12:$Z$157,6,FALSE),\"\")","v":""},{"$f":"IFERROR(VLOOKUP(AM67,Choixeleves!$M$12:$Z$157,7,FALSE),\"\")","v":""},65]
[null,null,null,null,null,null,null,null,null,null,{"$f":"$J$3&\"_\"&P68","v":"Rémi_66"},{"$f":"IFERROR(VLOOKUP(K68,Choixeleves!$M$12:$Z$157,3,FALSE),\"\")","v":""},{"$f":"IFERROR(VLOOKUP(K68,Choixeleves!$M$12:$Z$157,5,FALSE),\"\")","v":""},{"$f":"IFERROR(VLOOKUP(K68,Choixeleves!$M$12:$Z$157,6,FALSE),\"\")","v":""},{"$f":"IFERROR(VLOOKUP(K68,Choixeleves!$M$12:$Z$157,7,FALSE),\"\")","v":""},66,null,{"$f":"$Q$3&\"_\"&W68","v":"Timothée_66"},{"$f":"IFERROR(VLOOKUP(R68,Choixeleves!$M$12:$Z$157,3,FALSE),\"\")","v":""},{"$f":"IFERROR(VLOOKUP(R68,Choixeleves!$M$12:$Z$157,5,FALSE),\"\")","v":""},{"$f":"IFERROR(VLOOKUP(R68,Choixeleves!$M$12:$Z$157,6,FALSE),\"\")","v":""},{"$f":"IFERROR(VLOOKUP(R68,Choixeleves!$M$12:$Z$157,7,FALSE),\"\")","v":""},66,null,{"$f":"$X$3&\"_\"&AD68","v":"Virginie_66"},{"$f":"IFERROR(VLOOKUP(Y68,Choixeleves!$M$12:$Z$157,3,FALSE),\"\")","v":""},{"$f":"IFERROR(VLOOKUP(Y68,Choixeleves!$M$12:$Z$157,5,FALSE),\"\")","v":""},{"$f":"IFERROR(VLOOKUP(Y68,Choixeleves!$M$12:$Z$157,6,FALSE),\"\")","v":""},{"$f":"IFERROR(VLOOKUP(Y68,Choixeleves!$M$12:$Z$157,7,FALSE),\"\")","v":""},66,null,{"$f":"$AE$3&\"_\"&AK68","v":"Quentin_66"},{"$f":"IFERROR(VLOOKUP(AF68,Choixeleves!$M$12:$Z$157,3,FALSE),\"\")","v":""},{"$f":"IFERROR(VLOOKUP(AF68,Choixeleves!$M$12:$Z$157,5,FALSE),\"\")","v":""},{"$f":"IFERROR(VLOOKUP(AF68,Choixeleves!$M$12:$Z$157,6,FALSE),\"\")","v":""},{"$f":"IFERROR(VLOOKUP(AF68,Choixeleves!$M$12:$Z$157,7,FALSE),\"\")","v":""},66,null,{"$f":"$AL$3&\"_\"&AR68","v":"Mick_66"},{"$f":"IFERROR(VLOOKUP(AM68,Choixeleves!$M$12:$Z$157,3,FALSE),\"\")","v":""},{"$f":"IFERROR(VLOOKUP(AM68,Choixeleves!$M$12:$Z$157,5,FALSE),\"\")","v":""},{"$f":"IFERROR(VLOOKUP(AM68,Choixeleves!$M$12:$Z$157,6,FALSE),\"\")","v":""},{"$f":"IFERROR(VLOOKUP(AM68,Choixeleves!$M$12:$Z$157,7,FALSE),\"\")","v":""},66]
[null,null,null,null,null,null,null,null,null,null,"Rémi_67",{"$f":"IFERROR(VLOOKUP(K69,Choixeleves!$M$12:$Z$157,3,FALSE),\"\")","v":""},{"$f":"IFERROR(VLOOKUP(K69,Choixeleves!$M$12:$Z$157,5,FALSE),\"\")","v":""},{"$f":"IFERROR(VLOOKUP(K69,Choixeleves!$M$12:$Z$157,6,FALSE),\"\")","v":""},{"$f":"IFERROR(VLOOKUP(K69,Choixeleves!$M$12:$Z$157,7,FALSE),\"\")","v":""},67,null,"Timothée_67",{"$f":"IFERROR(VLOOKUP(R69,Choixeleves!$M$12:$Z$157,3,FALSE),\"\")","v":""},{"$f":"IFERROR(VLOOKUP(R69,Choixeleves!$M$12:$Z$157,5,FALSE),\"\")","v":""},{"$f":"IFERROR(VLOOKUP(R69,Choixeleves!$M$12:$Z$157,6,FALSE),\"\")","v":""},{"$f":"IFERROR(VLOOKUP(R69,Choixeleves!$M$12:$Z$157,7,FALSE),\"\")","v":""},67,null,"Virginie_67",{"$f":"IFERROR(VLOOKUP(Y69,Choixeleves!$M$12:$Z$157,3,FALSE),\"\")","v":""},{"$f":"IFERROR(VLOOKUP(Y69,Choixeleves!$M$12:$Z$157,5,FALSE),\"\")","v":""},{"$f":"IFERROR(VLOOKUP(Y69,Choixeleves!$M$12:$Z$157,6,FALSE),\"\")","v":""},{"$f":"IFERROR(VLOOKUP(Y69,Choixeleves!$M$12:$Z$157,7,FALSE),\"\")","v":""},67,null,"Quentin_67",{"$f":"IFERROR(VLOOKUP(AF69,Choixeleves!$M$12:$Z$157,3,FALSE),\"\")","v":""},{"$f":"IFERROR(VLOOKUP(AF69,Choixeleves!$M$12:$Z$157,5,FALSE),\"\")","v":""},{"$f":"IFERROR(VLOOKUP(AF69,Choixeleves!$M$12:$Z$157,6,FALSE),\"\")","v":""},{"$f":"IFERROR(VLOOKUP(AF69,Choixeleves!$M$12:$Z$157,7,FALSE),\"\")","v":""},67,null,"Mick_67",{"$f":"IFERROR(VLOOKUP(AM69,Choixeleves!$M$12:$Z$157,3,FALSE),\"\")","v":""},{"$f":"IFERROR(VLOOKUP(AM69,Choixeleves!$M$12:$Z$157,5,FALSE),\"\")","v":""},{"$f":"IFERROR(VLOOKUP(AM69,Choixeleves!$M$12:$Z$157,6,FALSE),\"\")","v":""},{"$f":"IFERROR(VLOOKUP(AM69,Choixeleves!$M$12:$Z$157,7,FALSE),\"\")","v":""},67]
[null,null,null,null,null,null,null,null,null,null,"Rémi_68",{"$f":"IFERROR(VLOOKUP(K70,Choixeleves!$M$12:$Z$157,3,FALSE),\"\")","v":""},{"$f":"IFERROR(VLOOKUP(K70,Choixeleves!$M$12:$Z$157,5,FALSE),\"\")","v":""},{"$f":"IFERROR(VLOOKUP(K70,Choixeleves!$M$12:$Z$157,6,FALSE),\"\")","v":""},{"$f":"IFERROR(VLOOKUP(K70,Choixeleves!$M$12:$Z$157,7,FALSE),\"\")","v":""},68,null,"Timothée_68",{"$f":"IFERROR(VLOOKUP(R70,Choixeleves!$M$12:$Z$157,3,FALSE),\"\")","v":""},{"$f":"IFERROR(VLOOKUP(R70,Choixeleves!$M$12:$Z$157,5,FALSE),\"\")","v":""},{"$f":"IFERROR(VLOOKUP(R70,Choixeleves!$M$12:$Z$157,6,FALSE),\"\")","v":""},{"$f":"IFERROR(VLOOKUP(R70,Choixeleves!$M$12:$Z$157,7,FALSE),\"\")","v":""},68,null,"Virginie_68",{"$f":"IFERROR(VLOOKUP(Y70,Choixeleves!$M$12:$Z$157,3,FALSE),\"\")","v":""},{"$f":"IFERROR(VLOOKUP(Y70,Choixeleves!$M$12:$Z$157,5,FALSE),\"\")","v":""},{"$f":"IFERROR(VLOOKUP(Y70,Choixeleves!$M$12:$Z$157,6,FALSE),\"\")","v":""},{"$f":"IFERROR(VLOOKUP(Y70,Choixeleves!$M$12:$Z$157,7,FALSE),\"\")","v":""},68,null,"Quentin_68",{"$f":"IFERROR(VLOOKUP(AF70,Choixeleves!$M$12:$Z$157,3,FALSE),\"\")","v":""},{"$f":"IFERROR(VLOOKUP(AF70,Choixeleves!$M$12:$Z$157,5,FALSE),\"\")","v":""},{"$f":"IFERROR(VLOOKUP(AF70,Choixeleves!$M$12:$Z$157,6,FALSE),\"\")","v":""},{"$f":"IFERROR(VLOOKUP(AF70,Choixeleves!$M$12:$Z$157,7,FALSE),\"\")","v":""},68,null,"Mick_68",{"$f":"IFERROR(VLOOKUP(AM70,Choixeleves!$M$12:$Z$157,3,FALSE),\"\")","v":""},{"$f":"IFERROR(VLOOKUP(AM70,Choixeleves!$M$12:$Z$157,5,FALSE),\"\")","v":""},{"$f":"IFERROR(VLOOKUP(AM70,Choixeleves!$M$12:$Z$157,6,FALSE),\"\")","v":""},{"$f":"IFERROR(VLOOKUP(AM70,Choixeleves!$M$12:$Z$157,7,FALSE),\"\")","v":""},68]
[null,null,null,null,null,null,null,null,null,null,"Rémi_69",{"$f":"IFERROR(VLOOKUP(K71,Choixeleves!$M$12:$Z$157,3,FALSE),\"\")","v":""},{"$f":"IFERROR(VLOOKUP(K71,Choixeleves!$M$12:$Z$157,5,FALSE),\"\")","v":""},{"$f":"IFERROR(VLOOKUP(K71,Choixeleves!$M$12:$Z$157,6,FALSE),\"\")","v":""},{"$f":"IFERROR(VLOOKUP(K71,Choixeleves!$M$12:$Z$157,7,FALSE),\"\")","v":""},69,null,"Timothée_69",{"$f":"IFERROR(VLOOKUP(R71,Choixeleves!$M$12:$Z$157,3,FALSE),\"\")","v":""},{"$f":"IFERROR(VLOOKUP(R71,Choixeleves!$M$12:$Z$157,5,FALSE),\"\")","v":""},{"$f":"IFERROR(VLOOKUP(R71,Choixeleves!$M$12:$Z$157,6,FALSE),\"\")","v":""},{"$f":"IFERROR(VLOOKUP(R71,Choixeleves!$M$12:$Z$157,7,FALSE),\"\")","v":""},69,null,"Virginie_69",{"$f":"IFERROR(VLOOKUP(Y71,Choixeleves!$M$12:$Z$157,3,FALSE),\"\")","v":""},{"$f":"IFERROR(VLOOKUP(Y71,Choixeleves!$M$12:$Z$157,5,FALSE),\"\")","v":""},{"$f":"IFERROR(VLOOKUP(Y71,Choixeleves!$M$12:$Z$157,6,FALSE),\"\")","v":""},{"$f":"IFERROR(VLOOKUP(Y71,Choixeleves!$M$12:$Z$157,7,FALSE),\"\")","v":""},69,null,"Quentin_69",{"$f":"IFERROR(VLOOKUP(AF71,Choixeleves!$M$12:$Z$157,3,FALSE),\"\")","v":""},{"$f":"IFERROR(VLOOKUP(AF71,Choixeleves!$M$12:$Z$157,5,FALSE),\"\")","v":""},{"$f":"IFERROR(VLOOKUP(AF71,Choixeleves!$M$12:$Z$157,6,FALSE),\"\")","v":""},{"$f":"IFERROR(VLOOKUP(AF71,Choixeleves!$M$12:$Z$157,7,FALSE),\"\")","v":""},69,null,"Mick_69",{"$f":"IFERROR(VLOOKUP(AM71,Choixeleves!$M$12:$Z$157,3,FALSE),\"\")","v":""},{"$f":"IFERROR(VLOOKUP(AM71,Choixeleves!$M$12:$Z$157,5,FALSE),\"\")","v":""},{"$f":"IFERROR(VLOOKUP(AM71,Choixeleves!$M$12:$Z$157,6,FALSE),\"\")","v":""},{"$f":"IFERROR(VLOOKUP(AM71,Choixeleves!$M$12:$Z$157,7,FALSE),\"\")","v":""},69]
[null,null,null,null,null,null,null,null,null,null,"Rémi_70",{"$f":"IFERROR(VLOOKUP(K72,Choixeleves!$M$12:$Z$157,3,FALSE),\"\")","v":""},{"$f":"IFERROR(VLOOKUP(K72,Choixeleves!$M$12:$Z$157,5,FALSE),\"\")","v":""},{"$f":"IFERROR(VLOOKUP(K72,Choixeleves!$M$12:$Z$157,6,FALSE),\"\")","v":""},{"$f":"IFERROR(VLOOKUP(K72,Choixeleves!$M$12:$Z$157,7,FALSE),\"\")","v":""},70,null,"Timothée_70",{"$f":"IFERROR(VLOOKUP(R72,Choixeleves!$M$12:$Z$157,3,FALSE),\"\")","v":""},{"$f":"IFERROR(VLOOKUP(R72,Choixeleves!$M$12:$Z$157,5,FALSE),\"\")","v":""},{"$f":"IFERROR(VLOOKUP(R72,Choixeleves!$M$12:$Z$157,6,FALSE),\"\")","v":""},{"$f":"IFERROR(VLOOKUP(R72,Choixeleves!$M$12:$Z$157,7,FALSE),\"\")","v":""},70,null,"Virginie_70",{"$f":"IFERROR(VLOOKUP(Y72,Choixeleves!$M$12:$Z$157,3,FALSE),\"\")","v":""},{"$f":"IFERROR(VLOOKUP(Y72,Choixeleves!$M$12:$Z$157,5,FALSE),\"\")","v":""},{"$f":"IFERROR(VLOOKUP(Y72,Choixeleves!$M$12:$Z$157,6,FALSE),\"\")","v":""},{"$f":"IFERROR(VLOOKUP(Y72,Choixeleves!$M$12:$Z$157,7,FALSE),\"\")","v":""},70,null,"Quentin_70",{"$f":"IFERROR(VLOOKUP(AF72,Choixeleves!$M$12:$Z$157,3,FALSE),\"\")","v":""},{"$f":"IFERROR(VLOOKUP(AF72,Choixeleves!$M$12:$Z$157,5,FALSE),\"\")","v":""},{"$f":"IFERROR(VLOOKUP(AF72,Choixeleves!$M$12:$Z$157,6,FALSE),\"\")","v":""},{"$f":"IFERROR(VLOOKUP(AF72,Choixeleves!$M$12:$Z$157,7,FALSE),\"\")","v":""},70,null,"Mick_70",{"$f":"IFERROR(VLOOKUP(AM72,Choixeleves!$M$12:$Z$157,3,FALSE),\"\")","v":""},{"$f":"IFERROR(VLOOKUP(AM72,Choixeleves!$M$12:$Z$157,5,FALSE),\"\")","v":""},{"$f":"IFERROR(VLOOKUP(AM72,Choixeleves!$M$12:$Z$157,6,FALSE),\"\")","v":""},{"$f":"IFERROR(VLOOKUP(AM72,Choixeleves!$M$12:$Z$157,7,FALSE),\"\")","v":""},70]
[null,null,null,null,null,null,null,null,null,null,"Rémi_71",{"$f":"IFERROR(VLOOKUP(K73,Choixeleves!$M$12:$Z$157,3,FALSE),\"\")","v":""},{"$f":"IFERROR(VLOOKUP(K73,Choixeleves!$M$12:$Z$157,5,FALSE),\"\")","v":""},{"$f":"IFERROR(VLOOKUP(K73,Choixeleves!$M$12:$Z$157,6,FALSE),\"\")","v":""},{"$f":"IFERROR(VLOOKUP(K73,Choixeleves!$M$12:$Z$157,7,FALSE),\"\")","v":""},71,null,"Timothée_71",{"$f":"IFERROR(VLOOKUP(R73,Choixeleves!$M$12:$Z$157,3,FALSE),\"\")","v":""},{"$f":"IFERROR(VLOOKUP(R73,Choixeleves!$M$12:$Z$157,5,FALSE),\"\")","v":""},{"$f":"IFERROR(VLOOKUP(R73,Choixeleves!$M$12:$Z$157,6,FALSE),\"\")","v":""},{"$f":"IFERROR(VLOOKUP(R73,Choixeleves!$M$12:$Z$157,7,FALSE),\"\")","v":""},71,null,"Virginie_71",{"$f":"IFERROR(VLOOKUP(Y73,Choixeleves!$M$12:$Z$157,3,FALSE),\"\")","v":""},{"$f":"IFERROR(VLOOKUP(Y73,Choixeleves!$M$12:$Z$157,5,FALSE),\"\")","v":""},{"$f":"IFERROR(VLOOKUP(Y73,Choixeleves!$M$12:$Z$157,6,FALSE),\"\")","v":""},{"$f":"IFERROR(VLOOKUP(Y73,Choixeleves!$M$12:$Z$157,7,FALSE),\"\")","v":""},71,null,"Quentin_71",{"$f":"IFERROR(VLOOKUP(AF73,Choixeleves!$M$12:$Z$157,3,FALSE),\"\")","v":""},{"$f":"IFERROR(VLOOKUP(AF73,Choixeleves!$M$12:$Z$157,5,FALSE),\"\")","v":""},{"$f":"IFERROR(VLOOKUP(AF73,Choixeleves!$M$12:$Z$157,6,FALSE),\"\")","v":""},{"$f":"IFERROR(VLOOKUP(AF73,Choixeleves!$M$12:$Z$157,7,FALSE),\"\")","v":""},71,null,"Mick_71",{"$f":"IFERROR(VLOOKUP(AM73,Choixeleves!$M$12:$Z$157,3,FALSE),\"\")","v":""},{"$f":"IFERROR(VLOOKUP(AM73,Choixeleves!$M$12:$Z$157,5,FALSE),\"\")","v":""},{"$f":"IFERROR(VLOOKUP(AM73,Choixeleves!$M$12:$Z$157,6,FALSE),\"\")","v":""},{"$f":"IFERROR(VLOOKUP(AM73,Choixeleves!$M$12:$Z$157,7,FALSE),\"\")","v":""},71]
[null,null,null,null,null,null,null,null,null,null,"Rémi_72",{"$f":"IFERROR(VLOOKUP(K74,Choixeleves!$M$12:$Z$157,3,FALSE),\"\")","v":""},{"$f":"IFERROR(VLOOKUP(K74,Choixeleves!$M$12:$Z$157,5,FALSE),\"\")","v":""},{"$f":"IFERROR(VLOOKUP(K74,Choixeleves!$M$12:$Z$157,6,FALSE),\"\")","v":""},{"$f":"IFERROR(VLOOKUP(K74,Choixeleves!$M$12:$Z$157,7,FALSE),\"\")","v":""},72,null,"Timothée_72",{"$f":"IFERROR(VLOOKUP(R74,Choixeleves!$M$12:$Z$157,3,FALSE),\"\")","v":""},{"$f":"IFERROR(VLOOKUP(R74,Choixeleves!$M$12:$Z$157,5,FALSE),\"\")","v":""},{"$f":"IFERROR(VLOOKUP(R74,Choixeleves!$M$12:$Z$157,6,FALSE),\"\")","v":""},{"$f":"IFERROR(VLOOKUP(R74,Choixeleves!$M$12:$Z$157,7,FALSE),\"\")","v":""},72,null,"Virginie_72",{"$f":"IFERROR(VLOOKUP(Y74,Choixeleves!$M$12:$Z$157,3,FALSE),\"\")","v":""},{"$f":"IFERROR(VLOOKUP(Y74,Choixeleves!$M$12:$Z$157,5,FALSE),\"\")","v":""},{"$f":"IFERROR(VLOOKUP(Y74,Choixeleves!$M$12:$Z$157,6,FALSE),\"\")","v":""},{"$f":"IFERROR(VLOOKUP(Y74,Choixeleves!$M$12:$Z$157,7,FALSE),\"\")","v":""},72,null,"Quentin_72",{"$f":"IFERROR(VLOOKUP(AF74,Choixeleves!$M$12:$Z$157,3,FALSE),\"\")","v":""},{"$f":"IFERROR(VLOOKUP(AF74,Choixeleves!$M$12:$Z$157,5,FALSE),\"\")","v":""},{"$f":"IFERROR(VLOOKUP(AF74,Choixeleves!$M$12:$Z$157,6,FALSE),\"\")","v":""},{"$f":"IFERROR(VLOOKUP(AF74,Choixeleves!$M$12:$Z$157,7,FALSE),\"\")","v":""},72,null,"Mick_72",{"$f":"IFERROR(VLOOKUP(AM74,Choixeleves!$M$12:$Z$157,3,FALSE),\"\")","v":""},{"$f":"IFERROR(VLOOKUP(AM74,Choixeleves!$M$12:$Z$157,5,FALSE),\"\")","v":""},{"$f":"IFERROR(VLOOKUP(AM74,Choixeleves!$M$12:$Z$157,6,FALSE),\"\")","v":""},{"$f":"IFERROR(VLOOKUP(AM74,Choixeleves!$M$12:$Z$157,7,FALSE),\"\")","v":""},72]
[null,null,null,null,null,null,null,null,null,null,"Rémi_73",{"$f":"IFERROR(VLOOKUP(K75,Choixeleves!$M$12:$Z$157,3,FALSE),\"\")","v":""},{"$f":"IFERROR(VLOOKUP(K75,Choixeleves!$M$12:$Z$157,5,FALSE),\"\")","v":""},{"$f":"IFERROR(VLOOKUP(K75,Choixeleves!$M$12:$Z$157,6,FALSE),\"\")","v":""},{"$f":"IFERROR(VLOOKUP(K75,Choixeleves!$M$12:$Z$157,7,FALSE),\"\")","v":""},73,null,"Timothée_73",{"$f":"IFERROR(VLOOKUP(R75,Choixeleves!$M$12:$Z$157,3,FALSE),\"\")","v":""},{"$f":"IFERROR(VLOOKUP(R75,Choixeleves!$M$12:$Z$157,5,FALSE),\"\")","v":""},{"$f":"IFERROR(VLOOKUP(R75,Choixeleves!$M$12:$Z$157,6,FALSE),\"\")","v":""},{"$f":"IFERROR(VLOOKUP(R75,Choixeleves!$M$12:$Z$157,7,FALSE),\"\")","v":""},73,null,"Virginie_73",{"$f":"IFERROR(VLOOKUP(Y75,Choixeleves!$M$12:$Z$157,3,FALSE),\"\")","v":""},{"$f":"IFERROR(VLOOKUP(Y75,Choixeleves!$M$12:$Z$157,5,FALSE),\"\")","v":""},{"$f":"IFERROR(VLOOKUP(Y75,Choixeleves!$M$12:$Z$157,6,FALSE),\"\")","v":""},{"$f":"IFERROR(VLOOKUP(Y75,Choixeleves!$M$12:$Z$157,7,FALSE),\"\")","v":""},73,null,"Quentin_73",{"$f":"IFERROR(VLOOKUP(AF75,Choixeleves!$M$12:$Z$157,3,FALSE),\"\")","v":""},{"$f":"IFERROR(VLOOKUP(AF75,Choixeleves!$M$12:$Z$157,5,FALSE),\"\")","v":""},{"$f":"IFERROR(VLOOKUP(AF75,Choixeleves!$M$12:$Z$157,6,FALSE),\"\")","v":""},{"$f":"IFERROR(VLOOKUP(AF75,Choixeleves!$M$12:$Z$157,7,FALSE),\"\")","v":""},73,null,"Mick_73",{"$f":"IFERROR(VLOOKUP(AM75,Choixeleves!$M$12:$Z$157,3,FALSE),\"\")","v":""},{"$f":"IFERROR(VLOOKUP(AM75,Choixeleves!$M$12:$Z$157,5,FALSE),\"\")","v":""},{"$f":"IFERROR(VLOOKUP(AM75,Choixeleves!$M$12:$Z$157,6,FALSE),\"\")","v":""},{"$f":"IFERROR(VLOOKUP(AM75,Choixeleves!$M$12:$Z$157,7,FALSE),\"\")","v":""},73]
[null,null,null,null,null,null,null,null,null,null,"Rémi_74",{"$f":"IFERROR(VLOOKUP(K76,Choixeleves!$M$12:$Z$157,3,FALSE),\"\")","v":""},{"$f":"IFERROR(VLOOKUP(K76,Choixeleves!$M$12:$Z$157,5,FALSE),\"\")","v":""},{"$f":"IFERROR(VLOOKUP(K76,Choixeleves!$M$12:$Z$157,6,FALSE),\"\")","v":""},{"$f":"IFERROR(VLOOKUP(K76,Choixeleves!$M$12:$Z$157,7,FALSE),\"\")","v":""},74,null,"Timothée_74",{"$f":"IFERROR(VLOOKUP(R76,Choixeleves!$M$12:$Z$157,3,FALSE),\"\")","v":""},{"$f":"IFERROR(VLOOKUP(R76,Choixeleves!$M$12:$Z$157,5,FALSE),\"\")","v":""},{"$f":"IFERROR(VLOOKUP(R76,Choixeleves!$M$12:$Z$157,6,FALSE),\"\")","v":""},{"$f":"IFERROR(VLOOKUP(R76,Choixeleves!$M$12:$Z$157,7,FALSE),\"\")","v":""},74,null,"Virginie_74",{"$f":"IFERROR(VLOOKUP(Y76,Choixeleves!$M$12:$Z$157,3,FALSE),\"\")","v":""},{"$f":"IFERROR(VLOOKUP(Y76,Choixeleves!$M$12:$Z$157,5,FALSE),\"\")","v":""},{"$f":"IFERROR(VLOOKUP(Y76,Choixeleves!$M$12:$Z$157,6,FALSE),\"\")","v":""},{"$f":"IFERROR(VLOOKUP(Y76,Choixeleves!$M$12:$Z$157,7,FALSE),\"\")","v":""},74,null,"Quentin_74",{"$f":"IFERROR(VLOOKUP(AF76,Choixeleves!$M$12:$Z$157,3,FALSE),\"\")","v":""},{"$f":"IFERROR(VLOOKUP(AF76,Choixeleves!$M$12:$Z$157,5,FALSE),\"\")","v":""},{"$f":"IFERROR(VLOOKUP(AF76,Choixeleves!$M$12:$Z$157,6,FALSE),\"\")","v":""},{"$f":"IFERROR(VLOOKUP(AF76,Choixeleves!$M$12:$Z$157,7,FALSE),\"\")","v":""},74,null,"Mick_74",{"$f":"IFERROR(VLOOKUP(AM76,Choixeleves!$M$12:$Z$157,3,FALSE),\"\")","v":""},{"$f":"IFERROR(VLOOKUP(AM76,Choixeleves!$M$12:$Z$157,5,FALSE),\"\")","v":""},{"$f":"IFERROR(VLOOKUP(AM76,Choixeleves!$M$12:$Z$157,6,FALSE),\"\")","v":""},{"$f":"IFERROR(VLOOKUP(AM76,Choixeleves!$M$12:$Z$157,7,FALSE),\"\")","v":""},74]
[null,null,null,null,null,null,null,null,null,null,"Rémi_75",{"$f":"IFERROR(VLOOKUP(K77,Choixeleves!$M$12:$Z$157,3,FALSE),\"\")","v":""},{"$f":"IFERROR(VLOOKUP(K77,Choixeleves!$M$12:$Z$157,5,FALSE),\"\")","v":""},{"$f":"IFERROR(VLOOKUP(K77,Choixeleves!$M$12:$Z$157,6,FALSE),\"\")","v":""},{"$f":"IFERROR(VLOOKUP(K77,Choixeleves!$M$12:$Z$157,7,FALSE),\"\")","v":""},75,null,"Timothée_75",{"$f":"IFERROR(VLOOKUP(R77,Choixeleves!$M$12:$Z$157,3,FALSE),\"\")","v":""},{"$f":"IFERROR(VLOOKUP(R77,Choixeleves!$M$12:$Z$157,5,FALSE),\"\")","v":""},{"$f":"IFERROR(VLOOKUP(R77,Choixeleves!$M$12:$Z$157,6,FALSE),\"\")","v":""},{"$f":"IFERROR(VLOOKUP(R77,Choixeleves!$M$12:$Z$157,7,FALSE),\"\")","v":""},75,null,"Virginie_75",{"$f":"IFERROR(VLOOKUP(Y77,Choixeleves!$M$12:$Z$157,3,FALSE),\"\")","v":""},{"$f":"IFERROR(VLOOKUP(Y77,Choixeleves!$M$12:$Z$157,5,FALSE),\"\")","v":""},{"$f":"IFERROR(VLOOKUP(Y77,Choixeleves!$M$12:$Z$157,6,FALSE),\"\")","v":""},{"$f":"IFERROR(VLOOKUP(Y77,Choixeleves!$M$12:$Z$157,7,FALSE),\"\")","v":""},75,null,"Quentin_75",{"$f":"IFERROR(VLOOKUP(AF77,Choixeleves!$M$12:$Z$157,3,FALSE),\"\")","v":""},{"$f":"IFERROR(VLOOKUP(AF77,Choixeleves!$M$12:$Z$157,5,FALSE),\"\")","v":""},{"$f":"IFERROR(VLOOKUP(AF77,Choixeleves!$M$12:$Z$157,6,FALSE),\"\")","v":""},{"$f":"IFERROR(VLOOKUP(AF77,Choixeleves!$M$12:$Z$157,7,FALSE),\"\")","v":""},75,null,"Mick_75",{"$f":"IFERROR(VLOOKUP(AM77,Choixeleves!$M$12:$Z$157,3,FALSE),\"\")","v":""},{"$f":"IFERROR(VLOOKUP(AM77,Choixeleves!$M$12:$Z$157,5,FALSE),\"\")","v":""},{"$f":"IFERROR(VLOOKUP(AM77,Choixeleves!$M$12:$Z$157,6,FALSE),\"\")","v":""},{"$f":"IFERROR(VLOOKUP(AM77,Choixeleves!$M$12:$Z$157,7,FALSE),\"\")","v":""},75]
[null,null,null,null,null,null,null,null,null,null,"Rémi_76",{"$f":"IFERROR(VLOOKUP(K78,Choixeleves!$M$12:$Z$157,3,FALSE),\"\")","v":""},{"$f":"IFERROR(VLOOKUP(K78,Choixeleves!$M$12:$Z$157,5,FALSE),\"\")","v":""},{"$f":"IFERROR(VLOOKUP(K78,Choixeleves!$M$12:$Z$157,6,FALSE),\"\")","v":""},{"$f":"IFERROR(VLOOKUP(K78,Choixeleves!$M$12:$Z$157,7,FALSE),\"\")","v":""},76,null,"Timothée_76",{"$f":"IFERROR(VLOOKUP(R78,Choixeleves!$M$12:$Z$157,3,FALSE),\"\")","v":""},{"$f":"IFERROR(VLOOKUP(R78,Choixeleves!$M$12:$Z$157,5,FALSE),\"\")","v":""},{"$f":"IFERROR(VLOOKUP(R78,Choixeleves!$M$12:$Z$157,6,FALSE),\"\")","v":""},{"$f":"IFERROR(VLOOKUP(R78,Choixeleves!$M$12:$Z$157,7,FALSE),\"\")","v":""},76,null,"Virginie_76",{"$f":"IFERROR(VLOOKUP(Y78,Choixeleves!$M$12:$Z$157,3,FALSE),\"\")","v":""},{"$f":"IFERROR(VLOOKUP(Y78,Choixeleves!$M$12:$Z$157,5,FALSE),\"\")","v":""},{"$f":"IFERROR(VLOOKUP(Y78,Choixeleves!$M$12:$Z$157,6,FALSE),\"\")","v":""},{"$f":"IFERROR(VLOOKUP(Y78,Choixeleves!$M$12:$Z$157,7,FALSE),\"\")","v":""},76,null,"Quentin_76",{"$f":"IFERROR(VLOOKUP(AF78,Choixeleves!$M$12:$Z$157,3,FALSE),\"\")","v":""},{"$f":"IFERROR(VLOOKUP(AF78,Choixeleves!$M$12:$Z$157,5,FALSE),\"\")","v":""},{"$f":"IFERROR(VLOOKUP(AF78,Choixeleves!$M$12:$Z$157,6,FALSE),\"\")","v":""},{"$f":"IFERROR(VLOOKUP(AF78,Choixeleves!$M$12:$Z$157,7,FALSE),\"\")","v":""},76,null,"Mick_76",{"$f":"IFERROR(VLOOKUP(AM78,Choixeleves!$M$12:$Z$157,3,FALSE),\"\")","v":""},{"$f":"IFERROR(VLOOKUP(AM78,Choixeleves!$M$12:$Z$157,5,FALSE),\"\")","v":""},{"$f":"IFERROR(VLOOKUP(AM78,Choixeleves!$M$12:$Z$157,6,FALSE),\"\")","v":""},{"$f":"IFERROR(VLOOKUP(AM78,Choixeleves!$M$12:$Z$157,7,FALSE),\"\")","v":""},76]
[null,null,null,null,null,null,null,null,null,null,"Rémi_77",{"$f":"IFERROR(VLOOKUP(K79,Choixeleves!$M$12:$Z$157,3,FALSE),\"\")","v":""},{"$f":"IFERROR(VLOOKUP(K79,Choixeleves!$M$12:$Z$157,5,FALSE),\"\")","v":""},{"$f":"IFERROR(VLOOKUP(K79,Choixeleves!$M$12:$Z$157,6,FALSE),\"\")","v":""},{"$f":"IFERROR(VLOOKUP(K79,Choixeleves!$M$12:$Z$157,7,FALSE),\"\")","v":""},77,null,"Timothée_77",{"$f":"IFERROR(VLOOKUP(R79,Choixeleves!$M$12:$Z$157,3,FALSE),\"\")","v":""},{"$f":"IFERROR(VLOOKUP(R79,Choixeleves!$M$12:$Z$157,5,FALSE),\"\")","v":""},{"$f":"IFERROR(VLOOKUP(R79,Choixeleves!$M$12:$Z$157,6,FALSE),\"\")","v":""},{"$f":"IFERROR(VLOOKUP(R79,Choixeleves!$M$12:$Z$157,7,FALSE),\"\")","v":""},77,null,"Virginie_77",{"$f":"IFERROR(VLOOKUP(Y79,Choixeleves!$M$12:$Z$157,3,FALSE),\"\")","v":""},{"$f":"IFERROR(VLOOKUP(Y79,Choixeleves!$M$12:$Z$157,5,FALSE),\"\")","v":""},{"$f":"IFERROR(VLOOKUP(Y79,Choixeleves!$M$12:$Z$157,6,FALSE),\"\")","v":""},{"$f":"IFERROR(VLOOKUP(Y79,Choixeleves!$M$12:$Z$157,7,FALSE),\"\")","v":""},77,null,"Quentin_77",{"$f":"IFERROR(VLOOKUP(AF79,Choixeleves!$M$12:$Z$157,3,FALSE),\"\")","v":""},{"$f":"IFERROR(VLOOKUP(AF79,Choixeleves!$M$12:$Z$157,5,FALSE),\"\")","v":""},{"$f":"IFERROR(VLOOKUP(AF79,Choixeleves!$M$12:$Z$157,6,FALSE),\"\")","v":""},{"$f":"IFERROR(VLOOKUP(AF79,Choixeleves!$M$12:$Z$157,7,FALSE),\"\")","v":""},77,null,"Mick_77",{"$f":"IFERROR(VLOOKUP(AM79,Choixeleves!$M$12:$Z$157,3,FALSE),\"\")","v":""},{"$f":"IFERROR(VLOOKUP(AM79,Choixeleves!$M$12:$Z$157,5,FALSE),\"\")","v":""},{"$f":"IFERROR(VLOOKUP(AM79,Choixeleves!$M$12:$Z$157,6,FALSE),\"\")","v":""},{"$f":"IFERROR(VLOOKUP(AM79,Choixeleves!$M$12:$Z$157,7,FALSE),\"\")","v":""},77]
[null,null,null,null,null,null,null,null,null,null,"Rémi_78",{"$f":"IFERROR(VLOOKUP(K80,Choixeleves!$M$12:$Z$157,3,FALSE),\"\")","v":""},{"$f":"IFERROR(VLOOKUP(K80,Choixeleves!$M$12:$Z$157,5,FALSE),\"\")","v":""},{"$f":"IFERROR(VLOOKUP(K80,Choixeleves!$M$12:$Z$157,6,FALSE),\"\")","v":""},{"$f":"IFERROR(VLOOKUP(K80,Choixeleves!$M$12:$Z$157,7,FALSE),\"\")","v":""},78,null,"Timothée_78",{"$f":"IFERROR(VLOOKUP(R80,Choixeleves!$M$12:$Z$157,3,FALSE),\"\")","v":""},{"$f":"IFERROR(VLOOKUP(R80,Choixeleves!$M$12:$Z$157,5,FALSE),\"\")","v":""},{"$f":"IFERROR(VLOOKUP(R80,Choixeleves!$M$12:$Z$157,6,FALSE),\"\")","v":""},{"$f":"IFERROR(VLOOKUP(R80,Choixeleves!$M$12:$Z$157,7,FALSE),\"\")","v":""},78,null,"Virginie_78",{"$f":"IFERROR(VLOOKUP(Y80,Choixeleves!$M$12:$Z$157,3,FALSE),\"\")","v":""},{"$f":"IFERROR(VLOOKUP(Y80,Choixeleves!$M$12:$Z$157,5,FALSE),\"\")","v":""},{"$f":"IFERROR(VLOOKUP(Y80,Choixeleves!$M$12:$Z$157,6,FALSE),\"\")","v":""},{"$f":"IFERROR(VLOOKUP(Y80,Choixeleves!$M$12:$Z$157,7,FALSE),\"\")","v":""},78,null,"Quentin_78",{"$f":"IFERROR(VLOOKUP(AF80,Choixeleves!$M$12:$Z$157,3,FALSE),\"\")","v":""},{"$f":"IFERROR(VLOOKUP(AF80,Choixeleves!$M$12:$Z$157,5,FALSE),\"\")","v":""},{"$f":"IFERROR(VLOOKUP(AF80,Choixeleves!$M$12:$Z$157,6,FALSE),\"\")","v":""},{"$f":"IFERROR(VLOOKUP(AF80,Choixeleves!$M$12:$Z$157,7,FALSE),\"\")","v":""},78,null,"Mick_78",{"$f":"IFERROR(VLOOKUP(AM80,Choixeleves!$M$12:$Z$157,3,FALSE),\"\")","v":""},{"$f":"IFERROR(VLOOKUP(AM80,Choixeleves!$M$12:$Z$157,5,FALSE),\"\")","v":""},{"$f":"IFERROR(VLOOKUP(AM80,Choixeleves!$M$12:$Z$157,6,FALSE),\"\")","v":""},{"$f":"IFERROR(VLOOKUP(AM80,Choixeleves!$M$12:$Z$157,7,FALSE),\"\")","v":""},78]
[null,null,null,null,null,null,null,null,null,null,"Rémi_79",{"$f":"IFERROR(VLOOKUP(K81,Choixeleves!$M$12:$Z$157,3,FALSE),\"\")","v":""},{"$f":"IFERROR(VLOOKUP(K81,Choixeleves!$M$12:$Z$157,5,FALSE),\"\")","v":""},{"$f":"IFERROR(VLOOKUP(K81,Choixeleves!$M$12:$Z$157,6,FALSE),\"\")","v":""},{"$f":"IFERROR(VLOOKUP(K81,Choixeleves!$M$12:$Z$157,7,FALSE),\"\")","v":""},79,null,"Timothée_79",{"$f":"IFERROR(VLOOKUP(R81,Choixeleves!$M$12:$Z$157,3,FALSE),\"\")","v":""},{"$f":"IFERROR(VLOOKUP(R81,Choixeleves!$M$12:$Z$157,5,FALSE),\"\")","v":""},{"$f":"IFERROR(VLOOKUP(R81,Choixeleves!$M$12:$Z$157,6,FALSE),\"\")","v":""},{"$f":"IFERROR(VLOOKUP(R81,Choixeleves!$M$12:$Z$157,7,FALSE),\"\")","v":""},79,null,"Virginie_79",{"$f":"IFERROR(VLOOKUP(Y81,Choixeleves!$M$12:$Z$157,3,FALSE),\"\")","v":""},{"$f":"IFERROR(VLOOKUP(Y81,Choixeleves!$M$12:$Z$157,5,FALSE),\"\")","v":""},{"$f":"IFERROR(VLOOKUP(Y81,Choixeleves!$M$12:$Z$157,6,FALSE),\"\")","v":""},{"$f":"IFERROR(VLOOKUP(Y81,Choixeleves!$M$12:$Z$157,7,FALSE),\"\")","v":""},79,null,"Quentin_79",{"$f":"IFERROR(VLOOKUP(AF81,Choixeleves!$M$12:$Z$157,3,FALSE),\"\")","v":""},{"$f":"IFERROR(VLOOKUP(AF81,Choixeleves!$M$12:$Z$157,5,FALSE),\"\")","v":""},{"$f":"IFERROR(VLOOKUP(AF81,Choixeleves!$M$12:$Z$157,6,FALSE),\"\")","v":""},{"$f":"IFERROR(VLOOKUP(AF81,Choixeleves!$M$12:$Z$157,7,FALSE),\"\")","v":""},79,null,"Mick_79",{"$f":"IFERROR(VLOOKUP(AM81,Choixeleves!$M$12:$Z$157,3,FALSE),\"\")","v":""},{"$f":"IFERROR(VLOOKUP(AM81,Choixeleves!$M$12:$Z$157,5,FALSE),\"\")","v":""},{"$f":"IFERROR(VLOOKUP(AM81,Choixeleves!$M$12:$Z$157,6,FALSE),\"\")","v":""},{"$f":"IFERROR(VLOOKUP(AM81,Choixeleves!$M$12:$Z$157,7,FALSE),\"\")","v":""},79]
[null,null,null,null,null,null,null,null,null,null,"Rémi_80",{"$f":"IFERROR(VLOOKUP(K82,Choixeleves!$M$12:$Z$157,3,FALSE),\"\")","v":""},{"$f":"IFERROR(VLOOKUP(K82,Choixeleves!$M$12:$Z$157,5,FALSE),\"\")","v":""},{"$f":"IFERROR(VLOOKUP(K82,Choixeleves!$M$12:$Z$157,6,FALSE),\"\")","v":""},{"$f":"IFERROR(VLOOKUP(K82,Choixeleves!$M$12:$Z$157,7,FALSE),\"\")","v":""},80,null,"Timothée_80",{"$f":"IFERROR(VLOOKUP(R82,Choixeleves!$M$12:$Z$157,3,FALSE),\"\")","v":""},{"$f":"IFERROR(VLOOKUP(R82,Choixeleves!$M$12:$Z$157,5,FALSE),\"\")","v":""},{"$f":"IFERROR(VLOOKUP(R82,Choixeleves!$M$12:$Z$157,6,FALSE),\"\")","v":""},{"$f":"IFERROR(VLOOKUP(R82,Choixeleves!$M$12:$Z$157,7,FALSE),\"\")","v":""},80,null,"Virginie_80",{"$f":"IFERROR(VLOOKUP(Y82,Choixeleves!$M$12:$Z$157,3,FALSE),\"\")","v":""},{"$f":"IFERROR(VLOOKUP(Y82,Choixeleves!$M$12:$Z$157,5,FALSE),\"\")","v":""},{"$f":"IFERROR(VLOOKUP(Y82,Choixeleves!$M$12:$Z$157,6,FALSE),\"\")","v":""},{"$f":"IFERROR(VLOOKUP(Y82,Choixeleves!$M$12:$Z$157,7,FALSE),\"\")","v":""},80,null,"Quentin_80",{"$f":"IFERROR(VLOOKUP(AF82,Choixeleves!$M$12:$Z$157,3,FALSE),\"\")","v":""},{"$f":"IFERROR(VLOOKUP(AF82,Choixeleves!$M$12:$Z$157,5,FALSE),\"\")","v":""},{"$f":"IFERROR(VLOOKUP(AF82,Choixeleves!$M$12:$Z$157,6,FALSE),\"\")","v":""},{"$f":"IFERROR(VLOOKUP(AF82,Choixeleves!$M$12:$Z$157,7,FALSE),\"\")","v":""},80,null,"Mick_80",{"$f":"IFERROR(VLOOKUP(AM82,Choixeleves!$M$12:$Z$157,3,FALSE),\"\")","v":""},{"$f":"IFERROR(VLOOKUP(AM82,Choixeleves!$M$12:$Z$157,5,FALSE),\"\")","v":""},{"$f":"IFERROR(VLOOKUP(AM82,Choixeleves!$M$12:$Z$157,6,FALSE),\"\")","v":""},{"$f":"IFERROR(VLOOKUP(AM82,Choixeleves!$M$12:$Z$157,7,FALSE),\"\")","v":""},80]
[null,null,null,null,null,null,null,null,null,null,"Rémi_81",{"$f":"IFERROR(VLOOKUP(K83,Choixeleves!$M$12:$Z$157,3,FALSE),\"\")","v":""},{"$f":"IFERROR(VLOOKUP(K83,Choixeleves!$M$12:$Z$157,5,FALSE),\"\")","v":""},{"$f":"IFERROR(VLOOKUP(K83,Choixeleves!$M$12:$Z$157,6,FALSE),\"\")","v":""},{"$f":"IFERROR(VLOOKUP(K83,Choixeleves!$M$12:$Z$157,7,FALSE),\"\")","v":""},81,null,"Timothée_81",{"$f":"IFERROR(VLOOKUP(R83,Choixeleves!$M$12:$Z$157,3,FALSE),\"\")","v":""},{"$f":"IFERROR(VLOOKUP(R83,Choixeleves!$M$12:$Z$157,5,FALSE),\"\")","v":""},{"$f":"IFERROR(VLOOKUP(R83,Choixeleves!$M$12:$Z$157,6,FALSE),\"\")","v":""},{"$f":"IFERROR(VLOOKUP(R83,Choixeleves!$M$12:$Z$157,7,FALSE),\"\")","v":""},81,null,"Virginie_81",{"$f":"IFERROR(VLOOKUP(Y83,Choixeleves!$M$12:$Z$157,3,FALSE),\"\")","v":""},{"$f":"IFERROR(VLOOKUP(Y83,Choixeleves!$M$12:$Z$157,5,FALSE),\"\")","v":""},{"$f":"IFERROR(VLOOKUP(Y83,Choixeleves!$M$12:$Z$157,6,FALSE),\"\")","v":""},{"$f":"IFERROR(VLOOKUP(Y83,Choixeleves!$M$12:$Z$157,7,FALSE),\"\")","v":""},81,null,"Quentin_81",{"$f":"IFERROR(VLOOKUP(AF83,Choixeleves!$M$12:$Z$157,3,FALSE),\"\")","v":""},{"$f":"IFERROR(VLOOKUP(AF83,Choixeleves!$M$12:$Z$157,5,FALSE),\"\")","v":""},{"$f":"IFERROR(VLOOKUP(AF83,Choixeleves!$M$12:$Z$157,6,FALSE),\"\")","v":""},{"$f":"IFERROR(VLOOKUP(AF83,Choixeleves!$M$12:$Z$157,7,FALSE),\"\")","v":""},81,null,"Mick_81",{"$f":"IFERROR(VLOOKUP(AM83,Choixeleves!$M$12:$Z$157,3,FALSE),\"\")","v":""},{"$f":"IFERROR(VLOOKUP(AM83,Choixeleves!$M$12:$Z$157,5,FALSE),\"\")","v":""},{"$f":"IFERROR(VLOOKUP(AM83,Choixeleves!$M$12:$Z$157,6,FALSE),\"\")","v":""},{"$f":"IFERROR(VLOOKUP(AM83,Choixeleves!$M$12:$Z$157,7,FALSE),\"\")","v":""},81]
[null,null,null,null,null,null,null,null,null,null,"Rémi_82",{"$f":"IFERROR(VLOOKUP(K84,Choixeleves!$M$12:$Z$157,3,FALSE),\"\")","v":""},{"$f":"IFERROR(VLOOKUP(K84,Choixeleves!$M$12:$Z$157,5,FALSE),\"\")","v":""},{"$f":"IFERROR(VLOOKUP(K84,Choixeleves!$M$12:$Z$157,6,FALSE),\"\")","v":""},{"$f":"IFERROR(VLOOKUP(K84,Choixeleves!$M$12:$Z$157,7,FALSE),\"\")","v":""},82,null,"Timothée_82",{"$f":"IFERROR(VLOOKUP(R84,Choixeleves!$M$12:$Z$157,3,FALSE),\"\")","v":""},{"$f":"IFERROR(VLOOKUP(R84,Choixeleves!$M$12:$Z$157,5,FALSE),\"\")","v":""},{"$f":"IFERROR(VLOOKUP(R84,Choixeleves!$M$12:$Z$157,6,FALSE),\"\")","v":""},{"$f":"IFERROR(VLOOKUP(R84,Choixeleves!$M$12:$Z$157,7,FALSE),\"\")","v":""},82,null,"Virginie_82",{"$f":"IFERROR(VLOOKUP(Y84,Choixeleves!$M$12:$Z$157,3,FALSE),\"\")","v":""},{"$f":"IFERROR(VLOOKUP(Y84,Choixeleves!$M$12:$Z$157,5,FALSE),\"\")","v":""},{"$f":"IFERROR(VLOOKUP(Y84,Choixeleves!$M$12:$Z$157,6,FALSE),\"\")","v":""},{"$f":"IFERROR(VLOOKUP(Y84,Choixeleves!$M$12:$Z$157,7,FALSE),\"\")","v":""},82,null,"Quentin_82",{"$f":"IFERROR(VLOOKUP(AF84,Choixeleves!$M$12:$Z$157,3,FALSE),\"\")","v":""},{"$f":"IFERROR(VLOOKUP(AF84,Choixeleves!$M$12:$Z$157,5,FALSE),\"\")","v":""},{"$f":"IFERROR(VLOOKUP(AF84,Choixeleves!$M$12:$Z$157,6,FALSE),\"\")","v":""},{"$f":"IFERROR(VLOOKUP(AF84,Choixeleves!$M$12:$Z$157,7,FALSE),\"\")","v":""},82,null,"Mick_82",{"$f":"IFERROR(VLOOKUP(AM84,Choixeleves!$M$12:$Z$157,3,FALSE),\"\")","v":""},{"$f":"IFERROR(VLOOKUP(AM84,Choixeleves!$M$12:$Z$157,5,FALSE),\"\")","v":""},{"$f":"IFERROR(VLOOKUP(AM84,Choixeleves!$M$12:$Z$157,6,FALSE),\"\")","v":""},{"$f":"IFERROR(VLOOKUP(AM84,Choixeleves!$M$12:$Z$157,7,FALSE),\"\")","v":""},82]
[null,null,null,null,null,null,null,null,null,null,"Rémi_83",{"$f":"IFERROR(VLOOKUP(K85,Choixeleves!$M$12:$Z$157,3,FALSE),\"\")","v":""},{"$f":"IFERROR(VLOOKUP(K85,Choixeleves!$M$12:$Z$157,5,FALSE),\"\")","v":""},{"$f":"IFERROR(VLOOKUP(K85,Choixeleves!$M$12:$Z$157,6,FALSE),\"\")","v":""},{"$f":"IFERROR(VLOOKUP(K85,Choixeleves!$M$12:$Z$157,7,FALSE),\"\")","v":""},83,null,"Timothée_83",{"$f":"IFERROR(VLOOKUP(R85,Choixeleves!$M$12:$Z$157,3,FALSE),\"\")","v":""},{"$f":"IFERROR(VLOOKUP(R85,Choixeleves!$M$12:$Z$157,5,FALSE),\"\")","v":""},{"$f":"IFERROR(VLOOKUP(R85,Choixeleves!$M$12:$Z$157,6,FALSE),\"\")","v":""},{"$f":"IFERROR(VLOOKUP(R85,Choixeleves!$M$12:$Z$157,7,FALSE),\"\")","v":""},83,null,"Virginie_83",{"$f":"IFERROR(VLOOKUP(Y85,Choixeleves!$M$12:$Z$157,3,FALSE),\"\")","v":""},{"$f":"IFERROR(VLOOKUP(Y85,Choixeleves!$M$12:$Z$157,5,FALSE),\"\")","v":""},{"$f":"IFERROR(VLOOKUP(Y85,Choixeleves!$M$12:$Z$157,6,FALSE),\"\")","v":""},{"$f":"IFERROR(VLOOKUP(Y85,Choixeleves!$M$12:$Z$157,7,FALSE),\"\")","v":""},83,null,"Quentin_83",{"$f":"IFERROR(VLOOKUP(AF85,Choixeleves!$M$12:$Z$157,3,FALSE),\"\")","v":""},{"$f":"IFERROR(VLOOKUP(AF85,Choixeleves!$M$12:$Z$157,5,FALSE),\"\")","v":""},{"$f":"IFERROR(VLOOKUP(AF85,Choixeleves!$M$12:$Z$157,6,FALSE),\"\")","v":""},{"$f":"IFERROR(VLOOKUP(AF85,Choixeleves!$M$12:$Z$157,7,FALSE),\"\")","v":""},83,null,"Mick_83",{"$f":"IFERROR(VLOOKUP(AM85,Choixeleves!$M$12:$Z$157,3,FALSE),\"\")","v":""},{"$f":"IFERROR(VLOOKUP(AM85,Choixeleves!$M$12:$Z$157,5,FALSE),\"\")","v":""},{"$f":"IFERROR(VLOOKUP(AM85,Choixeleves!$M$12:$Z$157,6,FALSE),\"\")","v":""},{"$f":"IFERROR(VLOOKUP(AM85,Choixeleves!$M$12:$Z$157,7,FALSE),\"\")","v":""},83]
[null,null,null,null,null,null,null,null,null,null,"Rémi_84",{"$f":"IFERROR(VLOOKUP(K86,Choixeleves!$M$12:$Z$157,3,FALSE),\"\")","v":""},{"$f":"IFERROR(VLOOKUP(K86,Choixeleves!$M$12:$Z$157,5,FALSE),\"\")","v":""},{"$f":"IFERROR(VLOOKUP(K86,Choixeleves!$M$12:$Z$157,6,FALSE),\"\")","v":""},{"$f":"IFERROR(VLOOKUP(K86,Choixeleves!$M$12:$Z$157,7,FALSE),\"\")","v":""},84,null,"Timothée_84",{"$f":"IFERROR(VLOOKUP(R86,Choixeleves!$M$12:$Z$157,3,FALSE),\"\")","v":""},{"$f":"IFERROR(VLOOKUP(R86,Choixeleves!$M$12:$Z$157,5,FALSE),\"\")","v":""},{"$f":"IFERROR(VLOOKUP(R86,Choixeleves!$M$12:$Z$157,6,FALSE),\"\")","v":""},{"$f":"IFERROR(VLOOKUP(R86,Choixeleves!$M$12:$Z$157,7,FALSE),\"\")","v":""},84,null,"Virginie_84",{"$f":"IFERROR(VLOOKUP(Y86,Choixeleves!$M$12:$Z$157,3,FALSE),\"\")","v":""},{"$f":"IFERROR(VLOOKUP(Y86,Choixeleves!$M$12:$Z$157,5,FALSE),\"\")","v":""},{"$f":"IFERROR(VLOOKUP(Y86,Choixeleves!$M$12:$Z$157,6,FALSE),\"\")","v":""},{"$f":"IFERROR(VLOOKUP(Y86,Choixeleves!$M$12:$Z$157,7,FALSE),\"\")","v":""},84,null,"Quentin_84",{"$f":"IFERROR(VLOOKUP(AF86,Choixeleves!$M$12:$Z$157,3,FALSE),\"\")","v":""},{"$f":"IFERROR(VLOOKUP(AF86,Choixeleves!$M$12:$Z$157,5,FALSE),\"\")","v":""},{"$f":"IFERROR(VLOOKUP(AF86,Choixeleves!$M$12:$Z$157,6,FALSE),\"\")","v":""},{"$f":"IFERROR(VLOOKUP(AF86,Choixeleves!$M$12:$Z$157,7,FALSE),\"\")","v":""},84,null,"Mick_84",{"$f":"IFERROR(VLOOKUP(AM86,Choixeleves!$M$12:$Z$157,3,FALSE),\"\")","v":""},{"$f":"IFERROR(VLOOKUP(AM86,Choixeleves!$M$12:$Z$157,5,FALSE),\"\")","v":""},{"$f":"IFERROR(VLOOKUP(AM86,Choixeleves!$M$12:$Z$157,6,FALSE),\"\")","v":""},{"$f":"IFERROR(VLOOKUP(AM86,Choixeleves!$M$12:$Z$157,7,FALSE),\"\")","v":""},84]
[null,null,null,null,null,null,null,null,null,null,"Rémi_85",{"$f":"IFERROR(VLOOKUP(K87,Choixeleves!$M$12:$Z$157,3,FALSE),\"\")","v":""},{"$f":"IFERROR(VLOOKUP(K87,Choixeleves!$M$12:$Z$157,5,FALSE),\"\")","v":""},{"$f":"IFERROR(VLOOKUP(K87,Choixeleves!$M$12:$Z$157,6,FALSE),\"\")","v":""},{"$f":"IFERROR(VLOOKUP(K87,Choixeleves!$M$12:$Z$157,7,FALSE),\"\")","v":""},85,null,"Timothée_85",{"$f":"IFERROR(VLOOKUP(R87,Choixeleves!$M$12:$Z$157,3,FALSE),\"\")","v":""},{"$f":"IFERROR(VLOOKUP(R87,Choixeleves!$M$12:$Z$157,5,FALSE),\"\")","v":""},{"$f":"IFERROR(VLOOKUP(R87,Choixeleves!$M$12:$Z$157,6,FALSE),\"\")","v":""},{"$f":"IFERROR(VLOOKUP(R87,Choixeleves!$M$12:$Z$157,7,FALSE),\"\")","v":""},85,null,"Virginie_85",{"$f":"IFERROR(VLOOKUP(Y87,Choixeleves!$M$12:$Z$157,3,FALSE),\"\")","v":""},{"$f":"IFERROR(VLOOKUP(Y87,Choixeleves!$M$12:$Z$157,5,FALSE),\"\")","v":""},{"$f":"IFERROR(VLOOKUP(Y87,Choixeleves!$M$12:$Z$157,6,FALSE),\"\")","v":""},{"$f":"IFERROR(VLOOKUP(Y87,Choixeleves!$M$12:$Z$157,7,FALSE),\"\")","v":""},85,null,"Quentin_85",{"$f":"IFERROR(VLOOKUP(AF87,Choixeleves!$M$12:$Z$157,3,FALSE),\"\")","v":""},{"$f":"IFERROR(VLOOKUP(AF87,Choixeleves!$M$12:$Z$157,5,FALSE),\"\")","v":""},{"$f":"IFERROR(VLOOKUP(AF87,Choixeleves!$M$12:$Z$157,6,FALSE),\"\")","v":""},{"$f":"IFERROR(VLOOKUP(AF87,Choixeleves!$M$12:$Z$157,7,FALSE),\"\")","v":""},85,null,"Mick_85",{"$f":"IFERROR(VLOOKUP(AM87,Choixeleves!$M$12:$Z$157,3,FALSE),\"\")","v":""},{"$f":"IFERROR(VLOOKUP(AM87,Choixeleves!$M$12:$Z$157,5,FALSE),\"\")","v":""},{"$f":"IFERROR(VLOOKUP(AM87,Choixeleves!$M$12:$Z$157,6,FALSE),\"\")","v":""},{"$f":"IFERROR(VLOOKUP(AM87,Choixeleves!$M$12:$Z$157,7,FALSE),\"\")","v":""},85]
[null,null,null,null,null,null,null,null,null,null,"Rémi_86",{"$f":"IFERROR(VLOOKUP(K88,Choixeleves!$M$12:$Z$157,3,FALSE),\"\")","v":""},{"$f":"IFERROR(VLOOKUP(K88,Choixeleves!$M$12:$Z$157,5,FALSE),\"\")","v":""},{"$f":"IFERROR(VLOOKUP(K88,Choixeleves!$M$12:$Z$157,6,FALSE),\"\")","v":""},{"$f":"IFERROR(VLOOKUP(K88,Choixeleves!$M$12:$Z$157,7,FALSE),\"\")","v":""},86,null,"Timothée_86",{"$f":"IFERROR(VLOOKUP(R88,Choixeleves!$M$12:$Z$157,3,FALSE),\"\")","v":""},{"$f":"IFERROR(VLOOKUP(R88,Choixeleves!$M$12:$Z$157,5,FALSE),\"\")","v":""},{"$f":"IFERROR(VLOOKUP(R88,Choixeleves!$M$12:$Z$157,6,FALSE),\"\")","v":""},{"$f":"IFERROR(VLOOKUP(R88,Choixeleves!$M$12:$Z$157,7,FALSE),\"\")","v":""},86,null,"Virginie_86",{"$f":"IFERROR(VLOOKUP(Y88,Choixeleves!$M$12:$Z$157,3,FALSE),\"\")","v":""},{"$f":"IFERROR(VLOOKUP(Y88,Choixeleves!$M$12:$Z$157,5,FALSE),\"\")","v":""},{"$f":"IFERROR(VLOOKUP(Y88,Choixeleves!$M$12:$Z$157,6,FALSE),\"\")","v":""},{"$f":"IFERROR(VLOOKUP(Y88,Choixeleves!$M$12:$Z$157,7,FALSE),\"\")","v":""},86,null,"Quentin_86",{"$f":"IFERROR(VLOOKUP(AF88,Choixeleves!$M$12:$Z$157,3,FALSE),\"\")","v":""},{"$f":"IFERROR(VLOOKUP(AF88,Choixeleves!$M$12:$Z$157,5,FALSE),\"\")","v":""},{"$f":"IFERROR(VLOOKUP(AF88,Choixeleves!$M$12:$Z$157,6,FALSE),\"\")","v":""},{"$f":"IFERROR(VLOOKUP(AF88,Choixeleves!$M$12:$Z$157,7,FALSE),\"\")","v":""},86,null,"Mick_86",{"$f":"IFERROR(VLOOKUP(AM88,Choixeleves!$M$12:$Z$157,3,FALSE),\"\")","v":""},{"$f":"IFERROR(VLOOKUP(AM88,Choixeleves!$M$12:$Z$157,5,FALSE),\"\")","v":""},{"$f":"IFERROR(VLOOKUP(AM88,Choixeleves!$M$12:$Z$157,6,FALSE),\"\")","v":""},{"$f":"IFERROR(VLOOKUP(AM88,Choixeleves!$M$12:$Z$157,7,FALSE),\"\")","v":""},86]
[null,null,null,null,null,null,null,null,null,null,"Rémi_87",{"$f":"IFERROR(VLOOKUP(K89,Choixeleves!$M$12:$Z$157,3,FALSE),\"\")","v":""},{"$f":"IFERROR(VLOOKUP(K89,Choixeleves!$M$12:$Z$157,5,FALSE),\"\")","v":""},{"$f":"IFERROR(VLOOKUP(K89,Choixeleves!$M$12:$Z$157,6,FALSE),\"\")","v":""},{"$f":"IFERROR(VLOOKUP(K89,Choixeleves!$M$12:$Z$157,7,FALSE),\"\")","v":""},87,null,"Timothée_87",{"$f":"IFERROR(VLOOKUP(R89,Choixeleves!$M$12:$Z$157,3,FALSE),\"\")","v":""},{"$f":"IFERROR(VLOOKUP(R89,Choixeleves!$M$12:$Z$157,5,FALSE),\"\")","v":""},{"$f":"IFERROR(VLOOKUP(R89,Choixeleves!$M$12:$Z$157,6,FALSE),\"\")","v":""},{"$f":"IFERROR(VLOOKUP(R89,Choixeleves!$M$12:$Z$157,7,FALSE),\"\")","v":""},87,null,"Virginie_87",{"$f":"IFERROR(VLOOKUP(Y89,Choixeleves!$M$12:$Z$157,3,FALSE),\"\")","v":""},{"$f":"IFERROR(VLOOKUP(Y89,Choixeleves!$M$12:$Z$157,5,FALSE),\"\")","v":""},{"$f":"IFERROR(VLOOKUP(Y89,Choixeleves!$M$12:$Z$157,6,FALSE),\"\")","v":""},{"$f":"IFERROR(VLOOKUP(Y89,Choixeleves!$M$12:$Z$157,7,FALSE),\"\")","v":""},87,null,"Quentin_87",{"$f":"IFERROR(VLOOKUP(AF89,Choixeleves!$M$12:$Z$157,3,FALSE),\"\")","v":""},{"$f":"IFERROR(VLOOKUP(AF89,Choixeleves!$M$12:$Z$157,5,FALSE),\"\")","v":""},{"$f":"IFERROR(VLOOKUP(AF89,Choixeleves!$M$12:$Z$157,6,FALSE),\"\")","v":""},{"$f":"IFERROR(VLOOKUP(AF89,Choixeleves!$M$12:$Z$157,7,FALSE),\"\")","v":""},87,null,"Mick_87",{"$f":"IFERROR(VLOOKUP(AM89,Choixeleves!$M$12:$Z$157,3,FALSE),\"\")","v":""},{"$f":"IFERROR(VLOOKUP(AM89,Choixeleves!$M$12:$Z$157,5,FALSE),\"\")","v":""},{"$f":"IFERROR(VLOOKUP(AM89,Choixeleves!$M$12:$Z$157,6,FALSE),\"\")","v":""},{"$f":"IFERROR(VLOOKUP(AM89,Choixeleves!$M$12:$Z$157,7,FALSE),\"\")","v":""},87]
[null,null,null,null,null,null,null,null,null,null,"Rémi_88",{"$f":"IFERROR(VLOOKUP(K90,Choixeleves!$M$12:$Z$157,3,FALSE),\"\")","v":""},{"$f":"IFERROR(VLOOKUP(K90,Choixeleves!$M$12:$Z$157,5,FALSE),\"\")","v":""},{"$f":"IFERROR(VLOOKUP(K90,Choixeleves!$M$12:$Z$157,6,FALSE),\"\")","v":""},{"$f":"IFERROR(VLOOKUP(K90,Choixeleves!$M$12:$Z$157,7,FALSE),\"\")","v":""},88,null,"Timothée_88",{"$f":"IFERROR(VLOOKUP(R90,Choixeleves!$M$12:$Z$157,3,FALSE),\"\")","v":""},{"$f":"IFERROR(VLOOKUP(R90,Choixeleves!$M$12:$Z$157,5,FALSE),\"\")","v":""},{"$f":"IFERROR(VLOOKUP(R90,Choixeleves!$M$12:$Z$157,6,FALSE),\"\")","v":""},{"$f":"IFERROR(VLOOKUP(R90,Choixeleves!$M$12:$Z$157,7,FALSE),\"\")","v":""},88,null,"Virginie_88",{"$f":"IFERROR(VLOOKUP(Y90,Choixeleves!$M$12:$Z$157,3,FALSE),\"\")","v":""},{"$f":"IFERROR(VLOOKUP(Y90,Choixeleves!$M$12:$Z$157,5,FALSE),\"\")","v":""},{"$f":"IFERROR(VLOOKUP(Y90,Choixeleves!$M$12:$Z$157,6,FALSE),\"\")","v":""},{"$f":"IFERROR(VLOOKUP(Y90,Choixeleves!$M$12:$Z$157,7,FALSE),\"\")","v":""},88,null,"Quentin_88",{"$f":"IFERROR(VLOOKUP(AF90,Choixeleves!$M$12:$Z$157,3,FALSE),\"\")","v":""},{"$f":"IFERROR(VLOOKUP(AF90,Choixeleves!$M$12:$Z$157,5,FALSE),\"\")","v":""},{"$f":"IFERROR(VLOOKUP(AF90,Choixeleves!$M$12:$Z$157,6,FALSE),\"\")","v":""},{"$f":"IFERROR(VLOOKUP(AF90,Choixeleves!$M$12:$Z$157,7,FALSE),\"\")","v":""},88,null,"Mick_88",{"$f":"IFERROR(VLOOKUP(AM90,Choixeleves!$M$12:$Z$157,3,FALSE),\"\")","v":""},{"$f":"IFERROR(VLOOKUP(AM90,Choixeleves!$M$12:$Z$157,5,FALSE),\"\")","v":""},{"$f":"IFERROR(VLOOKUP(AM90,Choixeleves!$M$12:$Z$157,6,FALSE),\"\")","v":""},{"$f":"IFERROR(VLOOKUP(AM90,Choixeleves!$M$12:$Z$157,7,FALSE),\"\")","v":""},88]
[null,null,null,null,null,null,null,null,null,null,"Rémi_89",{"$f":"IFERROR(VLOOKUP(K91,Choixeleves!$M$12:$Z$157,3,FALSE),\"\")","v":""},{"$f":"IFERROR(VLOOKUP(K91,Choixeleves!$M$12:$Z$157,5,FALSE),\"\")","v":""},{"$f":"IFERROR(VLOOKUP(K91,Choixeleves!$M$12:$Z$157,6,FALSE),\"\")","v":""},{"$f":"IFERROR(VLOOKUP(K91,Choixeleves!$M$12:$Z$157,7,FALSE),\"\")","v":""},89,null,"Timothée_89",{"$f":"IFERROR(VLOOKUP(R91,Choixeleves!$M$12:$Z$157,3,FALSE),\"\")","v":""},{"$f":"IFERROR(VLOOKUP(R91,Choixeleves!$M$12:$Z$157,5,FALSE),\"\")","v":""},{"$f":"IFERROR(VLOOKUP(R91,Choixeleves!$M$12:$Z$157,6,FALSE),\"\")","v":""},{"$f":"IFERROR(VLOOKUP(R91,Choixeleves!$M$12:$Z$157,7,FALSE),\"\")","v":""},89,null,"Virginie_89",{"$f":"IFERROR(VLOOKUP(Y91,Choixeleves!$M$12:$Z$157,3,FALSE),\"\")","v":""},{"$f":"IFERROR(VLOOKUP(Y91,Choixeleves!$M$12:$Z$157,5,FALSE),\"\")","v":""},{"$f":"IFERROR(VLOOKUP(Y91,Choixeleves!$M$12:$Z$157,6,FALSE),\"\")","v":""},{"$f":"IFERROR(VLOOKUP(Y91,Choixeleves!$M$12:$Z$157,7,FALSE),\"\")","v":""},89,null,"Quentin_89",{"$f":"IFERROR(VLOOKUP(AF91,Choixeleves!$M$12:$Z$157,3,FALSE),\"\")","v":""},{"$f":"IFERROR(VLOOKUP(AF91,Choixeleves!$M$12:$Z$157,5,FALSE),\"\")","v":""},{"$f":"IFERROR(VLOOKUP(AF91,Choixeleves!$M$12:$Z$157,6,FALSE),\"\")","v":""},{"$f":"IFERROR(VLOOKUP(AF91,Choixeleves!$M$12:$Z$157,7,FALSE),\"\")","v":""},89,null,"Mick_89",{"$f":"IFERROR(VLOOKUP(AM91,Choixeleves!$M$12:$Z$157,3,FALSE),\"\")","v":""},{"$f":"IFERROR(VLOOKUP(AM91,Choixeleves!$M$12:$Z$157,5,FALSE),\"\")","v":""},{"$f":"IFERROR(VLOOKUP(AM91,Choixeleves!$M$12:$Z$157,6,FALSE),\"\")","v":""},{"$f":"IFERROR(VLOOKUP(AM91,Choixeleves!$M$12:$Z$157,7,FALSE),\"\")","v":""},89]
[null,null,null,null,null,null,null,null,null,null,"Rémi_90",{"$f":"IFERROR(VLOOKUP(K92,Choixeleves!$M$12:$Z$157,3,FALSE),\"\")","v":""},{"$f":"IFERROR(VLOOKUP(K92,Choixeleves!$M$12:$Z$157,5,FALSE),\"\")","v":""},{"$f":"IFERROR(VLOOKUP(K92,Choixeleves!$M$12:$Z$157,6,FALSE),\"\")","v":""},{"$f":"IFERROR(VLOOKUP(K92,Choixeleves!$M$12:$Z$157,7,FALSE),\"\")","v":""},90,null,"Timothée_90",{"$f":"IFERROR(VLOOKUP(R92,Choixeleves!$M$12:$Z$157,3,FALSE),\"\")","v":""},{"$f":"IFERROR(VLOOKUP(R92,Choixeleves!$M$12:$Z$157,5,FALSE),\"\")","v":""},{"$f":"IFERROR(VLOOKUP(R92,Choixeleves!$M$12:$Z$157,6,FALSE),\"\")","v":""},{"$f":"IFERROR(VLOOKUP(R92,Choixeleves!$M$12:$Z$157,7,FALSE),\"\")","v":""},90,null,"Virginie_90",{"$f":"IFERROR(VLOOKUP(Y92,Choixeleves!$M$12:$Z$157,3,FALSE),\"\")","v":""},{"$f":"IFERROR(VLOOKUP(Y92,Choixeleves!$M$12:$Z$157,5,FALSE),\"\")","v":""},{"$f":"IFERROR(VLOOKUP(Y92,Choixeleves!$M$12:$Z$157,6,FALSE),\"\")","v":""},{"$f":"IFERROR(VLOOKUP(Y92,Choixeleves!$M$12:$Z$157,7,FALSE),\"\")","v":""},90,null,"Quentin_90",{"$f":"IFERROR(VLOOKUP(AF92,Choixeleves!$M$12:$Z$157,3,FALSE),\"\")","v":""},{"$f":"IFERROR(VLOOKUP(AF92,Choixeleves!$M$12:$Z$157,5,FALSE),\"\")","v":""},{"$f":"IFERROR(VLOOKUP(AF92,Choixeleves!$M$12:$Z$157,6,FALSE),\"\")","v":""},{"$f":"IFERROR(VLOOKUP(AF92,Choixeleves!$M$12:$Z$157,7,FALSE),\"\")","v":""},90,null,"Mick_90",{"$f":"IFERROR(VLOOKUP(AM92,Choixeleves!$M$12:$Z$157,3,FALSE),\"\")","v":""},{"$f":"IFERROR(VLOOKUP(AM92,Choixeleves!$M$12:$Z$157,5,FALSE),\"\")","v":""},{"$f":"IFERROR(VLOOKUP(AM92,Choixeleves!$M$12:$Z$157,6,FALSE),\"\")","v":""},{"$f":"IFERROR(VLOOKUP(AM92,Choixeleves!$M$12:$Z$157,7,FALSE),\"\")","v":""},90]
[null,null,null,null,null,null,null,null,null,null,"Rémi_91",{"$f":"IFERROR(VLOOKUP(K93,Choixeleves!$M$12:$Z$157,3,FALSE),\"\")","v":""},{"$f":"IFERROR(VLOOKUP(K93,Choixeleves!$M$12:$Z$157,5,FALSE),\"\")","v":""},{"$f":"IFERROR(VLOOKUP(K93,Choixeleves!$M$12:$Z$157,6,FALSE),\"\")","v":""},{"$f":"IFERROR(VLOOKUP(K93,Choixeleves!$M$12:$Z$157,7,FALSE),\"\")","v":""},91,null,"Timothée_91",{"$f":"IFERROR(VLOOKUP(R93,Choixeleves!$M$12:$Z$157,3,FALSE),\"\")","v":""},{"$f":"IFERROR(VLOOKUP(R93,Choixeleves!$M$12:$Z$157,5,FALSE),\"\")","v":""},{"$f":"IFERROR(VLOOKUP(R93,Choixeleves!$M$12:$Z$157,6,FALSE),\"\")","v":""},{"$f":"IFERROR(VLOOKUP(R93,Choixeleves!$M$12:$Z$157,7,FALSE),\"\")","v":""},91,null,"Virginie_91",{"$f":"IFERROR(VLOOKUP(Y93,Choixeleves!$M$12:$Z$157,3,FALSE),\"\")","v":""},{"$f":"IFERROR(VLOOKUP(Y93,Choixeleves!$M$12:$Z$157,5,FALSE),\"\")","v":""},{"$f":"IFERROR(VLOOKUP(Y93,Choixeleves!$M$12:$Z$157,6,FALSE),\"\")","v":""},{"$f":"IFERROR(VLOOKUP(Y93,Choixeleves!$M$12:$Z$157,7,FALSE),\"\")","v":""},91,null,"Quentin_91",{"$f":"IFERROR(VLOOKUP(AF93,Choixeleves!$M$12:$Z$157,3,FALSE),\"\")","v":""},{"$f":"IFERROR(VLOOKUP(AF93,Choixeleves!$M$12:$Z$157,5,FALSE),\"\")","v":""},{"$f":"IFERROR(VLOOKUP(AF93,Choixeleves!$M$12:$Z$157,6,FALSE),\"\")","v":""},{"$f":"IFERROR(VLOOKUP(AF93,Choixeleves!$M$12:$Z$157,7,FALSE),\"\")","v":""},91,null,"Mick_91",{"$f":"IFERROR(VLOOKUP(AM93,Choixeleves!$M$12:$Z$157,3,FALSE),\"\")","v":""},{"$f":"IFERROR(VLOOKUP(AM93,Choixeleves!$M$12:$Z$157,5,FALSE),\"\")","v":""},{"$f":"IFERROR(VLOOKUP(AM93,Choixeleves!$M$12:$Z$157,6,FALSE),\"\")","v":""},{"$f":"IFERROR(VLOOKUP(AM93,Choixeleves!$M$12:$Z$157,7,FALSE),\"\")","v":""},91]
[null,null,null,null,null,null,null,null,null,null,"Rémi_92",{"$f":"IFERROR(VLOOKUP(K94,Choixeleves!$M$12:$Z$157,3,FALSE),\"\")","v":""},{"$f":"IFERROR(VLOOKUP(K94,Choixeleves!$M$12:$Z$157,5,FALSE),\"\")","v":""},{"$f":"IFERROR(VLOOKUP(K94,Choixeleves!$M$12:$Z$157,6,FALSE),\"\")","v":""},{"$f":"IFERROR(VLOOKUP(K94,Choixeleves!$M$12:$Z$157,7,FALSE),\"\")","v":""},92,null,"Timothée_92",{"$f":"IFERROR(VLOOKUP(R94,Choixeleves!$M$12:$Z$157,3,FALSE),\"\")","v":""},{"$f":"IFERROR(VLOOKUP(R94,Choixeleves!$M$12:$Z$157,5,FALSE),\"\")","v":""},{"$f":"IFERROR(VLOOKUP(R94,Choixeleves!$M$12:$Z$157,6,FALSE),\"\")","v":""},{"$f":"IFERROR(VLOOKUP(R94,Choixeleves!$M$12:$Z$157,7,FALSE),\"\")","v":""},92,null,"Virginie_92",{"$f":"IFERROR(VLOOKUP(Y94,Choixeleves!$M$12:$Z$157,3,FALSE),\"\")","v":""},{"$f":"IFERROR(VLOOKUP(Y94,Choixeleves!$M$12:$Z$157,5,FALSE),\"\")","v":""},{"$f":"IFERROR(VLOOKUP(Y94,Choixeleves!$M$12:$Z$157,6,FALSE),\"\")","v":""},{"$f":"IFERROR(VLOOKUP(Y94,Choixeleves!$M$12:$Z$157,7,FALSE),\"\")","v":""},92,null,"Quentin_92",{"$f":"IFERROR(VLOOKUP(AF94,Choixeleves!$M$12:$Z$157,3,FALSE),\"\")","v":""},{"$f":"IFERROR(VLOOKUP(AF94,Choixeleves!$M$12:$Z$157,5,FALSE),\"\")","v":""},{"$f":"IFERROR(VLOOKUP(AF94,Choixeleves!$M$12:$Z$157,6,FALSE),\"\")","v":""},{"$f":"IFERROR(VLOOKUP(AF94,Choixeleves!$M$12:$Z$157,7,FALSE),\"\")","v":""},92,null,"Mick_92",{"$f":"IFERROR(VLOOKUP(AM94,Choixeleves!$M$12:$Z$157,3,FALSE),\"\")","v":""},{"$f":"IFERROR(VLOOKUP(AM94,Choixeleves!$M$12:$Z$157,5,FALSE),\"\")","v":""},{"$f":"IFERROR(VLOOKUP(AM94,Choixeleves!$M$12:$Z$157,6,FALSE),\"\")","v":""},{"$f":"IFERROR(VLOOKUP(AM94,Choixeleves!$M$12:$Z$157,7,FALSE),\"\")","v":""},92]
[null,null,null,null,null,null,null,null,null,null,"Rémi_93",{"$f":"IFERROR(VLOOKUP(K95,Choixeleves!$M$12:$Z$157,3,FALSE),\"\")","v":""},{"$f":"IFERROR(VLOOKUP(K95,Choixeleves!$M$12:$Z$157,5,FALSE),\"\")","v":""},{"$f":"IFERROR(VLOOKUP(K95,Choixeleves!$M$12:$Z$157,6,FALSE),\"\")","v":""},{"$f":"IFERROR(VLOOKUP(K95,Choixeleves!$M$12:$Z$157,7,FALSE),\"\")","v":""},93,null,"Timothée_93",{"$f":"IFERROR(VLOOKUP(R95,Choixeleves!$M$12:$Z$157,3,FALSE),\"\")","v":""},{"$f":"IFERROR(VLOOKUP(R95,Choixeleves!$M$12:$Z$157,5,FALSE),\"\")","v":""},{"$f":"IFERROR(VLOOKUP(R95,Choixeleves!$M$12:$Z$157,6,FALSE),\"\")","v":""},{"$f":"IFERROR(VLOOKUP(R95,Choixeleves!$M$12:$Z$157,7,FALSE),\"\")","v":""},93,null,"Virginie_93",{"$f":"IFERROR(VLOOKUP(Y95,Choixeleves!$M$12:$Z$157,3,FALSE),\"\")","v":""},{"$f":"IFERROR(VLOOKUP(Y95,Choixeleves!$M$12:$Z$157,5,FALSE),\"\")","v":""},{"$f":"IFERROR(VLOOKUP(Y95,Choixeleves!$M$12:$Z$157,6,FALSE),\"\")","v":""},{"$f":"IFERROR(VLOOKUP(Y95,Choixeleves!$M$12:$Z$157,7,FALSE),\"\")","v":""},93,null,"Quentin_93",{"$f":"IFERROR(VLOOKUP(AF95,Choixeleves!$M$12:$Z$157,3,FALSE),\"\")","v":""},{"$f":"IFERROR(VLOOKUP(AF95,Choixeleves!$M$12:$Z$157,5,FALSE),\"\")","v":""},{"$f":"IFERROR(VLOOKUP(AF95,Choixeleves!$M$12:$Z$157,6,FALSE),\"\")","v":""},{"$f":"IFERROR(VLOOKUP(AF95,Choixeleves!$M$12:$Z$157,7,FALSE),\"\")","v":""},93,null,"Mick_93",{"$f":"IFERROR(VLOOKUP(AM95,Choixeleves!$M$12:$Z$157,3,FALSE),\"\")","v":""},{"$f":"IFERROR(VLOOKUP(AM95,Choixeleves!$M$12:$Z$157,5,FALSE),\"\")","v":""},{"$f":"IFERROR(VLOOKUP(AM95,Choixeleves!$M$12:$Z$157,6,FALSE),\"\")","v":""},{"$f":"IFERROR(VLOOKUP(AM95,Choixeleves!$M$12:$Z$157,7,FALSE),\"\")","v":""},93]
[null,null,null,null,null,null,null,null,null,null,"Rémi_94",{"$f":"IFERROR(VLOOKUP(K96,Choixeleves!$M$12:$Z$157,3,FALSE),\"\")","v":""},{"$f":"IFERROR(VLOOKUP(K96,Choixeleves!$M$12:$Z$157,5,FALSE),\"\")","v":""},{"$f":"IFERROR(VLOOKUP(K96,Choixeleves!$M$12:$Z$157,6,FALSE),\"\")","v":""},{"$f":"IFERROR(VLOOKUP(K96,Choixeleves!$M$12:$Z$157,7,FALSE),\"\")","v":""},94,null,"Timothée_94",{"$f":"IFERROR(VLOOKUP(R96,Choixeleves!$M$12:$Z$157,3,FALSE),\"\")","v":""},{"$f":"IFERROR(VLOOKUP(R96,Choixeleves!$M$12:$Z$157,5,FALSE),\"\")","v":""},{"$f":"IFERROR(VLOOKUP(R96,Choixeleves!$M$12:$Z$157,6,FALSE),\"\")","v":""},{"$f":"IFERROR(VLOOKUP(R96,Choixeleves!$M$12:$Z$157,7,FALSE),\"\")","v":""},94,null,"Virginie_94",{"$f":"IFERROR(VLOOKUP(Y96,Choixeleves!$M$12:$Z$157,3,FALSE),\"\")","v":""},{"$f":"IFERROR(VLOOKUP(Y96,Choixeleves!$M$12:$Z$157,5,FALSE),\"\")","v":""},{"$f":"IFERROR(VLOOKUP(Y96,Choixeleves!$M$12:$Z$157,6,FALSE),\"\")","v":""},{"$f":"IFERROR(VLOOKUP(Y96,Choixeleves!$M$12:$Z$157,7,FALSE),\"\")","v":""},94,null,"Quentin_94",{"$f":"IFERROR(VLOOKUP(AF96,Choixeleves!$M$12:$Z$157,3,FALSE),\"\")","v":""},{"$f":"IFERROR(VLOOKUP(AF96,Choixeleves!$M$12:$Z$157,5,FALSE),\"\")","v":""},{"$f":"IFERROR(VLOOKUP(AF96,Choixeleves!$M$12:$Z$157,6,FALSE),\"\")","v":""},{"$f":"IFERROR(VLOOKUP(AF96,Choixeleves!$M$12:$Z$157,7,FALSE),\"\")","v":""},94,null,"Mick_94",{"$f":"IFERROR(VLOOKUP(AM96,Choixeleves!$M$12:$Z$157,3,FALSE),\"\")","v":""},{"$f":"IFERROR(VLOOKUP(AM96,Choixeleves!$M$12:$Z$157,5,FALSE),\"\")","v":""},{"$f":"IFERROR(VLOOKUP(AM96,Choixeleves!$M$12:$Z$157,6,FALSE),\"\")","v":""},{"$f":"IFERROR(VLOOKUP(AM96,Choixeleves!$M$12:$Z$157,7,FALSE),\"\")","v":""},94]
[null,null,null,null,null,null,null,null,null,null,"Rémi_95",{"$f":"IFERROR(VLOOKUP(K97,Choixeleves!$M$12:$Z$157,3,FALSE),\"\")","v":""},{"$f":"IFERROR(VLOOKUP(K97,Choixeleves!$M$12:$Z$157,5,FALSE),\"\")","v":""},{"$f":"IFERROR(VLOOKUP(K97,Choixeleves!$M$12:$Z$157,6,FALSE),\"\")","v":""},{"$f":"IFERROR(VLOOKUP(K97,Choixeleves!$M$12:$Z$157,7,FALSE),\"\")","v":""},95,null,"Timothée_95",{"$f":"IFERROR(VLOOKUP(R97,Choixeleves!$M$12:$Z$157,3,FALSE),\"\")","v":""},{"$f":"IFERROR(VLOOKUP(R97,Choixeleves!$M$12:$Z$157,5,FALSE),\"\")","v":""},{"$f":"IFERROR(VLOOKUP(R97,Choixeleves!$M$12:$Z$157,6,FALSE),\"\")","v":""},{"$f":"IFERROR(VLOOKUP(R97,Choixeleves!$M$12:$Z$157,7,FALSE),\"\")","v":""},95,null,"Virginie_95",{"$f":"IFERROR(VLOOKUP(Y97,Choixeleves!$M$12:$Z$157,3,FALSE),\"\")","v":""},{"$f":"IFERROR(VLOOKUP(Y97,Choixeleves!$M$12:$Z$157,5,FALSE),\"\")","v":""},{"$f":"IFERROR(VLOOKUP(Y97,Choixeleves!$M$12:$Z$157,6,FALSE),\"\")","v":""},{"$f":"IFERROR(VLOOKUP(Y97,Choixeleves!$M$12:$Z$157,7,FALSE),\"\")","v":""},95,null,"Quentin_95",{"$f":"IFERROR(VLOOKUP(AF97,Choixeleves!$M$12:$Z$157,3,FALSE),\"\")","v":""},{"$f":"IFERROR(VLOOKUP(AF97,Choixeleves!$M$12:$Z$157,5,FALSE),\"\")","v":""},{"$f":"IFERROR(VLOOKUP(AF97,Choixeleves!$M$12:$Z$157,6,FALSE),\"\")","v":""},{"$f":"IFERROR(VLOOKUP(AF97,Choixeleves!$M$12:$Z$157,7,FALSE),\"\")","v":""},95,null,"Mick_95",{"$f":"IFERROR(VLOOKUP(AM97,Choixeleves!$M$12:$Z$157,3,FALSE),\"\")","v":""},{"$f":"IFERROR(VLOOKUP(AM97,Choixeleves!$M$12:$Z$157,5,FALSE),\"\")","v":""},{"$f":"IFERROR(VLOOKUP(AM97,Choixeleves!$M$12:$Z$157,6,FALSE),\"\")","v":""},{"$f":"IFERROR(VLOOKUP(AM97,Choixeleves!$M$12:$Z$157,7,FALSE),\"\")","v":""},95]
[null,null,null,null,null,null,null,null,null,null,"Rémi_96",{"$f":"IFERROR(VLOOKUP(K98,Choixeleves!$M$12:$Z$157,3,FALSE),\"\")","v":""},{"$f":"IFERROR(VLOOKUP(K98,Choixeleves!$M$12:$Z$157,5,FALSE),\"\")","v":""},{"$f":"IFERROR(VLOOKUP(K98,Choixeleves!$M$12:$Z$157,6,FALSE),\"\")","v":""},{"$f":"IFERROR(VLOOKUP(K98,Choixeleves!$M$12:$Z$157,7,FALSE),\"\")","v":""},96,null,"Timothée_96",{"$f":"IFERROR(VLOOKUP(R98,Choixeleves!$M$12:$Z$157,3,FALSE),\"\")","v":""},{"$f":"IFERROR(VLOOKUP(R98,Choixeleves!$M$12:$Z$157,5,FALSE),\"\")","v":""},{"$f":"IFERROR(VLOOKUP(R98,Choixeleves!$M$12:$Z$157,6,FALSE),\"\")","v":""},{"$f":"IFERROR(VLOOKUP(R98,Choixeleves!$M$12:$Z$157,7,FALSE),\"\")","v":""},96,null,"Virginie_96",{"$f":"IFERROR(VLOOKUP(Y98,Choixeleves!$M$12:$Z$157,3,FALSE),\"\")","v":""},{"$f":"IFERROR(VLOOKUP(Y98,Choixeleves!$M$12:$Z$157,5,FALSE),\"\")","v":""},{"$f":"IFERROR(VLOOKUP(Y98,Choixeleves!$M$12:$Z$157,6,FALSE),\"\")","v":""},{"$f":"IFERROR(VLOOKUP(Y98,Choixeleves!$M$12:$Z$157,7,FALSE),\"\")","v":""},96,null,"Quentin_96",{"$f":"IFERROR(VLOOKUP(AF98,Choixeleves!$M$12:$Z$157,3,FALSE),\"\")","v":""},{"$f":"IFERROR(VLOOKUP(AF98,Choixeleves!$M$12:$Z$157,5,FALSE),\"\")","v":""},{"$f":"IFERROR(VLOOKUP(AF98,Choixeleves!$M$12:$Z$157,6,FALSE),\"\")","v":""},{"$f":"IFERROR(VLOOKUP(AF98,Choixeleves!$M$12:$Z$157,7,FALSE),\"\")","v":""},96,null,"Mick_96",{"$f":"IFERROR(VLOOKUP(AM98,Choixeleves!$M$12:$Z$157,3,FALSE),\"\")","v":""},{"$f":"IFERROR(VLOOKUP(AM98,Choixeleves!$M$12:$Z$157,5,FALSE),\"\")","v":""},{"$f":"IFERROR(VLOOKUP(AM98,Choixeleves!$M$12:$Z$157,6,FALSE),\"\")","v":""},{"$f":"IFERROR(VLOOKUP(AM98,Choixeleves!$M$12:$Z$157,7,FALSE),\"\")","v":""},96]
[null,null,null,null,null,null,null,null,null,null,"Rémi_97",{"$f":"IFERROR(VLOOKUP(K99,Choixeleves!$M$12:$Z$157,3,FALSE),\"\")","v":""},{"$f":"IFERROR(VLOOKUP(K99,Choixeleves!$M$12:$Z$157,5,FALSE),\"\")","v":""},{"$f":"IFERROR(VLOOKUP(K99,Choixeleves!$M$12:$Z$157,6,FALSE),\"\")","v":""},{"$f":"IFERROR(VLOOKUP(K99,Choixeleves!$M$12:$Z$157,7,FALSE),\"\")","v":""},97,null,"Timothée_97",{"$f":"IFERROR(VLOOKUP(R99,Choixeleves!$M$12:$Z$157,3,FALSE),\"\")","v":""},{"$f":"IFERROR(VLOOKUP(R99,Choixeleves!$M$12:$Z$157,5,FALSE),\"\")","v":""},{"$f":"IFERROR(VLOOKUP(R99,Choixeleves!$M$12:$Z$157,6,FALSE),\"\")","v":""},{"$f":"IFERROR(VLOOKUP(R99,Choixeleves!$M$12:$Z$157,7,FALSE),\"\")","v":""},97,null,"Virginie_97",{"$f":"IFERROR(VLOOKUP(Y99,Choixeleves!$M$12:$Z$157,3,FALSE),\"\")","v":""},{"$f":"IFERROR(VLOOKUP(Y99,Choixeleves!$M$12:$Z$157,5,FALSE),\"\")","v":""},{"$f":"IFERROR(VLOOKUP(Y99,Choixeleves!$M$12:$Z$157,6,FALSE),\"\")","v":""},{"$f":"IFERROR(VLOOKUP(Y99,Choixeleves!$M$12:$Z$157,7,FALSE),\"\")","v":""},97,null,"Quentin_97",{"$f":"IFERROR(VLOOKUP(AF99,Choixeleves!$M$12:$Z$157,3,FALSE),\"\")","v":""},{"$f":"IFERROR(VLOOKUP(AF99,Choixeleves!$M$12:$Z$157,5,FALSE),\"\")","v":""},{"$f":"IFERROR(VLOOKUP(AF99,Choixeleves!$M$12:$Z$157,6,FALSE),\"\")","v":""},{"$f":"IFERROR(VLOOKUP(AF99,Choixeleves!$M$12:$Z$157,7,FALSE),\"\")","v":""},97,null,"Mick_97",{"$f":"IFERROR(VLOOKUP(AM99,Choixeleves!$M$12:$Z$157,3,FALSE),\"\")","v":""},{"$f":"IFERROR(VLOOKUP(AM99,Choixeleves!$M$12:$Z$157,5,FALSE),\"\")","v":""},{"$f":"IFERROR(VLOOKUP(AM99,Choixeleves!$M$12:$Z$157,6,FALSE),\"\")","v":""},{"$f":"IFERROR(VLOOKUP(AM99,Choixeleves!$M$12:$Z$157,7,FALSE),\"\")","v":""},97]
[null,null,null,null,null,null,null,null,null,null,"Rémi_98",{"$f":"IFERROR(VLOOKUP(K100,Choixeleves!$M$12:$Z$157,3,FALSE),\"\")","v":""},{"$f":"IFERROR(VLOOKUP(K100,Choixeleves!$M$12:$Z$157,5,FALSE),\"\")","v":""},{"$f":"IFERROR(VLOOKUP(K100,Choixeleves!$M$12:$Z$157,6,FALSE),\"\")","v":""},{"$f":"IFERROR(VLOOKUP(K100,Choixeleves!$M$12:$Z$157,7,FALSE),\"\")","v":""},98,null,"Timothée_98",{"$f":"IFERROR(VLOOKUP(R100,Choixeleves!$M$12:$Z$157,3,FALSE),\"\")","v":""},{"$f":"IFERROR(VLOOKUP(R100,Choixeleves!$M$12:$Z$157,5,FALSE),\"\")","v":""},{"$f":"IFERROR(VLOOKUP(R100,Choixeleves!$M$12:$Z$157,6,FALSE),\"\")","v":""},{"$f":"IFERROR(VLOOKUP(R100,Choixeleves!$M$12:$Z$157,7,FALSE),\"\")","v":""},98,null,"Virginie_98",{"$f":"IFERROR(VLOOKUP(Y100,Choixeleves!$M$12:$Z$157,3,FALSE),\"\")","v":""},{"$f":"IFERROR(VLOOKUP(Y100,Choixeleves!$M$12:$Z$157,5,FALSE),\"\")","v":""},{"$f":"IFERROR(VLOOKUP(Y100,Choixeleves!$M$12:$Z$157,6,FALSE),\"\")","v":""},{"$f":"IFERROR(VLOOKUP(Y100,Choixeleves!$M$12:$Z$157,7,FALSE),\"\")","v":""},98,null,"Quentin_98",{"$f":"IFERROR(VLOOKUP(AF100,Choixeleves!$M$12:$Z$157,3,FALSE),\"\")","v":""},{"$f":"IFERROR(VLOOKUP(AF100,Choixeleves!$M$12:$Z$157,5,FALSE),\"\")","v":""},{"$f":"IFERROR(VLOOKUP(AF100,Choixeleves!$M$12:$Z$157,6,FALSE),\"\")","v":""},{"$f":"IFERROR(VLOOKUP(AF100,Choixeleves!$M$12:$Z$157,7,FALSE),\"\")","v":""},98,null,"Mick_98",{"$f":"IFERROR(VLOOKUP(AM100,Choixeleves!$M$12:$Z$157,3,FALSE),\"\")","v":""},{"$f":"IFERROR(VLOOKUP(AM100,Choixeleves!$M$12:$Z$157,5,FALSE),\"\")","v":""},{"$f":"IFERROR(VLOOKUP(AM100,Choixeleves!$M$12:$Z$157,6,FALSE),\"\")","v":""},{"$f":"IFERROR(VLOOKUP(AM100,Choixeleves!$M$12:$Z$157,7,FALSE),\"\")","v":""},98]
[null,null,null,null,null,null,null,null,null,null,"Rémi_99",{"$f":"IFERROR(VLOOKUP(K101,Choixeleves!$M$12:$Z$157,3,FALSE),\"\")","v":""},{"$f":"IFERROR(VLOOKUP(K101,Choixeleves!$M$12:$Z$157,5,FALSE),\"\")","v":""},{"$f":"IFERROR(VLOOKUP(K101,Choixeleves!$M$12:$Z$157,6,FALSE),\"\")","v":""},{"$f":"IFERROR(VLOOKUP(K101,Choixeleves!$M$12:$Z$157,7,FALSE),\"\")","v":""},99,null,"Timothée_99",{"$f":"IFERROR(VLOOKUP(R101,Choixeleves!$M$12:$Z$157,3,FALSE),\"\")","v":""},{"$f":"IFERROR(VLOOKUP(R101,Choixeleves!$M$12:$Z$157,5,FALSE),\"\")","v":""},{"$f":"IFERROR(VLOOKUP(R101,Choixeleves!$M$12:$Z$157,6,FALSE),\"\")","v":""},{"$f":"IFERROR(VLOOKUP(R101,Choixeleves!$M$12:$Z$157,7,FALSE),\"\")","v":""},99,null,"Virginie_99",{"$f":"IFERROR(VLOOKUP(Y101,Choixeleves!$M$12:$Z$157,3,FALSE),\"\")","v":""},{"$f":"IFERROR(VLOOKUP(Y101,Choixeleves!$M$12:$Z$157,5,FALSE),\"\")","v":""},{"$f":"IFERROR(VLOOKUP(Y101,Choixeleves!$M$12:$Z$157,6,FALSE),\"\")","v":""},{"$f":"IFERROR(VLOOKUP(Y101,Choixeleves!$M$12:$Z$157,7,FALSE),\"\")","v":""},99,null,"Quentin_99",{"$f":"IFERROR(VLOOKUP(AF101,Choixeleves!$M$12:$Z$157,3,FALSE),\"\")","v":""},{"$f":"IFERROR(VLOOKUP(AF101,Choixeleves!$M$12:$Z$157,5,FALSE),\"\")","v":""},{"$f":"IFERROR(VLOOKUP(AF101,Choixeleves!$M$12:$Z$157,6,FALSE),\"\")","v":""},{"$f":"IFERROR(VLOOKUP(AF101,Choixeleves!$M$12:$Z$157,7,FALSE),\"\")","v":""},99,null,"Mick_99",{"$f":"IFERROR(VLOOKUP(AM101,Choixeleves!$M$12:$Z$157,3,FALSE),\"\")","v":""},{"$f":"IFERROR(VLOOKUP(AM101,Choixeleves!$M$12:$Z$157,5,FALSE),\"\")","v":""},{"$f":"IFERROR(VLOOKUP(AM101,Choixeleves!$M$12:$Z$157,6,FALSE),\"\")","v":""},{"$f":"IFERROR(VLOOKUP(AM101,Choixeleves!$M$12:$Z$157,7,FALSE),\"\")","v":""},99]
[null,null,null,null,null,null,null,null,null,null,"Rémi_100",{"$f":"IFERROR(VLOOKUP(K102,Choixeleves!$M$12:$Z$157,3,FALSE),\"\")","v":""},{"$f":"IFERROR(VLOOKUP(K102,Choixeleves!$M$12:$Z$157,5,FALSE),\"\")","v":""},{"$f":"IFERROR(VLOOKUP(K102,Choixeleves!$M$12:$Z$157,6,FALSE),\"\")","v":""},{"$f":"IFERROR(VLOOKUP(K102,Choixeleves!$M$12:$Z$157,7,FALSE),\"\")","v":""},100,null,"Timothée_100",{"$f":"IFERROR(VLOOKUP(R102,Choixeleves!$M$12:$Z$157,3,FALSE),\"\")","v":""},{"$f":"IFERROR(VLOOKUP(R102,Choixeleves!$M$12:$Z$157,5,FALSE),\"\")","v":""},{"$f":"IFERROR(VLOOKUP(R102,Choixeleves!$M$12:$Z$157,6,FALSE),\"\")","v":""},{"$f":"IFERROR(VLOOKUP(R102,Choixeleves!$M$12:$Z$157,7,FALSE),\"\")","v":""},100,null,"Virginie_100",{"$f":"IFERROR(VLOOKUP(Y102,Choixeleves!$M$12:$Z$157,3,FALSE),\"\")","v":""},{"$f":"IFERROR(VLOOKUP(Y102,Choixeleves!$M$12:$Z$157,5,FALSE),\"\")","v":""},{"$f":"IFERROR(VLOOKUP(Y102,Choixeleves!$M$12:$Z$157,6,FALSE),\"\")","v":""},{"$f":"IFERROR(VLOOKUP(Y102,Choixeleves!$M$12:$Z$157,7,FALSE),\"\")","v":""},100,null,"Quentin_100",{"$f":"IFERROR(VLOOKUP(AF102,Choixeleves!$M$12:$Z$157,3,FALSE),\"\")","v":""},{"$f":"IFERROR(VLOOKUP(AF102,Choixeleves!$M$12:$Z$157,5,FALSE),\"\")","v":""},{"$f":"IFERROR(VLOOKUP(AF102,Choixeleves!$M$12:$Z$157,6,FALSE),\"\")","v":""},{"$f":"IFERROR(VLOOKUP(AF102,Choixeleves!$M$12:$Z$157,7,FALSE),\"\")","v":""},100,null,"Mick_100",{"$f":"IFERROR(VLOOKUP(AM102,Choixeleves!$M$12:$Z$157,3,FALSE),\"\")","v":""},{"$f":"IFERROR(VLOOKUP(AM102,Choixeleves!$M$12:$Z$157,5,FALSE),\"\")","v":""},{"$f":"IFERROR(VLOOKUP(AM102,Choixeleves!$M$12:$Z$157,6,FALSE),\"\")","v":""},{"$f":"IFERROR(VLOOKUP(AM102,Choixeleves!$M$12:$Z$157,7,FALSE),\"\")","v":""},100]
[null,null,null,null,null,null,null,null,null,null,"Rémi_101",{"$f":"IFERROR(VLOOKUP(K103,Choixeleves!$M$12:$Z$157,3,FALSE),\"\")","v":""},{"$f":"IFERROR(VLOOKUP(K103,Choixeleves!$M$12:$Z$157,5,FALSE),\"\")","v":""},{"$f":"IFERROR(VLOOKUP(K103,Choixeleves!$M$12:$Z$157,6,FALSE),\"\")","v":""},{"$f":"IFERROR(VLOOKUP(K103,Choixeleves!$M$12:$Z$157,7,FALSE),\"\")","v":""},101,null,"Timothée_101",{"$f":"IFERROR(VLOOKUP(R103,Choixeleves!$M$12:$Z$157,3,FALSE),\"\")","v":""},{"$f":"IFERROR(VLOOKUP(R103,Choixeleves!$M$12:$Z$157,5,FALSE),\"\")","v":""},{"$f":"IFERROR(VLOOKUP(R103,Choixeleves!$M$12:$Z$157,6,FALSE),\"\")","v":""},{"$f":"IFERROR(VLOOKUP(R103,Choixeleves!$M$12:$Z$157,7,FALSE),\"\")","v":""},101,null,"Virginie_101",{"$f":"IFERROR(VLOOKUP(Y103,Choixeleves!$M$12:$Z$157,3,FALSE),\"\")","v":""},{"$f":"IFERROR(VLOOKUP(Y103,Choixeleves!$M$12:$Z$157,5,FALSE),\"\")","v":""},{"$f":"IFERROR(VLOOKUP(Y103,Choixeleves!$M$12:$Z$157,6,FALSE),\"\")","v":""},{"$f":"IFERROR(VLOOKUP(Y103,Choixeleves!$M$12:$Z$157,7,FALSE),\"\")","v":""},101,null,"Quentin_101",{"$f":"IFERROR(VLOOKUP(AF103,Choixeleves!$M$12:$Z$157,3,FALSE),\"\")","v":""},{"$f":"IFERROR(VLOOKUP(AF103,Choixeleves!$M$12:$Z$157,5,FALSE),\"\")","v":""},{"$f":"IFERROR(VLOOKUP(AF103,Choixeleves!$M$12:$Z$157,6,FALSE),\"\")","v":""},{"$f":"IFERROR(VLOOKUP(AF103,Choixeleves!$M$12:$Z$157,7,FALSE),\"\")","v":""},101,null,"Mick_101",{"$f":"IFERROR(VLOOKUP(AM103,Choixeleves!$M$12:$Z$157,3,FALSE),\"\")","v":""},{"$f":"IFERROR(VLOOKUP(AM103,Choixeleves!$M$12:$Z$157,5,FALSE),\"\")","v":""},{"$f":"IFERROR(VLOOKUP(AM103,Choixeleves!$M$12:$Z$157,6,FALSE),\"\")","v":""},{"$f":"IFERROR(VLOOKUP(AM103,Choixeleves!$M$12:$Z$157,7,FALSE),\"\")","v":""},101]

{"sheet":"TRANSMISSION IDEALE","index":4,"n_rows":2,"n_cols":1,"rows_kept":2,"cut":false,"hidden":false,"merged":[[1,0,3,0]]}
[]
["Lien"]

{"sheet":"Choixeleves (2)","index":5,"n_rows":4,"n_cols":4,"rows_kept":4,"cut":false,"hidden":false,"merged":[]}
[null,"Classe "]
[null,{"$f":"Classeauto!B2","v":"1TU-GA"}]
[]
[null,"Elèves ->","Abraham","Amel"]

{"sheet":"MONBAREME","index":6,"n_rows":36,"n_cols":11,"rows_kept":36,"cut":false,"hidden":false,"merged":[[6,1,6,2],[0,5,2,10],[0,13,2,16],[3,1,3,2],[4,1,4,2],[5,1,5,2],[18,1,18,2],[7,1,7,2],[8,1,8,2],[9,1,9,2],[10,1,10,2],[11,1,11,2],[12,1,12,2],[13,1,13,2],[14,1,14,2],[15,1,15,2],[16,1,16,2],[17,1,17,2],[30,1,30,2],[19,1,19,2],[20,1,20,2],[21,1,21,2],[22,1,22,2],[23,1,23,2],[24,1,24,2],[25,1,25,2],[26,1,26,2],[27,1,27,2],[28,1,28,2],[29,1,29,2],[31,1,31,2],[32,1,32,2],[33,1,33,2],[34,1,34,2],[35,1,35,2]]}
[null,"Classe "]
[null,"1TU-GA",null,null,"N4"]
[]
[null,"Elèves",null,{"$f":"DEBUT!$B$4","v":0},{"$f":"DEBUT!$C$4","v":1},{"$f":"DEBUT!$D$4","v":2},{"$f":"DEBUT!$E$4","v":3},{"$f":"Tableau46[[#Headers],[C1]]","v":"C1"},{"$f":"Tableau46[[#Headers],[C2]]","v":"C2"},{"$f":"Tableau46[[#Headers],[C3]]","v":"C3"},{"$f":"Tableau46[[#Headers],[C4]]","v":"C4"}]
[{"$f":"IF($B$2=APPEL!$B$1,VLOOKUP(B5,APPEL!$C$3:$D$38,2,FALSE),IF($B$2=APPEL!$E$1,VLOOKUP(B5,APPEL!$F$3:$G$38,2,FALSE),IF($B$2=APPEL!$H$1,VLOOKUP(B5,APPEL!$I$3:$J$38,2,FALSE),IF($B$2=APPEL!$K$1,VLOOKUP(B5,APPEL!$L$3:$M$38,2,FALSE),IF($B$2=APPEL!$N$1,VLOOKUP(B5,APPEL!$O$3:$P$38,2,FALSE),IF($B$2=APPEL!$Q$1,VLOOKUP(B5,APPEL!$R$3:$S$38,2,FALSE),IF($B$2=APPEL!$T$1,VLOOKUP(B5,APPEL!$U$3:$V$38,2,FALSE),IF($B$2=APPEL!$W$1,VLOOKUP(B5,APPEL!$X$3:$Y$38,2,FALSE),IF($B$2=APPEL!$Z$1,VLOOKUP(B5,APPEL!$AA$3:$AB$38,2,FALSE))))))))))","v":"g"},{"$f":"IF($B$2=APPEL!$B$1,APPEL!C3,IF($B$2=APPEL!$E$1,APPEL!F3,IF($B$2=APPEL!$H$1,APPEL!I3,IF($B$2=APPEL!$K$1,APPEL!L3,IF($B$2=APPEL!$N$1,APPEL!O3,IF($B$2=APPEL!$Q$1,APPEL!R3,IF($B$2=APPEL!$T$1,APPEL!U3,IF($B$2=APPEL!$W$1,APPEL!X3,IF($B$2=APPEL!$Z$1,APPEL!AA3)))))))))","v":"Abraham"},null,"il a fait ça",{"$f":"IFERROR(VLOOKUP(D5,DEBUT!$B$6:$E$100,2,FALSE),\"\")","v":""},{"$f":"IFERROR(VLOOKUP(D5,DEBUT!$B$6:$E$100,3,FALSE),\"\")","v":""},{"$f":"IFERROR(VLOOKUP(D5,DEBUT!$B$6:$E$100,4,FALSE),\"\")","v":""},"Très satisfaisant",{"$f":"IFERROR(VLOOKUP(H5,DEBUT!$G$5:$J$100,2,FALSE),\"\")","v":0},{"$f":"IFERROR(VLOOKUP(H5,DEBUT!$G$5:$J$100,3,FALSE),\"\")","v":0},{"$f":"IFERROR(VLOOKUP(H5,DEBUT!$G$5:$J$100,4,FALSE),\"\")","v":0}]
[{"$f":"IF($B$2=APPEL!$B$1,VLOOKUP(B6,APPEL!$C$3:$D$38,2,FALSE),IF($B$2=APPEL!$E$1,VLOOKUP(B6,APPEL!$F$3:$G$38,2,FALSE),IF($B$2=APPEL!$H$1,VLOOKUP(B6,APPEL!$I$3:$J$38,2,FALSE),IF($B$2=APPEL!$K$1,VLOOKUP(B6,APPEL!$L$3:$M$38,2,FALSE),IF($B$2=APPEL!$N$1,VLOOKUP(B6,APPEL!$O$3:$P$38,2,FALSE),IF($B$2=APPEL!$Q$1,VLOOKUP(B6,APPEL!$R$3:$S$38,2,FALSE),IF($B$2=APPEL!$T$1,VLOOKUP(B6,APPEL!$U$3:$V$38,2,FALSE),IF($B$2=APPEL!$W$1,VLOOKUP(B6,APPEL!$X$3:$Y$38,2,FALSE),IF($B$2=APPEL!$Z$1,VLOOKUP(B6,APPEL!$AA$3:$AB$38,2,FALSE))))))))))","v":"f"},{"$f":"IF($B$2=APPEL!$B$1,APPEL!C4,IF($B$2=APPEL!$E$1,APPEL!F4,IF($B$2=APPEL!$H$1,APPEL!I4,IF($B$2=APPEL!$K$1,APPEL!L4,IF($B$2=APPEL!$N$1,APPEL!O4,IF($B$2=APPEL!$Q$1,APPEL!R4,IF($B$2=APPEL!$T$1,APPEL!U4,IF($B$2=APPEL!$W$1,APPEL!X4,IF($B$2=APPEL!$Z$1,APPEL!AA4)))))))))","v":"Aimane"},null,"7\"",{"$f":"IFERROR(VLOOKUP(D6,DEBUT!$B$6:$E$100,2,FALSE),\"\")","v":""},{"$f":"IFERROR(VLOOKUP(D6,DEBUT!$B$6:$E$100,3,FALSE),\"\")","v":""},{"$f":"IFERROR(VLOOKUP(D6,DEBUT!$B$6:$E$100,4,FALSE),\"\")","v":""},"Insuffisant",{"$f":"IFERROR(VLOOKUP(H6,DEBUT!$G$5:$J$100,2,FALSE),\"\")","v":0},{"$f":"IFERROR(VLOOKUP(H6,DEBUT!$G$5:$J$100,3,FALSE),\"\")","v":0},{"$f":"IFERROR(VLOOKUP(H6,DEBUT!$G$5:$J$100,4,FALSE),\"\")","v":0}]
[{"$f":"IF($B$2=APPEL!$B$1,VLOOKUP(B7,APPEL!$C$3:$D$38,2,FALSE),IF($B$2=APPEL!$E$1,VLOOKUP(B7,APPEL!$F$3:$G$38,2,FALSE),IF($B$2=APPEL!$H$1,VLOOKUP(B7,APPEL!$I$3:$J$38,2,FALSE),IF($B$2=APPEL!$K$1,VLOOKUP(B7,APPEL!$L$3:$M$38,2,FALSE),IF($B$2=APPEL!$N$1,VLOOKUP(B7,APPEL!$O$3:$P$38,2,FALSE),IF($B$2=APPEL!$Q$1,VLOOKUP(B7,APPEL!$R$3:$S$38,2,FALSE),IF($B$2=APPEL!$T$1,VLOOKUP(B7,APPEL!$U$3:$V$38,2,FALSE),IF($B$2=APPEL!$W$1,VLOOKUP(B7,APPEL!$X$3:$Y$38,2,FALSE),IF($B$2=APPEL!$Z$1,VLOOKUP(B7,APPEL!$AA$3:$AB$38,2,FALSE))))))))))","v":"f"},{"$f":"IF($B$2=APPEL!$B$1,APPEL!C5,IF($B$2=APPEL!$E$1,APPEL!F5,IF($B$2=APPEL!$H$1,APPEL!I5,IF($B$2=APPEL!$K$1,APPEL!L5,IF($B$2=APPEL!$N$1,APPEL!O5,IF($B$2=APPEL!$Q$1,APPEL!R5,IF($B$2=APPEL!$T$1,APPEL!U5,IF($B$2=APPEL!$W$1,APPEL!X5,IF($B$2=APPEL!$Z$1,APPEL!AA5)))))))))","v":"Amel"},null,null,{"$f":"IFERROR(VLOOKUP(D7,DEBUT!$B$6:$E$100,2,FALSE),\"\")","v":1},{"$f":"IFERROR(VLOOKUP(D7,DEBUT!$B$6:$E$100,3,FALSE),\"\")","v":2},{"$f":"IFERROR(VLOOKUP(D7,DEBUT!$B$6:$E$100,4,FALSE),\"\")","v":3},"Moyen",{"$f":"IFERROR(VLOOKUP(H7,DEBUT!$G$5:$J$100,2,FALSE),\"\")","v":0},{"$f":"IFERROR(VLOOKUP(H7,DEBUT!$G$5:$J$100,3,FALSE),\"\")","v":0},{"$f":"IFERROR(VLOOKUP(H7,DEBUT!$G$5:$J$100,4,FALSE),\"\")","v":0}]
[{"$f":"IF($B$2=APPEL!$B$1,VLOOKUP(B8,APPEL!$C$3:$D$38,2,FALSE),IF($B$2=APPEL!$E$1,VLOOKUP(B8,APPEL!$F$3:$G$38,2,FALSE),IF($B$2=APPEL!$H$1,VLOOKUP(B8,APPEL!$I$3:$J$38,2,FALSE),IF($B$2=APPEL!$K$1,VLOOKUP(B8,APPEL!$L$3:$M$38,2,FALSE),IF($B$2=APPEL!$N$1,VLOOKUP(B8,APPEL!$O$3:$P$38,2,FALSE),IF($B$2=APPEL!$Q$1,VLOOKUP(B8,APPEL!$R$3:$S$38,2,FALSE),IF($B$2=APPEL!$T$1,VLOOKUP(B8,APPEL!$U$3:$V$38,2,FALSE),IF($B$2=APPEL!$W$1,VLOOKUP(B8,APPEL!$X$3:$Y$38,2,FALSE),IF($B$2=APPEL!$Z$1,VLOOKUP(B8,APPEL!$AA$3:$AB$38,2,FALSE))))))))))","v":"f"},{"$f":"IF($B$2=APPEL!$B$1,APPEL!C6,IF($B$2=APPEL!$E$1,APPEL!F6,IF($B$2=APPEL!$H$1,APPEL!I6,IF($B$2=APPEL!$K$1,APPEL!L6,IF($B$2=APPEL!$N$1,APPEL!O6,IF($B$2=APPEL!$Q$1,APPEL!R6,IF($B$2=APPEL!$T$1,APPEL!U6,IF($B$2=APPEL!$W$1,APPEL!X6,IF($B$2=APPEL!$Z$1,APPEL!AA6)))))))))","v":"Amira"},null,null,{"$f":"IFERROR(VLOOKUP(D8,DEBUT!$B$6:$E$100,2,FALSE),\"\")","v":1},{"$f":"IFERROR(VLOOKUP(D8,DEBUT!$B$6:$E$100,3,FALSE),\"\")","v":2},{"$f":"IFERROR(VLOOKUP(D8,DEBUT!$B$6:$E$100,4,FALSE),\"\")","v":3},null,{"$f":"IFERROR(VLOOKUP(H8,DEBUT!$G$5:$J$100,2,FALSE),\"\")","v":""},{"$f":"IFERROR(VLOOKUP(H8,DEBUT!$G$5:$J$100,3,FALSE),\"\")","v":""},{"$f":"IFERROR(VLOOKUP(H8,DEBUT!$G$5:$J$100,4,FALSE),\"\")","v":""}]
[{"$f":"IF($B$2=APPEL!$B$1,VLOOKUP(B9,APPEL!$C$3:$D$38,2,FALSE),IF($B$2=APPEL!$E$1,VLOOKUP(B9,APPEL!$F$3:$G$38,2,FALSE),IF($B$2=APPEL!$H$1,VLOOKUP(B9,APPEL!$I$3:$J$38,2,FALSE),IF($B$2=APPEL!$K$1,VLOOKUP(B9,APPEL!$L$3:$M$38,2,FALSE),IF($B$2=APPEL!$N$1,VLOOKUP(B9,APPEL!$O$3:$P$38,2,FALSE),IF($B$2=APPEL!$Q$1,VLOOKUP(B9,APPEL!$R$3:$S$38,2,FALSE),IF($B$2=APPEL!$T$1,VLOOKUP(B9,APPEL!$U$3:$V$38,2,FALSE),IF($B$2=APPEL!$W$1,VLOOKUP(B9,APPEL!$X$3:$Y$38,2,FALSE),IF($B$2=APPEL!$Z$1,VLOOKUP(B9,APPEL!$AA$3:$AB$38,2,FALSE))))))))))","v":"g"},{"$f":"IF($B$2=APPEL!$B$1,APPEL!C7,IF($B$2=APPEL!$E$1,APPEL!F7,IF($B$2=APPEL!$H$1,APPEL!I7,IF($B$2=APPEL!$K$1,APPEL!L7,IF($B$2=APPEL!$N$1,APPEL!O7,IF($B$2=APPEL!$Q$1,APPEL!R7,IF($B$2=APPEL!$T$1,APPEL!U7,IF($B$2=APPEL!$W$1,APPEL!X7,IF($B$2=APPEL!$Z$1,APPEL!AA7)))))))))","v":"Anis"},null,null,{"$f":"IFERROR(VLOOKUP(D9,DEBUT!$B$6:$E$100,2,FALSE),\"\")","v":1},{"$f":"IFERROR(VLOOKUP(D9,DEBUT!$B$6:$E$100,3,FALSE),\"\")","v":2},{"$f":"IFERROR(VLOOKUP(D9,DEBUT!$B$6:$E$100,4,FALSE),\"\")","v":3},null,{"$f":"IFERROR(VLOOKUP(H9,DEBUT!$G$5:$J$100,2,FALSE),\"\")","v":""},{"$f":"IFERROR(VLOOKUP(H9,DEBUT!$G$5:$J$100,3,FALSE),\"\")","v":""},{"$f":"IFERROR(VLOOKUP(H9,DEBUT!$G$5:$J$100,4,FALSE),\"\")","v":""}]
[{"$f":"IF($B$2=APPEL!$B$1,VLOOKUP(B10,APPEL!$C$3:$D$38,2,FALSE),IF($B$2=APPEL!$E$1,VLOOKUP(B10,APPEL!$F$3:$G$38,2,FALSE),IF($B$2=APPEL!$H$1,VLOOKUP(B10,APPEL!$I$3:$J$38,2,FALSE),IF($B$2=APPEL!$K$1,VLOOKUP(B10,APPEL!$L$3:$M$38,2,FALSE),IF($B$2=APPEL!$N$1,VLOOKUP(B10,APPEL!$O$3:$P$38,2,FALSE),IF($B$2=APPEL!$Q$1,VLOOKUP(B10,APPEL!$R$3:$S$38,2,FALSE),IF($B$2=APPEL!$T$1,VLOOKUP(B10,APPEL!$U$3:$V$38,2,FALSE),IF($B$2=APPEL!$W$1,VLOOKUP(B10,APPEL!$X$3:$Y$38,2,FALSE),IF($B$2=APPEL!$Z$1,VLOOKUP(B10,APPEL!$AA$3:$AB$38,2,FALSE))))))))))","v":"f"},{"$f":"IF($B$2=APPEL!$B$1,APPEL!C8,IF($B$2=APPEL!$E$1,APPEL!F8,IF($B$2=APPEL!$H$1,APPEL!I8,IF($B$2=APPEL!$K$1,APPEL!L8,IF($B$2=APPEL!$N$1,APPEL!O8,IF($B$2=APPEL!$Q$1,APPEL!R8,IF($B$2=APPEL!$T$1,APPEL!U8,IF($B$2=APPEL!$W$1,APPEL!X8,IF($B$2=APPEL!$Z$1,APPEL!AA8)))))))))","v":"Beyza"},null,null,{"$f":"IFERROR(VLOOKUP(D10,DEBUT!$B$6:$E$100,2,FALSE),\"\")","v":1},{"$f":"IFERROR(VLOOKUP(D10,DEBUT!$B$6:$E$100,3,FALSE),\"\")","v":2},{"$f":"IFERROR(VLOOKUP(D10,DEBUT!$B$6:$E$100,4,FALSE),\"\")","v":3},null,{"$f":"IFERROR(VLOOKUP(H10,DEBUT!$G$5:$J$100,2,FALSE),\"\")","v":""},{"$f":"IFERROR(VLOOKUP(H10,DEBUT!$G$5:$J$100,3,FALSE),\"\")","v":""},{"$f":"IFERROR(VLOOKUP(H10,DEBUT!$G$5:$J$100,4,FALSE),\"\")","v":""}]
[{"$f":"IF($B$2=APPEL!$B$1,VLOOKUP(B11,APPEL!$C$3:$D$38,2,FALSE),IF($B$2=APPEL!$E$1,VLOOKUP(B11,APPEL!$F$3:$G$38,2,FALSE),IF($B$2=APPEL!$H$1,VLOOKUP(B11,APPEL!$I$3:$J$38,2,FALSE),IF($B$2=APPEL!$K$1,VLOOKUP(B11,APPEL!$L$3:$M$38,2,FALSE),IF($B$2=APPEL!$N$1,VLOOKUP(B11,APPEL!$O$3:$P$38,2,FALSE),IF($B$2=APPEL!$Q$1,VLOOKUP(B11,APPEL!$R$3:$S$38,2,FALSE),IF($B$2=APPEL!$T$1,VLOOKUP(B11,APPEL!$U$3:$V$38,2,FALSE),IF($B$2=APPEL!$W$1,VLOOKUP(B11,APPEL!$X$3:$Y$38,2,FALSE),IF($B$2=APPEL!$Z$1,VLOOKUP(B11,APPEL!$AA$3:$AB$38,2,FALSE))))))))))","v":"g"},{"$f":"IF($B$2=APPEL!$B$1,APPEL!C9,IF($B$2=APPEL!$E$1,APPEL!F9,IF($B$2=APPEL!$H$1,APPEL!I9,IF($B$2=APPEL!$K$1,APPEL!L9,IF($B$2=APPEL!$N$1,APPEL!O9,IF($B$2=APPEL!$Q$1,APPEL!R9,IF($B$2=APPEL!$T$1,APPEL!U9,IF($B$2=APPEL!$W$1,APPEL!X9,IF($B$2=APPEL!$Z$1,APPEL!AA9)))))))))","v":"Clarky"},null,null,{"$f":"IFERROR(VLOOKUP(D11,DEBUT!$B$6:$E$100,2,FALSE),\"\")","v":1},{"$f":"IFERROR(VLOOKUP(D11,DEBUT!$B$6:$E$100,3,FALSE),\"\")","v":2},{"$f":"IFERROR(VLOOKUP(D11,DEBUT!$B$6:$E$100,4,FALSE),\"\")","v":3},null,{"$f":"IFERROR(VLOOKUP(H11,DEBUT!$G$5:$J$100,2,FALSE),\"\")","v":""},{"$f":"IFERROR(VLOOKUP(H11,DEBUT!$G$5:$J$100,3,FALSE),\"\")","v":""},{"$f":"IFERROR(VLOOKUP(H11,DEBUT!$G$5:$J$100,4,FALSE),\"\")","v":""}]
[{"$f":"IF($B$2=APPEL!$B$1,VLOOKUP(B12,APPEL!$C$3:$D$38,2,FALSE),IF($B$2=APPEL!$E$1,VLOOKUP(B12,APPEL!$F$3:$G$38,2,FALSE),IF($B$2=APPEL!$H$1,VLOOKUP(B12,APPEL!$I$3:$J$38,2,FALSE),IF($B$2=APPEL!$K$1,VLOOKUP(B12,APPEL!$L$3:$M$38,2,FALSE),IF($B$2=APPEL!$N$1,VLOOKUP(B12,APPEL!$O$3:$P$38,2,FALSE),IF($B$2=APPEL!$Q$1,VLOOKUP(B12,APPEL!$R$3:$S$38,2,FALSE),IF($B$2=APPEL!$T$1,VLOOKUP(B12,APPEL!$U$3:$V$38,2,FALSE),IF($B$2=APPEL!$W$1,VLOOKUP(B12,APPEL!$X$3:$Y$38,2,FALSE),IF($B$2=APPEL!$Z$1,VLOOKUP(B12,APPEL!$AA$3:$AB$38,2,FALSE))))))))))","v":"g"},{"$f":"IF($B$2=APPEL!$B$1,APPEL!C10,IF($B$2=APPEL!$E$1,APPEL!F10,IF($B$2=APPEL!$H$1,APPEL!I10,IF($B$2=APPEL!$K$1,APPEL!L10,IF($B$2=APPEL!$N$1,APPEL!O10,IF($B$2=APPEL!$Q$1,APPEL!R10,IF($B$2=APPEL!$T$1,APPEL!U10,IF($B$2=APPEL!$W$1,APPEL!X10,IF($B$2=APPEL!$Z$1,APPEL!AA10)))))))))","v":"Djamel"},null,null,{"$f":"IFERROR(VLOOKUP(D12,DEBUT!$B$6:$E$100,2,FALSE),\"\")","v":1},{"$f":"IFERROR(VLOOKUP(D12,DEBUT!$B$6:$E$100,3,FALSE),\"\")","v":2},{"$f":"IFERROR(VLOOKUP(D12,DEBUT!$B$6:$E$100,4,FALSE),\"\")","v":3},null,{"$f":"IFERROR(VLOOKUP(H12,DEBUT!$G$5:$J$100,2,FALSE),\"\")","v":""},{"$f":"IFERROR(VLOOKUP(H12,DEBUT!$G$5:$J$100,3,FALSE),\"\")","v":""},{"$f":"IFERROR(VLOOKUP(H12,DEBUT!$G$5:$J$100,4,FALSE),\"\")","v":""}]
[{"$f":"IF($B$2=APPEL!$B$1,VLOOKUP(B13,APPEL!$C$3:$D$38,2,FALSE),IF($B$2=APPEL!$E$1,VLOOKUP(B13,APPEL!$F$3:$G$38,2,FALSE),IF($B$2=APPEL!$H$1,VLOOKUP(B13,APPEL!$I$3:$J$38,2,FALSE),IF($B$2=APPEL!$K$1,VLOOKUP(B13,APPEL!$L$3:$M$38,2,FALSE),IF($B$2=APPEL!$N$1,VLOOKUP(B13,APPEL!$O$3:$P$38,2,FALSE),IF($B$2=APPEL!$Q$1,VLOOKUP(B13,APPEL!$R$3:$S$38,2,FALSE),IF($B$2=APPEL!$T$1,VLOOKUP(B13,APPEL!$U$3:$V$38,2,FALSE),IF($B$2=APPEL!$W$1,VLOOKUP(B13,APPEL!$X$3:$Y$38,2,FALSE),IF($B$2=APPEL!$Z$1,VLOOKUP(B13,APPEL!$AA$3:$AB$38,2,FALSE))))))))))","v":"f"},{"$f":"IF($B$2=APPEL!$B$1,APPEL!C11,IF($B$2=APPEL!$E$1,APPEL!F11,IF($B$2=APPEL!$H$1,APPEL!I11,IF($B$2=APPEL!$K$1,APPEL!L11,IF($B$2=APPEL!$N$1,APPEL!O11,IF($B$2=APPEL!$Q$1,APPEL!R11,IF($B$2=APPEL!$T$1,APPEL!U11,IF($B$2=APPEL!$W$1,APPEL!X11,IF($B$2=APPEL!$Z$1,APPEL!AA11)))))))))","v":"Dounia"},null,null,{"$f":"IFERROR(VLOOKUP(D13,DEBUT!$B$6:$E$100,2,FALSE),\"\")","v":1},{"$f":"IFERROR(VLOOKUP(D13,DEBUT!$B$6:$E$100,3,FALSE),\"\")","v":2},{"$f":"IFERROR(VLOOKUP(D13,DEBUT!$B$6:$E$100,4,FALSE),\"\")","v":3},null,{"$f":"IFERROR(VLOOKUP(H13,DEBUT!$G$5:$J$100,2,FALSE),\"\")","v":""},{"$f":"IFERROR(VLOOKUP(H13,DEBUT!$G$5:$J$100,3,FALSE),\"\")","v":""},{"$f":"IFERROR(VLOOKUP(H13,DEBUT!$G$5:$J$100,4,FALSE),\"\")","v":""}]
[{"$f":"IF($B$2=APPEL!$B$1,VLOOKUP(B14,APPEL!$C$3:$D$38,2,FALSE),IF($B$2=APPEL!$E$1,VLOOKUP(B14,APPEL!$F$3:$G$38,2,FALSE),IF($B$2=APPEL!$H$1,VLOOKUP(B14,APPEL!$I$3:$J$38,2,FALSE),IF($B$2=APPEL!$K$1,VLOOKUP(B14,APPEL!$L$3:$M$38,2,FALSE),IF($B$2=APPEL!$N$1,VLOOKUP(B14,APPEL!$O$3:$P$38,2,FALSE),IF($B$2=APPEL!$Q$1,VLOOKUP(B14,APPEL!$R$3:$S$38,2,FALSE),IF($B$2=APPEL!$T$1,VLOOKUP(B14,APPEL!$U$3:$V$38,2,FALSE),IF($B$2=APPEL!$W$1,VLOOKUP(B14,APPEL!$X$3:$Y$38,2,FALSE),IF($B$2=APPEL!$Z$1,VLOOKUP(B14,APPEL!$AA$3:$AB$38,2,FALSE))))))))))","v":"g"},{"$f":"IF($B$2=APPEL!$B$1,APPEL!C12,IF($B$2=APPEL!$E$1,APPEL!F12,IF($B$2=APPEL!$H$1,APPEL!I12,IF($B$2=APPEL!$K$1,APPEL!L12,IF($B$2=APPEL!$N$1,APPEL!O12,IF($B$2=APPEL!$Q$1,APPEL!R12,IF($B$2=APPEL!$T$1,APPEL!U12,IF($B$2=APPEL!$W$1,APPEL!X12,IF($B$2=APPEL!$Z$1,APPEL!AA12)))))))))","v":"Eyat"},null,null,{"$f":"IFERROR(VLOOKUP(D14,DEBUT!$B$6:$E$100,2,FALSE),\"\")","v":1},{"$f":"IFERROR(VLOOKUP(D14,DEBUT!$B$6:$E$100,3,FALSE),\"\")","v":2},{"$f":"IFERROR(VLOOKUP(D14,DEBUT!$B$6:$E$100,4,FALSE),\"\")","v":3},null,{"$f":"IFERROR(VLOOKUP(H14,DEBUT!$G$5:$J$100,2,FALSE),\"\")","v":""},{"$f":"IFERROR(VLOOKUP(H14,DEBUT!$G$5:$J$100,3,FALSE),\"\")","v":""},{"$f":"IFERROR(VLOOKUP(H14,DEBUT!$G$5:$J$100,4,FALSE),\"\")","v":""}]
[{"$f":"IF($B$2=APPEL!$B$1,VLOOKUP(B15,APPEL!$C$3:$D$38,2,FALSE),IF($B$2=APPEL!$E$1,VLOOKUP(B15,APPEL!$F$3:$G$38,2,FALSE),IF($B$2=APPEL!$H$1,VLOOKUP(B15,APPEL!$I$3:$J$38,2,FALSE),IF($B$2=APPEL!$K$1,VLOOKUP(B15,APPEL!$L$3:$M$38,2,FALSE),IF($B$2=APPEL!$N$1,VLOOKUP(B15,APPEL!$O$3:$P$38,2,FALSE),IF($B$2=APPEL!$Q$1,VLOOKUP(B15,APPEL!$R$3:$S$38,2,FALSE),IF($B$2=APPEL!$T$1,VLOOKUP(B15,APPEL!$U$3:$V$38,2,FALSE),IF($B$2=APPEL!$W$1,VLOOKUP(B15,APPEL!$X$3:$Y$38,2,FALSE),IF($B$2=APPEL!$Z$1,VLOOKUP(B15,APPEL!$AA$3:$AB$38,2,FALSE))))))))))","v":"f"},{"$f":"IF($B$2=APPEL!$B$1,APPEL!C13,IF($B$2=APPEL!$E$1,APPEL!F13,IF($B$2=APPEL!$H$1,APPEL!I13,IF($B$2=APPEL!$K$1,APPEL!L13,IF($B$2=APPEL!$N$1,APPEL!O13,IF($B$2=APPEL!$Q$1,APPEL!R13,IF($B$2=APPEL!$T$1,APPEL!U13,IF($B$2=APPEL!$W$1,APPEL!X13,IF($B$2=APPEL!$Z$1,APPEL!AA13)))))))))","v":"Fatima-Zohra"},null,null,{"$f":"IFERROR(VLOOKUP(D15,DEBUT!$B$6:$E$100,2,FALSE),\"\")","v":1},{"$f":"IFERROR(VLOOKUP(D15,DEBUT!$B$6:$E$100,3,FALSE),\"\")","v":2},{"$f":"IFERROR(VLOOKUP(D15,DEBUT!$B$6:$E$100,4,FALSE),\"\")","v":3},null,{"$f":"IFERROR(VLOOKUP(H15,DEBUT!$G$5:$J$100,2,FALSE),\"\")","v":""},{"$f":"IFERROR(VLOOKUP(H15,DEBUT!$G$5:$J$100,3,FALSE),\"\")","v":""},{"$f":"IFERROR(VLOOKUP(H15,DEBUT!$G$5:$J$100,4,FALSE),\"\")","v":""}]
[{"$f":"IF($B$2=APPEL!$B$1,VLOOKUP(B16,APPEL!$C$3:$D$38,2,FALSE),IF($B$2=APPEL!$E$1,VLOOKUP(B16,APPEL!$F$3:$G$38,2,FALSE),IF($B$2=APPEL!$H$1,VLOOKUP(B16,APPEL!$I$3:$J$38,2,FALSE),IF($B$2=APPEL!$K$1,VLOOKUP(B16,APPEL!$L$3:$M$38,2,FALSE),IF($B$2=APPEL!$N$1,VLOOKUP(B16,APPEL!$O$3:$P$38,2,FALSE),IF($B$2=APPEL!$Q$1,VLOOKUP(B16,APPEL!$R$3:$S$38,2,FALSE),IF($B$2=APPEL!$T$1,VLOOKUP(B16,APPEL!$U$3:$V$38,2,FALSE),IF($B$2=APPEL!$W$1,VLOOKUP(B16,APPEL!$X$3:$Y$38,2,FALSE),IF($B$2=APPEL!$Z$1,VLOOKUP(B16,APPEL!$AA$3:$AB$38,2,FALSE))))))))))","v":"f"},{"$f":"IF($B$2=APPEL!$B$1,APPEL!C14,IF($B$2=APPEL!$E$1,APPEL!F14,IF($B$2=APPEL!$H$1,APPEL!I14,IF($B$2=APPEL!$K$1,APPEL!L14,IF($B$2=APPEL!$N$1,APPEL!O14,IF($B$2=APPEL!$Q$1,APPEL!R14,IF($B$2=APPEL!$T$1,APPEL!U14,IF($B$2=APPEL!$W$1,APPEL!X14,IF($B$2=APPEL!$Z$1,APPEL!AA14)))))))))","v":"Hana"},null,null,{"$f":"IFERROR(VLOOKUP(D16,DEBUT!$B$6:$E$100,2,FALSE),\"\")","v":1},{"$f":"IFERROR(VLOOKUP(D16,DEBUT!$B$6:$E$100,3,FALSE),\"\")","v":2},{"$f":"IFERROR(VLOOKUP(D16,DEBUT!$B$6:$E$100,4,FALSE),\"\")","v":3},null,{"$f":"IFERROR(VLOOKUP(H16,DEBUT!$G$5:$J$100,2,FALSE),\"\")","v":""},{"$f":"IFERROR(VLOOKUP(H16,DEBUT!$G$5:$J$100,3,FALSE),\"\")","v":""},{"$f":"IFERROR(VLOOKUP(H16,DEBUT!$G$5:$J$100,4,FALSE),\"\")","v":""}]
[{"$f":"IF($B$2=APPEL!$B$1,VLOOKUP(B17,APPEL!$C$3:$D$38,2,FALSE),IF($B$2=APPEL!$E$1,VLOOKUP(B17,APPEL!$F$3:$G$38,2,FALSE),IF($B$2=APPEL!$H$1,VLOOKUP(B17,APPEL!$I$3:$J$38,2,FALSE),IF($B$2=APPEL!$K$1,VLOOKUP(B17,APPEL!$L$3:$M$38,2,FALSE),IF($B$2=APPEL!$N$1,VLOOKUP(B17,APPEL!$O$3:$P$38,2,FALSE),IF($B$2=APPEL!$Q$1,VLOOKUP(B17,APPEL!$R$3:$S$38,2,FALSE),IF($B$2=APPEL!$T$1,VLOOKUP(B17,APPEL!$U$3:$V$38,2,FALSE),IF($B$2=APPEL!$W$1,VLOOKUP(B17,APPEL!$X$3:$Y$38,2,FALSE),IF($B$2=APPEL!$Z$1,VLOOKUP(B17,APPEL!$AA$3:$AB$38,2,FALSE))))))))))","v":"f"},{"$f":"IF($B$2=APPEL!$B$1,APPEL!C15,IF($B$2=APPEL!$E$1,APPEL!F15,IF($B$2=APPEL!$H$1,APPEL!I15,IF($B$2=APPEL!$K$1,APPEL!L15,IF($B$2=APPEL!$N$1,APPEL!O15,IF($B$2=APPEL!$Q$1,APPEL!R15,IF($B$2=APPEL!$T$1,APPEL!U15,IF($B$2=APPEL!$W$1,APPEL!X15,IF($B$2=APPEL!$Z$1,APPEL!AA15)))))))))","v":"Ikram"},null,null,{"$f":"IFERROR(VLOOKUP(D17,DEBUT!$B$6:$E$100,2,FALSE),\"\")","v":1},{"$f":"IFERROR(VLOOKUP(D17,DEBUT!$B$6:$E$100,3,FALSE),\"\")","v":2},{"$f":"IFERROR(VLOOKUP(D17,DEBUT!$B$6:$E$100,4,FALSE),\"\")","v":3},null,{"$f":"IFERROR(VLOOKUP(H17,DEBUT!$G$5:$J$100,2,FALSE),\"\")","v":""},{"$f":"IFERROR(VLOOKUP(H17,DEBUT!$G$5:$J$100,3,FALSE),\"\")","v":""},{"$f":"IFERROR(VLOOKUP(H17,DEBUT!$G$5:$J$100,4,FALSE),\"\")","v":""}]
[{"$f":"IF($B$2=APPEL!$B$1,VLOOKUP(B18,APPEL!$C$3:$D$38,2,FALSE),IF($B$2=APPEL!$E$1,VLOOKUP(B18,APPEL!$F$3:$G$38,2,FALSE),IF($B$2=APPEL!$H$1,VLOOKUP(B18,APPEL!$I$3:$J$38,2,FALSE),IF($B$2=APPEL!$K$1,VLOOKUP(B18,APPEL!$L$3:$M$38,2,FALSE),IF($B$2=APPEL!$N$1,VLOOKUP(B18,APPEL!$O$3:$P$38,2,FALSE),IF($B$2=APPEL!$Q$1,VLOOKUP(B18,APPEL!$R$3:$S$38,2,FALSE),IF($B$2=APPEL!$T$1,VLOOKUP(B18,APPEL!$U$3:$V$38,2,FALSE),IF($B$2=APPEL!$W$1,VLOOKUP(B18,APPEL!$X$3:$Y$38,2,FALSE),IF($B$2=APPEL!$Z$1,VLOOKUP(B18,APPEL!$AA$3:$AB$38,2,FALSE))))))))))","v":"g"},{"$f":"IF($B$2=APPEL!$B$1,APPEL!C16,IF($B$2=APPEL!$E$1,APPEL!F16,IF($B$2=APPEL!$H$1,APPEL!I16,IF($B$2=APPEL!$K$1,APPEL!L16,IF($B$2=APPEL!$N$1,APPEL!O16,IF($B$2=APPEL!$Q$1,APPEL!R16,IF($B$2=APPEL!$T$1,APPEL!U16,IF($B$2=APPEL!$W$1,APPEL!X16,IF($B$2=APPEL!$Z$1,APPEL!AA16)))))))))","v":"Jairzhino"},null,null,{"$f":"IFERROR(VLOOKUP(D18,DEBUT!$B$6:$E$100,2,FALSE),\"\")","v":1},{"$f":"IFERROR(VLOOKUP(D18,DEBUT!$B$6:$E$100,3,FALSE),\"\")","v":2},{"$f":"IFERROR(VLOOKUP(D18,DEBUT!$B$6:$E$100,4,FALSE),\"\")","v":3},null,{"$f":"IFERROR(VLOOKUP(H18,DEBUT!$G$5:$J$100,2,FALSE),\"\")","v":""},{"$f":"IFERROR(VLOOKUP(H18,DEBUT!$G$5:$J$100,3,FALSE),\"\")","v":""},{"$f":"IFERROR(VLOOKUP(H18,DEBUT!$G$5:$J$100,4,FALSE),\"\")","v":""}]
[{"$f":"IF($B$2=APPEL!$B$1,VLOOKUP(B19,APPEL!$C$3:$D$38,2,FALSE),IF($B$2=APPEL!$E$1,VLOOKUP(B19,APPEL!$F$3:$G$38,2,FALSE),IF($B$2=APPEL!$H$1,VLOOKUP(B19,APPEL!$I$3:$J$38,2,FALSE),IF($B$2=APPEL!$K$1,VLOOKUP(B19,APPEL!$L$3:$M$38,2,FALSE),IF($B$2=APPEL!$N$1,VLOOKUP(B19,APPEL!$O$3:$P$38,2,FALSE),IF($B$2=APPEL!$Q$1,VLOOKUP(B19,APPEL!$R$3:$S$38,2,FALSE),IF($B$2=APPEL!$T$1,VLOOKUP(B19,APPEL!$U$3:$V$38,2,FALSE),IF($B$2=APPEL!$W$1,VLOOKUP(B19,APPEL!$X$3:$Y$38,2,FALSE),IF($B$2=APPEL!$Z$1,VLOOKUP(B19,APPEL!$AA$3:$AB$38,2,FALSE))))))))))","v":"f"},{"$f":"IF($B$2=APPEL!$B$1,APPEL!C17,IF($B$2=APPEL!$E$1,APPEL!F17,IF($B$2=APPEL!$H$1,APPEL!I17,IF($B$2=APPEL!$K$1,APPEL!L17,IF($B$2=APPEL!$N$1,APPEL!O17,IF($B$2=APPEL!$Q$1,APPEL!R17,IF($B$2=APPEL!$T$1,APPEL!U17,IF($B$2=APPEL!$W$1,APPEL!X17,IF($B$2=APPEL!$Z$1,APPEL!AA17)))))))))","v":"Mergim"},null,null,{"$f":"IFERROR(VLOOKUP(D19,DEBUT!$B$6:$E$100,2,FALSE),\"\")","v":1},{"$f":"IFERROR(VLOOKUP(D19,DEBUT!$B$6:$E$100,3,FALSE),\"\")","v":2},{"$f":"IFERROR(VLOOKUP(D19,DEBUT!$B$6:$E$100,4,FALSE),\"\")","v":3},null,{"$f":"IFERROR(VLOOKUP(H19,DEBUT!$G$5:$J$100,2,FALSE),\"\")","v":""},{"$f":"IFERROR(VLOOKUP(H19,DEBUT!$G$5:$J$100,3,FALSE),\"\")","v":""},{"$f":"IFERROR(VLOOKUP(H19,DEBUT!$G$5:$J$100,4,FALSE),\"\")","v":""}]
[{"$f":"IF($B$2=APPEL!$B$1,VLOOKUP(B20,APPEL!$C$3:$D$38,2,FALSE),IF($B$2=APPEL!$E$1,VLOOKUP(B20,APPEL!$F$3:$G$38,2,FALSE),IF($B$2=APPEL!$H$1,VLOOKUP(B20,APPEL!$I$3:$J$38,2,FALSE),IF($B$2=APPEL!$K$1,VLOOKUP(B20,APPEL!$L$3:$M$38,2,FALSE),IF($B$2=APPEL!$N$1,VLOOKUP(B20,APPEL!$O$3:$P$38,2,FALSE),IF($B$2=APPEL!$Q$1,VLOOKUP(B20,APPEL!$R$3:$S$38,2,FALSE),IF($B$2=APPEL!$T$1,VLOOKUP(B20,APPEL!$U$3:$V$38,2,FALSE),IF($B$2=APPEL!$W$1,VLOOKUP(B20,APPEL!$X$3:$Y$38,2,FALSE),IF($B$2=APPEL!$Z$1,VLOOKUP(B20,APPEL!$AA$3:$AB$38,2,FALSE))))))))))","v":"f"},{"$f":"IF($B$2=APPEL!$B$1,APPEL!C18,IF($B$2=APPEL!$E$1,APPEL!F18,IF($B$2=APPEL!$H$1,APPEL!I18,IF($B$2=APPEL!$K$1,APPEL!L18,IF($B$2=APPEL!$N$1,APPEL!O18,IF($B$2=APPEL!$Q$1,APPEL!R18,IF($B$2=APPEL!$T$1,APPEL!U18,IF($B$2=APPEL!$W$1,APPEL!X18,IF($B$2=APPEL!$Z$1,APPEL!AA18)))))))))","v":"Myriam"},null,null,{"$f":"IFERROR(VLOOKUP(D20,DEBUT!$B$6:$E$100,2,FALSE),\"\")","v":1},{"$f":"IFERROR(VLOOKUP(D20,DEBUT!$B$6:$E$100,3,FALSE),\"\")","v":2},{"$f":"IFERROR(VLOOKUP(D20,DEBUT!$B$6:$E$100,4,FALSE),\"\")","v":3},null,{"$f":"IFERROR(VLOOKUP(H20,DEBUT!$G$5:$J$100,2,FALSE),\"\")","v":""},{"$f":"IFERROR(VLOOKUP(H20,DEBUT!$G$5:$J$100,3,FALSE),\"\")","v":""},{"$f":"IFERROR(VLOOKUP(H20,DEBUT!$G$5:$J$100,4,FALSE),\"\")","v":""}]
[{"$f":"IF($B$2=APPEL!$B$1,VLOOKUP(B21,APPEL!$C$3:$D$38,2,FALSE),IF($B$2=APPEL!$E$1,VLOOKUP(B21,APPEL!$F$3:$G$38,2,FALSE),IF($B$2=APPEL!$H$1,VLOOKUP(B21,APPEL!$I$3:$J$38,2,FALSE),IF($B$2=APPEL!$K$1,VLOOKUP(B21,APPEL!$L$3:$M$38,2,FALSE),IF($B$2=APPEL!$N$1,VLOOKUP(B21,APPEL!$O$3:$P$38,2,FALSE),IF($B$2=APPEL!$Q$1,VLOOKUP(B21,APPEL!$R$3:$S$38,2,FALSE),IF($B$2=APPEL!$T$1,VLOOKUP(B21,APPEL!$U$3:$V$38,2,FALSE),IF($B$2=APPEL!$W$1,VLOOKUP(B21,APPEL!$X$3:$Y$38,2,FALSE),IF($B$2=APPEL!$Z$1,VLOOKUP(B21,APPEL!$AA$3:$AB$38,2,FALSE))))))))))","v":"f"},{"$f":"IF($B$2=APPEL!$B$1,APPEL!C19,IF($B$2=APPEL!$E$1,APPEL!F19,IF($B$2=APPEL!$H$1,APPEL!I19,IF($B$2=APPEL!$K$1,APPEL!L19,IF($B$2=APPEL!$N$1,APPEL!O19,IF($B$2=APPEL!$Q$1,APPEL!R19,IF($B$2=APPEL!$T$1,APPEL!U19,IF($B$2=APPEL!$W$1,APPEL!X19,IF($B$2=APPEL!$Z$1,APPEL!AA19)))))))))","v":"Serone"},null,null,{"$f":"IFERROR(VLOOKUP(D21,DEBUT!$B$6:$E$100,2,FALSE),\"\")","v":1},{"$f":"IFERROR(VLOOKUP(D21,DEBUT!$B$6:$E$100,3,FALSE),\"\")","v":2},{"$f":"IFERROR(VLOOKUP(D21,DEBUT!$B$6:$E$100,4,FALSE),\"\")","v":3},null,{"$f":"IFERROR(VLOOKUP(H21,DEBUT!$G$5:$J$100,2,FALSE),\"\")","v":""},{"$f":"IFERROR(VLOOKUP(H21,DEBUT!$G$5:$J$100,3,FALSE),\"\")","v":""},{"$f":"IFERROR(VLOOKUP(H21,DEBUT!$G$5:$J$100,4,FALSE),\"\")","v":""}]
[{"$f":"IF($B$2=APPEL!$B$1,VLOOKUP(B22,APPEL!$C$3:$D$38,2,FALSE),IF($B$2=APPEL!$E$1,VLOOKUP(B22,APPEL!$F$3:$G$38,2,FALSE),IF($B$2=APPEL!$H$1,VLOOKUP(B22,APPEL!$I$3:$J$38,2,FALSE),IF($B$2=APPEL!$K$1,VLOOKUP(B22,APPEL!$L$3:$M$38,2,FALSE),IF($B$2=APPEL!$N$1,VLOOKUP(B22,APPEL!$O$3:$P$38,2,FALSE),IF($B$2=APPEL!$Q$1,VLOOKUP(B22,APPEL!$R$3:$S$38,2,FALSE),IF($B$2=APPEL!$T$1,VLOOKUP(B22,APPEL!$U$3:$V$38,2,FALSE),IF($B$2=APPEL!$W$1,VLOOKUP(B22,APPEL!$X$3:$Y$38,2,FALSE),IF($B$2=APPEL!$Z$1,VLOOKUP(B22,APPEL!$AA$3:$AB$38,2,FALSE))))))))))","v":"f"},{"$f":"IF($B$2=APPEL!$B$1,APPEL!C20,IF($B$2=APPEL!$E$1,APPEL!F20,IF($B$2=APPEL!$H$1,APPEL!I20,IF($B$2=APPEL!$K$1,APPEL!L20,IF($B$2=APPEL!$N$1,APPEL!O20,IF($B$2=APPEL!$Q$1,APPEL!R20,IF($B$2=APPEL!$T$1,APPEL!U20,IF($B$2=APPEL!$W$1,APPEL!X20,IF($B$2=APPEL!$Z$1,APPEL!AA20)))))))))","v":"Suha"},null,null,{"$f":"IFERROR(VLOOKUP(D22,DEBUT!$B$6:$E$100,2,FALSE),\"\")","v":1},{"$f":"IFERROR(VLOOKUP(D22,DEBUT!$B$6:$E$100,3,FALSE),\"\")","v":2},{"$f":"IFERROR(VLOOKUP(D22,DEBUT!$B$6:$E$100,4,FALSE),\"\")","v":3},null,{"$f":"IFERROR(VLOOKUP(H22,DEBUT!$G$5:$J$100,2,FALSE),\"\")","v":""},{"$f":"IFERROR(VLOOKUP(H22,DEBUT!$G$5:$J$100,3,FALSE),\"\")","v":""},{"$f":"IFERROR(VLOOKUP(H22,DEBUT!$G$5:$J$100,4,FALSE),\"\")","v":""}]
[{"$f":"IF($B$2=APPEL!$B$1,VLOOKUP(B23,APPEL!$C$3:$D$38,2,FALSE),IF($B$2=APPEL!$E$1,VLOOKUP(B23,APPEL!$F$3:$G$38,2,FALSE),IF($B$2=APPEL!$H$1,VLOOKUP(B23,APPEL!$I$3:$J$38,2,FALSE),IF($B$2=APPEL!$K$1,VLOOKUP(B23,APPEL!$L$3:$M$38,2,FALSE),IF($B$2=APPEL!$N$1,VLOOKUP(B23,APPEL!$O$3:$P$38,2,FALSE),IF($B$2=APPEL!$Q$1,VLOOKUP(B23,APPEL!$R$3:$S$38,2,FALSE),IF($B$2=APPEL!$T$1,VLOOKUP(B23,APPEL!$U$3:$V$38,2,FALSE),IF($B$2=APPEL!$W$1,VLOOKUP(B23,APPEL!$X$3:$Y$38,2,FALSE),IF($B$2=APPEL!$Z$1,VLOOKUP(B23,APPEL!$AA$3:$AB$38,2,FALSE))))))))))","v":"g"},{"$f":"IF($B$2=APPEL!$B$1,APPEL!C21,IF($B$2=APPEL!$E$1,APPEL!F21,IF($B$2=APPEL!$H$1,APPEL!I21,IF($B$2=APPEL!$K$1,APPEL!L21,IF($B$2=APPEL!$N$1,APPEL!O21,IF($B$2=APPEL!$Q$1,APPEL!R21,IF($B$2=APPEL!$T$1,APPEL!U21,IF($B$2=APPEL!$W$1,APPEL!X21,IF($B$2=APPEL!$Z$1,APPEL!AA21)))))))))","v":"Yassine"},null,null,{"$f":"IFERROR(VLOOKUP(D23,DEBUT!$B$6:$E$100,2,FALSE),\"\")","v":1},{"$f":"IFERROR(VLOOKUP(D23,DEBUT!$B$6:$E$100,3,FALSE),\"\")","v":2},{"$f":"IFERROR(VLOOKUP(D23,DEBUT!$B$6:$E$100,4,FALSE),\"\")","v":3},null,{"$f":"IFERROR(VLOOKUP(H23,DEBUT!$G$5:$J$100,2,FALSE),\"\")","v":""},{"$f":"IFERROR(VLOOKUP(H23,DEBUT!$G$5:$J$100,3,FALSE),\"\")","v":""},{"$f":"IFERROR(VLOOKUP(H23,DEBUT!$G$5:$J$100,4,FALSE),\"\")","v":""}]
[{"$f":"IF($B$2=APPEL!$B$1,VLOOKUP(B24,APPEL!$C$3:$D$38,2,FALSE),IF($B$2=APPEL!$E$1,VLOOKUP(B24,APPEL!$F$3:$G$38,2,FALSE),IF($B$2=APPEL!$H$1,VLOOKUP(B24,APPEL!$I$3:$J$38,2,FALSE),IF($B$2=APPEL!$K$1,VLOOKUP(B24,APPEL!$L$3:$M$38,2,FALSE),IF($B$2=APPEL!$N$1,VLOOKUP(B24,APPEL!$O$3:$P$38,2,FALSE),IF($B$2=APPEL!$Q$1,VLOOKUP(B24,APPEL!$R$3:$S$38,2,FALSE),IF($B$2=APPEL!$T$1,VLOOKUP(B24,APPEL!$U$3:$V$38,2,FALSE),IF($B$2=APPEL!$W$1,VLOOKUP(B24,APPEL!$X$3:$Y$38,2,FALSE),IF($B$2=APPEL!$Z$1,VLOOKUP(B24,APPEL!$AA$3:$AB$38,2,FALSE))))))))))","v":{"$error":"#N/A"}},{"$f":"IF($B$2=APPEL!$B$1,APPEL!C22,IF($B$2=APPEL!$E$1,APPEL!F22,IF($B$2=APPEL!$H$1,APPEL!I22,IF($B$2=APPEL!$K$1,APPEL!L22,IF($B$2=APPEL!$N$1,APPEL!O22,IF($B$2=APPEL!$Q$1,APPEL!R22,IF($B$2=APPEL!$T$1,APPEL!U22,IF($B$2=APPEL!$W$1,APPEL!X22,IF($B$2=APPEL!$Z$1,APPEL!AA22)))))))))","v":0},null,null,{"$f":"IFERROR(VLOOKUP(D24,DEBUT!$B$6:$E$100,2,FALSE),\"\")","v":1},{"$f":"IFERROR(VLOOKUP(D24,DEBUT!$B$6:$E$100,3,FALSE),\"\")","v":2},{"$f":"IFERROR(VLOOKUP(D24,DEBUT!$B$6:$E$100,4,FALSE),\"\")","v":3},null,{"$f":"IFERROR(VLOOKUP(H24,DEBUT!$G$5:$J$100,2,FALSE),\"\")","v":""},{"$f":"IFERROR(VLOOKUP(H24,DEBUT!$G$5:$J$100,3,FALSE),\"\")","v":""},{"$f":"IFERROR(VLOOKUP(H24,DEBUT!$G$5:$J$100,4,FALSE),\"\")","v":""}]
[{"$f":"IF($B$2=APPEL!$B$1,VLOOKUP(B25,APPEL!$C$3:$D$38,2,FALSE),IF($B$2=APPEL!$E$1,VLOOKUP(B25,APPEL!$F$3:$G$38,2,FALSE),IF($B$2=APPEL!$H$1,VLOOKUP(B25,APPEL!$I$3:$J$38,2,FALSE),IF($B$2=APPEL!$K$1,VLOOKUP(B25,APPEL!$L$3:$M$38,2,FALSE),IF($B$2=APPEL!$N$1,VLOOKUP(B25,APPEL!$O$3:$P$38,2,FALSE),IF($B$2=APPEL!$Q$1,VLOOKUP(B25,APPEL!$R$3:$S$38,2,FALSE),IF($B$2=APPEL!$T$1,VLOOKUP(B25,APPEL!$U$3:$V$38,2,FALSE),IF($B$2=APPEL!$W$1,VLOOKUP(B25,APPEL!$X$3:$Y$38,2,FALSE),IF($B$2=APPEL!$Z$1,VLOOKUP(B25,APPEL!$AA$3:$AB$38,2,FALSE))))))))))","v":{"$error":"#N/A"}},{"$f":"IF($B$2=APPEL!$B$1,APPEL!C23,IF($B$2=APPEL!$E$1,APPEL!F23,IF($B$2=APPEL!$H$1,APPEL!I23,IF($B$2=APPEL!$K$1,APPEL!L23,IF($B$2=APPEL!$N$1,APPEL!O23,IF($B$2=APPEL!$Q$1,APPEL!R23,IF($B$2=APPEL!$T$1,APPEL!U23,IF($B$2=APPEL!$W$1,APPEL!X23,IF($B$2=APPEL!$Z$1,APPEL!AA23)))))))))","v":0},null,null,{"$f":"IFERROR(VLOOKUP(D25,DEBUT!$B$6:$E$100,2,FALSE),\"\")","v":1},{"$f":"IFERROR(VLOOKUP(D25,DEBUT!$B$6:$E$100,3,FALSE),\"\")","v":2},{"$f":"IFERROR(VLOOKUP(D25,DEBUT!$B$6:$E$100,4,FALSE),\"\")","v":3},null,{"$f":"IFERROR(VLOOKUP(H25,DEBUT!$G$5:$J$100,2,FALSE),\"\")","v":""},{"$f":"IFERROR(VLOOKUP(H25,DEBUT!$G$5:$J$100,3,FALSE),\"\")","v":""},{"$f":"IFERROR(VLOOKUP(H25,DEBUT!$G$5:$J$100,4,FALSE),\"\")","v":""}]
[{"$f":"IF($B$2=APPEL!$B$1,VLOOKUP(B26,APPEL!$C$3:$D$38,2,FALSE),IF($B$2=APPEL!$E$1,VLOOKUP(B26,APPEL!$F$3:$G$38,2,FALSE),IF($B$2=APPEL!$H$1,VLOOKUP(B26,APPEL!$I$3:$J$38,2,FALSE),IF($B$2=APPEL!$K$1,VLOOKUP(B26,APPEL!$L$3:$M$38,2,FALSE),IF($B$2=APPEL!$N$1,VLOOKUP(B26,APPEL!$O$3:$P$38,2,FALSE),IF($B$2=APPEL!$Q$1,VLOOKUP(B26,APPEL!$R$3:$S$38,2,FALSE),IF($B$2=APPEL!$T$1,VLOOKUP(B26,APPEL!$U$3:$V$38,2,FALSE),IF($B$2=APPEL!$W$1,VLOOKUP(B26,APPEL!$X$3:$Y$38,2,FALSE),IF($B$2=APPEL!$Z$1,VLOOKUP(B26,APPEL!$AA$3:$AB$38,2,FALSE))))))))))","v":{"$error":"#N/A"}},{"$f":"IF($B$2=APPEL!$B$1,APPEL!C24,IF($B$2=APPEL!$E$1,APPEL!F24,IF($B$2=APPEL!$H$1,APPEL!I24,IF($B$2=APPEL!$K$1,APPEL!L24,IF($B$2=APPEL!$N$1,APPEL!O24,IF($B$2=APPEL!$Q$1,APPEL!R24,IF($B$2=APPEL!$T$1,APPEL!U24,IF($B$2=APPEL!$W$1,APPEL!X24,IF($B$2=APPEL!$Z$1,APPEL!AA24)))))))))","v":0},null,null,{"$f":"IFERROR(VLOOKUP(D26,DEBUT!$B$6:$E$100,2,FALSE),\"\")","v":1},{"$f":"IFERROR(VLOOKUP(D26,DEBUT!$B$6:$E$100,3,FALSE),\"\")","v":2},{"$f":"IFERROR(VLOOKUP(D26,DEBUT!$B$6:$E$100,4,FALSE),\"\")","v":3},null,{"$f":"IFERROR(VLOOKUP(H26,DEBUT!$G$5:$J$100,2,FALSE),\"\")","v":""},{"$f":"IFERROR(VLOOKUP(H26,DEBUT!$G$5:$J$100,3,FALSE),\"\")","v":""},{"$f":"IFERROR(VLOOKUP(H26,DEBUT!$G$5:$J$100,4,FALSE),\"\")","v":""}]
[{"$f":"IF($B$2=APPEL!$B$1,VLOOKUP(B27,APPEL!$C$3:$D$38,2,FALSE),IF($B$2=APPEL!$E$1,VLOOKUP(B27,APPEL!$F$3:$G$38,2,FALSE),IF($B$2=APPEL!$H$1,VLOOKUP(B27,APPEL!$I$3:$J$38,2,FALSE),IF($B$2=APPEL!$K$1,VLOOKUP(B27,APPEL!$L$3:$M$38,2,FALSE),IF($B$2=APPEL!$N$1,VLOOKUP(B27,APPEL!$O$3:$P$38,2,FALSE),IF($B$2=APPEL!$Q$1,VLOOKUP(B27,APPEL!$R$3:$S$38,2,FALSE),IF($B$2=APPEL!$T$1,VLOOKUP(B27,APPEL!$U$3:$V$38,2,FALSE),IF($B$2=APPEL!$W$1,VLOOKUP(B27,APPEL!$X$3:$Y$38,2,FALSE),IF($B$2=APPEL!$Z$1,VLOOKUP(B27,APPEL!$AA$3:$AB$38,2,FALSE))))))))))","v":{"$error":"#N/A"}},{"$f":"IF($B$2=APPEL!$B$1,APPEL!C25,IF($B$2=APPEL!$E$1,APPEL!F25,IF($B$2=APPEL!$H$1,APPEL!I25,IF($B$2=APPEL!$K$1,APPEL!L25,IF($B$2=APPEL!$N$1,APPEL!O25,IF($B$2=APPEL!$Q$1,APPEL!R25,IF($B$2=APPEL!$T$1,APPEL!U25,IF($B$2=APPEL!$W$1,APPEL!X25,IF($B$2=APPEL!$Z$1,APPEL!AA25)))))))))","v":0},null,null,{"$f":"IFERROR(VLOOKUP(D27,DEBUT!$B$6:$E$100,2,FALSE),\"\")","v":1},{"$f":"IFERROR(VLOOKUP(D27,DEBUT!$B$6:$E$100,3,FALSE),\"\")","v":2},{"$f":"IFERROR(VLOOKUP(D27,DEBUT!$B$6:$E$100,4,FALSE),\"\")","v":3},null,{"$f":"IFERROR(VLOOKUP(H27,DEBUT!$G$5:$J$100,2,FALSE),\"\")","v":""},{"$f":"IFERROR(VLOOKUP(H27,DEBUT!$G$5:$J$100,3,FALSE),\"\")","v":""},{"$f":"IFERROR(VLOOKUP(H27,DEBUT!$G$5:$J$100,4,FALSE),\"\")","v":""}]
[{"$f":"IF($B$2=APPEL!$B$1,VLOOKUP(B28,APPEL!$C$3:$D$38,2,FALSE),IF($B$2=APPEL!$E$1,VLOOKUP(B28,APPEL!$F$3:$G$38,2,FALSE),IF($B$2=APPEL!$H$1,VLOOKUP(B28,APPEL!$I$3:$J$38,2,FALSE),IF($B$2=APPEL!$K$1,VLOOKUP(B28,APPEL!$L$3:$M$38,2,FALSE),IF($B$2=APPEL!$N$1,VLOOKUP(B28,APPEL!$O$3:$P$38,2,FALSE),IF($B$2=APPEL!$Q$1,VLOOKUP(B28,APPEL!$R$3:$S$38,2,FALSE),IF($B$2=APPEL!$T$1,VLOOKUP(B28,APPEL!$U$3:$V$38,2,FALSE),IF($B$2=APPEL!$W$1,VLOOKUP(B28,APPEL!$X$3:$Y$38,2,FALSE),IF($B$2=APPEL!$Z$1,VLOOKUP(B28,APPEL!$AA$3:$AB$38,2,FALSE))))))))))","v":{"$error":"#N/A"}},{"$f":"IF($B$2=APPEL!$B$1,APPEL!C26,IF($B$2=APPEL!$E$1,APPEL!F26,IF($B$2=APPEL!$H$1,APPEL!I26,IF($B$2=APPEL!$K$1,APPEL!L26,IF($B$2=APPEL!$N$1,APPEL!O26,IF($B$2=APPEL!$Q$1,APPEL!R26,IF($B$2=APPEL!$T$1,APPEL!U26,IF($B$2=APPEL!$W$1,APPEL!X26,IF($B$2=APPEL!$Z$1,APPEL!AA26)))))))))","v":0},null,null,{"$f":"IFERROR(VLOOKUP(D28,DEBUT!$B$6:$E$100,2,FALSE),\"\")","v":1},{"$f":"IFERROR(VLOOKUP(D28,DEBUT!$B$6:$E$100,3,FALSE),\"\")","v":2},{"$f":"IFERROR(VLOOKUP(D28,DEBUT!$B$6:$E$100,4,FALSE),\"\")","v":3},null,{"$f":"IFERROR(VLOOKUP(H28,DEBUT!$G$5:$J$100,2,FALSE),\"\")","v":""},{"$f":"IFERROR(VLOOKUP(H28,DEBUT!$G$5:$J$100,3,FALSE),\"\")","v":""},{"$f":"IFERROR(VLOOKUP(H28,DEBUT!$G$5:$J$100,4,FALSE),\"\")","v":""}]
[{"$f":"IF($B$2=APPEL!$B$1,VLOOKUP(B29,APPEL!$C$3:$D$38,2,FALSE),IF($B$2=APPEL!$E$1,VLOOKUP(B29,APPEL!$F$3:$G$38,2,FALSE),IF($B$2=APPEL!$H$1,VLOOKUP(B29,APPEL!$I$3:$J$38,2,FALSE),IF($B$2=APPEL!$K$1,VLOOKUP(B29,APPEL!$L$3:$M$38,2,FALSE),IF($B$2=APPEL!$N$1,VLOOKUP(B29,APPEL!$O$3:$P$38,2,FALSE),IF($B$2=APPEL!$Q$1,VLOOKUP(B29,APPEL!$R$3:$S$38,2,FALSE),IF($B$2=APPEL!$T$1,VLOOKUP(B29,APPEL!$U$3:$V$38,2,FALSE),IF($B$2=APPEL!$W$1,VLOOKUP(B29,APPEL!$X$3:$Y$38,2,FALSE),IF($B$2=APPEL!$Z$1,VLOOKUP(B29,APPEL!$AA$3:$AB$38,2,FALSE))))))))))","v":{"$error":"#N/A"}},{"$f":"IF($B$2=APPEL!$B$1,APPEL!C27,IF($B$2=APPEL!$E$1,APPEL!F27,IF($B$2=APPEL!$H$1,APPEL!I27,IF($B$2=APPEL!$K$1,APPEL!L27,IF($B$2=APPEL!$N$1,APPEL!O27,IF($B$2=APPEL!$Q$1,APPEL!R27,IF($B$2=APPEL!$T$1,APPEL!U27,IF($B$2=APPEL!$W$1,APPEL!X27,IF($B$2=APPEL!$Z$1,APPEL!AA27)))))))))","v":0},null,null,{"$f":"IFERROR(VLOOKUP(D29,DEBUT!$B$6:$E$100,2,FALSE),\"\")","v":1},{"$f":"IFERROR(VLOOKUP(D29,DEBUT!$B$6:$E$100,3,FALSE),\"\")","v":2},{"$f":"IFERROR(VLOOKUP(D29,DEBUT!$B$6:$E$100,4,FALSE),\"\")","v":3},null,{"$f":"IFERROR(VLOOKUP(H29,DEBUT!$G$5:$J$100,2,FALSE),\"\")","v":""},{"$f":"IFERROR(VLOOKUP(H29,DEBUT!$G$5:$J$100,3,FALSE),\"\")","v":""},{"$f":"IFERROR(VLOOKUP(H29,DEBUT!$G$5:$J$100,4,FALSE),\"\")","v":""}]
[{"$f":"IF($B$2=APPEL!$B$1,VLOOKUP(B30,APPEL!$C$3:$D$38,2,FALSE),IF($B$2=APPEL!$E$1,VLOOKUP(B30,APPEL!$F$3:$G$38,2,FALSE),IF($B$2=APPEL!$H$1,VLOOKUP(B30,APPEL!$I$3:$J$38,2,FALSE),IF($B$2=APPEL!$K$1,VLOOKUP(B30,APPEL!$L$3:$M$38,2,FALSE),IF($B$2=APPEL!$N$1,VLOOKUP(B30,APPEL!$O$3:$P$38,2,FALSE),IF($B$2=APPEL!$Q$1,VLOOKUP(B30,APPEL!$R$3:$S$38,2,FALSE),IF($B$2=APPEL!$T$1,VLOOKUP(B30,APPEL!$U$3:$V$38,2,FALSE),IF($B$2=APPEL!$W$1,VLOOKUP(B30,APPEL!$X$3:$Y$38,2,FALSE),IF($B$2=APPEL!$Z$1,VLOOKUP(B30,APPEL!$AA$3:$AB$38,2,FALSE))))))))))","v":{"$error":"#N/A"}},{"$f":"IF($B$2=APPEL!$B$1,APPEL!C28,IF($B$2=APPEL!$E$1,APPEL!F28,IF($B$2=APPEL!$H$1,APPEL!I28,IF($B$2=APPEL!$K$1,APPEL!L28,IF($B$2=APPEL!$N$1,APPEL!O28,IF($B$2=APPEL!$Q$1,APPEL!R28,IF($B$2=APPEL!$T$1,APPEL!U28,IF($B$2=APPEL!$W$1,APPEL!X28,IF($B$2=APPEL!$Z$1,APPEL!AA28)))))))))","v":0},null,null,{"$f":"IFERROR(VLOOKUP(D30,DEBUT!$B$6:$E$100,2,FALSE),\"\")","v":1},{"$f":"IFERROR(VLOOKUP(D30,DEBUT!$B$6:$E$100,3,FALSE),\"\")","v":2},{"$f":"IFERROR(VLOOKUP(D30,DEBUT!$B$6:$E$100,4,FALSE),\"\")","v":3},null,{"$f":"IFERROR(VLOOKUP(H30,DEBUT!$G$5:$J$100,2,FALSE),\"\")","v":""},{"$f":"IFERROR(VLOOKUP(H30,DEBUT!$G$5:$J$100,3,FALSE),\"\")","v":""},{"$f":"IFERROR(VLOOKUP(H30,DEBUT!$G$5:$J$100,4,FALSE),\"\")","v":""}]
[{"$f":"IF($B$2=APPEL!$B$1,VLOOKUP(B31,APPEL!$C$3:$D$38,2,FALSE),IF($B$2=APPEL!$E$1,VLOOKUP(B31,APPEL!$F$3:$G$38,2,FALSE),IF($B$2=APPEL!$H$1,VLOOKUP(B31,APPEL!$I$3:$J$38,2,FALSE),IF($B$2=APPEL!$K$1,VLOOKUP(B31,APPEL!$L$3:$M$38,2,FALSE),IF($B$2=APPEL!$N$1,VLOOKUP(B31,APPEL!$O$3:$P$38,2,FALSE),IF($B$2=APPEL!$Q$1,VLOOKUP(B31,APPEL!$R$3:$S$38,2,FALSE),IF($B$2=APPEL!$T$1,VLOOKUP(B31,APPEL!$U$3:$V$38,2,FALSE),IF($B$2=APPEL!$W$1,VLOOKUP(B31,APPEL!$X$3:$Y$38,2,FALSE),IF($B$2=APPEL!$Z$1,VLOOKUP(B31,APPEL!$AA$3:$AB$38,2,FALSE))))))))))","v":{"$error":"#N/A"}},{"$f":"IF($B$2=APPEL!$B$1,APPEL!C29,IF($B$2=APPEL!$E$1,APPEL!F29,IF($B$2=APPEL!$H$1,APPEL!I29,IF($B$2=APPEL!$K$1,APPEL!L29,IF($B$2=APPEL!$N$1,APPEL!O29,IF($B$2=APPEL!$Q$1,APPEL!R29,IF($B$2=APPEL!$T$1,APPEL!U29,IF($B$2=APPEL!$W$1,APPEL!X29,IF($B$2=APPEL!$Z$1,APPEL!AA29)))))))))","v":0},null,null,{"$f":"IFERROR(VLOOKUP(D31,DEBUT!$B$6:$E$100,2,FALSE),\"\")","v":1},{"$f":"IFERROR(VLOOKUP(D31,DEBUT!$B$6:$E$100,3,FALSE),\"\")","v":2},{"$f":"IFERROR(VLOOKUP(D31,DEBUT!$B$6:$E$100,4,FALSE),\"\")","v":3},null,{"$f":"IFERROR(VLOOKUP(H31,DEBUT!$G$5:$J$100,2,FALSE),\"\")","v":""},{"$f":"IFERROR(VLOOKUP(H31,DEBUT!$G$5:$J$100,3,FALSE),\"\")","v":""},{"$f":"IFERROR(VLOOKUP(H31,DEBUT!$G$5:$J$100,4,FALSE),\"\")","v":""}]
[{"$f":"IF($B$2=APPEL!$B$1,VLOOKUP(B32,APPEL!$C$3:$D$38,2,FALSE),IF($B$2=APPEL!$E$1,VLOOKUP(B32,APPEL!$F$3:$G$38,2,FALSE),IF($B$2=APPEL!$H$1,VLOOKUP(B32,APPEL!$I$3:$J$38,2,FALSE),IF($B$2=APPEL!$K$1,VLOOKUP(B32,APPEL!$L$3:$M$38,2,FALSE),IF($B$2=APPEL!$N$1,VLOOKUP(B32,APPEL!$O$3:$P$38,2,FALSE),IF($B$2=APPEL!$Q$1,VLOOKUP(B32,APPEL!$R$3:$S$38,2,FALSE),IF($B$2=APPEL!$T$1,VLOOKUP(B32,APPEL!$U$3:$V$38,2,FALSE),IF($B$2=APPEL!$W$1,VLOOKUP(B32,APPEL!$X$3:$Y$38,2,FALSE),IF($B$2=APPEL!$Z$1,VLOOKUP(B32,APPEL!$AA$3:$AB$38,2,FALSE))))))))))","v":{"$error":"#N/A"}},{"$f":"IF($B$2=APPEL!$B$1,APPEL!C30,IF($B$2=APPEL!$E$1,APPEL!F30,IF($B$2=APPEL!$H$1,APPEL!I30,IF($B$2=APPEL!$K$1,APPEL!L30,IF($B$2=APPEL!$N$1,APPEL!O30,IF($B$2=APPEL!$Q$1,APPEL!R30,IF($B$2=APPEL!$T$1,APPEL!U30,IF($B$2=APPEL!$W$1,APPEL!X30,IF($B$2=APPEL!$Z$1,APPEL!AA30)))))))))","v":0},null,null,{"$f":"IFERROR(VLOOKUP(D32,DEBUT!$B$6:$E$100,2,FALSE),\"\")","v":1},{"$f":"IFERROR(VLOOKUP(D32,DEBUT!$B$6:$E$100,3,FALSE),\"\")","v":2},{"$f":"IFERROR(VLOOKUP(D32,DEBUT!$B$6:$E$100,4,FALSE),\"\")","v":3},null,{"$f":"IFERROR(VLOOKUP(H32,DEBUT!$G$5:$J$100,2,FALSE),\"\")","v":""},{"$f":"IFERROR(VLOOKUP(H32,DEBUT!$G$5:$J$100,3,FALSE),\"\")","v":""},{"$f":"IFERROR(VLOOKUP(H32,DEBUT!$G$5:$J$100,4,FALSE),\"\")","v":""}]
[{"$f":"IF($B$2=APPEL!$B$1,VLOOKUP(B33,APPEL!$C$3:$D$38,2,FALSE),IF($B$2=APPEL!$E$1,VLOOKUP(B33,APPEL!$F$3:$G$38,2,FALSE),IF($B$2=APPEL!$H$1,VLOOKUP(B33,APPEL!$I$3:$J$38,2,FALSE),IF($B$2=APPEL!$K$1,VLOOKUP(B33,APPEL!$L$3:$M$38,2,FALSE),IF($B$2=APPEL!$N$1,VLOOKUP(B33,APPEL!$O$3:$P$38,2,FALSE),IF($B$2=APPEL!$Q$1,VLOOKUP(B33,APPEL!$R$3:$S$38,2,FALSE),IF($B$2=APPEL!$T$1,VLOOKUP(B33,APPEL!$U$3:$V$38,2,FALSE),IF($B$2=APPEL!$W$1,VLOOKUP(B33,APPEL!$X$3:$Y$38,2,FALSE),IF($B$2=APPEL!$Z$1,VLOOKUP(B33,APPEL!$AA$3:$AB$38,2,FALSE))))))))))","v":{"$error":"#N/A"}},{"$f":"IF($B$2=APPEL!$B$1,APPEL!C31,IF($B$2=APPEL!$E$1,APPEL!F31,IF($B$2=APPEL!$H$1,APPEL!I31,IF($B$2=APPEL!$K$1,APPEL!L31,IF($B$2=APPEL!$N$1,APPEL!O31,IF($B$2=APPEL!$Q$1,APPEL!R31,IF($B$2=APPEL!$T$1,APPEL!U31,IF($B$2=APPEL!$W$1,APPEL!X31,IF($B$2=APPEL!$Z$1,APPEL!AA31)))))))))","v":0},null,null,{"$f":"IFERROR(VLOOKUP(D33,DEBUT!$B$6:$E$100,2,FALSE),\"\")","v":1},{"$f":"IFERROR(VLOOKUP(D33,DEBUT!$B$6:$E$100,3,FALSE),\"\")","v":2},{"$f":"IFERROR(VLOOKUP(D33,DEBUT!$B$6:$E$100,4,FALSE),\"\")","v":3},null,{"$f":"IFERROR(VLOOKUP(H33,DEBUT!$G$5:$J$100,2,FALSE),\"\")","v":""},{"$f":"IFERROR(VLOOKUP(H33,DEBUT!$G$5:$J$100,3,FALSE),\"\")","v":""},{"$f":"IFERROR(VLOOKUP(H33,DEBUT!$G$5:$J$100,4,FALSE),\"\")","v":""}]
[{"$f":"IF($B$2=APPEL!$B$1,VLOOKUP(B34,APPEL!$C$3:$D$38,2,FALSE),IF($B$2=APPEL!$E$1,VLOOKUP(B34,APPEL!$F$3:$G$38,2,FALSE),IF($B$2=APPEL!$H$1,VLOOKUP(B34,APPEL!$I$3:$J$38,2,FALSE),IF($B$2=APPEL!$K$1,VLOOKUP(B34,APPEL!$L$3:$M$38,2,FALSE),IF($B$2=APPEL!$N$1,VLOOKUP(B34,APPEL!$O$3:$P$38,2,FALSE),IF($B$2=APPEL!$Q$1,VLOOKUP(B34,APPEL!$R$3:$S$38,2,FALSE),IF($B$2=APPEL!$T$1,VLOOKUP(B34,APPEL!$U$3:$V$38,2,FALSE),IF($B$2=APPEL!$W$1,VLOOKUP(B34,APPEL!$X$3:$Y$38,2,FALSE),IF($B$2=APPEL!$Z$1,VLOOKUP(B34,APPEL!$AA$3:$AB$38,2,FALSE))))))))))","v":{"$error":"#N/A"}},{"$f":"IF($B$2=APPEL!$B$1,APPEL!C32,IF($B$2=APPEL!$E$1,APPEL!F32,IF($B$2=APPEL!$H$1,APPEL!I32,IF($B$2=APPEL!$K$1,APPEL!L32,IF($B$2=APPEL!$N$1,APPEL!O32,IF($B$2=APPEL!$Q$1,APPEL!R32,IF($B$2=APPEL!$T$1,APPEL!U32,IF($B$2=APPEL!$W$1,APPEL!X32,IF($B$2=APPEL!$Z$1,APPEL!AA32)))))))))","v":0},null,null,{"$f":"IFERROR(VLOOKUP(D34,DEBUT!$B$6:$E$100,2,FALSE),\"\")","v":1},{"$f":"IFERROR(VLOOKUP(D34,DEBUT!$B$6:$E$100,3,FALSE),\"\")","v":2},{"$f":"IFERROR(VLOOKUP(D34,DEBUT!$B$6:$E$100,4,FALSE),\"\")","v":3},null,{"$f":"IFERROR(VLOOKUP(H34,DEBUT!$G$5:$J$100,2,FALSE),\"\")","v":""},{"$f":"IFERROR(VLOOKUP(H34,DEBUT!$G$5:$J$100,3,FALSE),\"\")","v":""},{"$f":"IFERROR(VLOOKUP(H34,DEBUT!$G$5:$J$100,4,FALSE),\"\")","v":""}]
[{"$f":"IF($B$2=APPEL!$B$1,VLOOKUP(B35,APPEL!$C$3:$D$38,2,FALSE),IF($B$2=APPEL!$E$1,VLOOKUP(B35,APPEL!$F$3:$G$38,2,FALSE),IF($B$2=APPEL!$H$1,VLOOKUP(B35,APPEL!$I$3:$J$38,2,FALSE),IF($B$2=APPEL!$K$1,VLOOKUP(B35,APPEL!$L$3:$M$38,2,FALSE),IF($B$2=APPEL!$N$1,VLOOKUP(B35,APPEL!$O$3:$P$38,2,FALSE),IF($B$2=APPEL!$Q$1,VLOOKUP(B35,APPEL!$R$3:$S$38,2,FALSE),IF($B$2=APPEL!$T$1,VLOOKUP(B35,APPEL!$U$3:$V$38,2,FALSE),IF($B$2=APPEL!$W$1,VLOOKUP(B35,APPEL!$X$3:$Y$38,2,FALSE),IF($B$2=APPEL!$Z$1,VLOOKUP(B35,APPEL!$AA$3:$AB$38,2,FALSE))))))))))","v":{"$error":"#N/A"}},{"$f":"IF($B$2=APPEL!$B$1,APPEL!C33,IF($B$2=APPEL!$E$1,APPEL!F33,IF($B$2=APPEL!$H$1,APPEL!I33,IF($B$2=APPEL!$K$1,APPEL!L33,IF($B$2=APPEL!$N$1,APPEL!O33,IF($B$2=APPEL!$Q$1,APPEL!R33,IF($B$2=APPEL!$T$1,APPEL!U33,IF($B$2=APPEL!$W$1,APPEL!X33,IF($B$2=APPEL!$Z$1,APPEL!AA33)))))))))","v":0},null,null,{"$f":"IFERROR(VLOOKUP(D35,DEBUT!$B$6:$E$100,2,FALSE),\"\")","v":1},{"$f":"IFERROR(VLOOKUP(D35,DEBUT!$B$6:$E$100,3,FALSE),\"\")","v":2},{"$f":"IFERROR(VLOOKUP(D35,DEBUT!$B$6:$E$100,4,FALSE),\"\")","v":3},null,{"$f":"IFERROR(VLOOKUP(H35,DEBUT!$G$5:$J$100,2,FALSE),\"\")","v":""},{"$f":"IFERROR(VLOOKUP(H35,DEBUT!$G$5:$J$100,3,FALSE),\"\")","v":""},{"$f":"IFERROR(VLOOKUP(H35,DEBUT!$G$5:$J$100,4,FALSE),\"\")","v":""}]
[{"$f":"IF($B$2=APPEL!$B$1,VLOOKUP(B36,APPEL!$C$3:$D$38,2,FALSE),IF($B$2=APPEL!$E$1,VLOOKUP(B36,APPEL!$F$3:$G$38,2,FALSE),IF($B$2=APPEL!$H$1,VLOOKUP(B36,APPEL!$I$3:$J$38,2,FALSE),IF($B$2=APPEL!$K$1,VLOOKUP(B36,APPEL!$L$3:$M$38,2,FALSE),IF($B$2=APPEL!$N$1,VLOOKUP(B36,APPEL!$O$3:$P$38,2,FALSE),IF($B$2=APPEL!$Q$1,VLOOKUP(B36,APPEL!$R$3:$S$38,2,FALSE),IF($B$2=APPEL!$T$1,VLOOKUP(B36,APPEL!$U$3:$V$38,2,FALSE),IF($B$2=APPEL!$W$1,VLOOKUP(B36,APPEL!$X$3:$Y$38,2,FALSE),IF($B$2=APPEL!$Z$1,VLOOKUP(B36,APPEL!$AA$3:$AB$38,2,FALSE))))))))))","v":{"$error":"#N/A"}},{"$f":"IF($B$2=APPEL!$B$1,APPEL!C34,IF($B$2=APPEL!$E$1,APPEL!F34,IF($B$2=APPEL!$H$1,APPEL!I34,IF($B$2=APPEL!$K$1,APPEL!L34,IF($B$2=APPEL!$N$1,APPEL!O34,IF($B$2=APPEL!$Q$1,APPEL!R34,IF($B$2=APPEL!$T$1,APPEL!U34,IF($B$2=APPEL!$W$1,APPEL!X34,IF($B$2=APPEL!$Z$1,APPEL!AA34)))))))))","v":0},null,null,{"$f":"IFERROR(VLOOKUP(D36,DEBUT!$B$6:$E$100,2,FALSE),\"\")","v":1},{"$f":"IFERROR(VLOOKUP(D36,DEBUT!$B$6:$E$100,3,FALSE),\"\")","v":2},{"$f":"IFERROR(VLOOKUP(D36,DEBUT!$B$6:$E$100,4,FALSE),\"\")","v":3},null,{"$f":"IFERROR(VLOOKUP(H36,DEBUT!$G$5:$J$100,2,FALSE),\"\")","v":""},{"$f":"IFERROR(VLOOKUP(H36,DEBUT!$G$5:$J$100,3,FALSE),\"\")","v":""},{"$f":"IFERROR(VLOOKUP(H36,DEBUT!$G$5:$J$100,4,FALSE),\"\")","v":""}]

{"sheet":"MACROS","index":7,"n_rows":27,"n_cols":10,"rows_kept":27,"cut":false,"hidden":false,"merged":[[16,7,16,8]]}
[3]
["15:47:48"]
[null,"MACROS UTILISABLES SUR N'IMPORTE QUELLE FEUILLE"]
[]
[]
[]
[]
[]
[]
[4]
[null,"MACROS OU IL FAUDRA CHANGER LE NOM DE LA CELLULE, LIGNE OU COLONNE (et le nom de la macro si elle doit être dupliquée), et/ou LA VALEUR"]
[]
[]
[]
[]
[]
[null,null,null,null,null,null,"Effacer d'abord A1","Bien définir le format de cellule",null,3]
[null,"MACROS OU IL FAUDRA CHANGER LE NOM DE LA FEUILLE"]
[]
[]
[]
[]
[]
[]
[]
[]
[null,null,null,null,null,null,1]

{"sheet":"SAELEVE1","index":8,"n_rows":19,"n_cols":11,"rows_kept":19,"cut":false,"hidden":false,"merged":[[15,2,15,10],[16,2,16,10],[17,2,17,10],[18,2,18,10],[14,9,14,10],[14,5,14,8],[13,2,13,4],[14,2,14,4],[13,9,13,10],[13,5,13,8],[7,17,7,18],[8,2,8,6],[8,7,8,10],[9,2,9,6],[9,7,9,10],[12,2,12,10],[4,2,4,6],[4,7,4,10],[5,2,7,6],[5,7,5,10],[6,7,6,10],[7,7,7,10],[2,2,3,2],[2,3,3,4],[2,6,2,9],[2,10,3,10],[3,6,3,9]]}
[null,null,null,"Situation d'apprentissage"]
[]
[null,null,{"$f":"VLOOKUP($D$3,SAMICBIS!$A$3:$T$70,4,FALSE)","v":"BAD"},"Max Tirs en 1'",null,"Obj",{"$f":"VLOOKUP($D$3,SAMICBIS!$A$3:$T$70,5,FALSE)","v":"Améliorer la qualité du tir en course"},null,null,null,{"$f":"VLOOKUP($D$3,SAMICBIS!$A$3:$T$70,2,FALSE)","v":"T1'"}]
[null,null,null,null,null,"But",{"$f":"VLOOKUP($D$3,SAMICBIS!$A$3:$T$70,6,FALSE)","v":"Marquer le plus de paniers possibles en 1 minute"}]
[null,null,"Schéma / Matériel nécessaire",null,null,null,null,"Matériel nécessaire"]
[null,null,null,null,null,null,null,{"$f":"VLOOKUP($D$3,SAMICBIS!$A$3:$T$70,13,FALSE)","v":"2 ballons (1 chacun). 1 panier. 2 plots. 1 chrono. 1 tablette."}]
[null,null,null,null,null,null,null,"Consignes"]
[null,null,null,null,null,null,null,{"$f":"CONCATENATE(VLOOKUP($D$3,SAMICBIS!$A$3:$T$70,8,FALSE),\"  -  \",VLOOKUP($D$3,SAMICBIS!$A$3:$T$70,10,FALSE))","v":"Mini défi 1 contre 1. Les joueurs se placent à leur plot. AU signal d'un camarade ils dribblent pour aller shooter au panier. Que le tir soit réussi ou non, les 2 joueurs retournent faire le tour du plot en dribblant pour tenter un nouveau tir. Ils tournent pendant 1 minute. chacun compte son score en même temps que les observateurs et le relève sur la tablette à la fin. 2 nouveaux élèves passent quand la minute est finie.  -  Consignes 2"}]
[null,null,"Critères de réussite",null,null,null,null,"Conseils pour réussir"]
[null,null,{"$f":"VLOOKUP($D$3,SAMICBIS!$A$3:$T$70,14,FALSE)","v":"Je réussi au moins 3 tirs à l'arrêt et 5 tirs en course."},null,null,null,null,{"$f":"VLOOKUP($D$3,SAMICBIS!$A$3:$T$70,12,FALSE)","v":"JE dribble rapidement pour pouvoir effectuer plusieurs shoots. Je m'applique sur chaque tir en m'aidant de l'angle du carré de la planche. "}]
[]
[]
[null,null,"ACQUISITIONS PRIORITAIRES"]
[null,null,"Connaissances",null,null,"Capacités",null,null,null,"Attitudes"]
[null,null,{"$f":"VLOOKUP($D$3,SAMICBIS!$A$3:$T$70,16,FALSE)","v":"Cns"},null,null,{"$f":"VLOOKUP($D$3,SAMICBIS!$A$3:$T$70,17,FALSE)","v":"Cap"},null,null,null,{"$f":"VLOOKUP($D$3,SAMICBIS!$A$3:$T$70,18,FALSE)","v":"Att"}]
[null,null,"COMPLEXIFICATION "]
[null,null,{"$f":"VLOOKUP($D$3,SAMICBIS!$A$3:$T$70,19,FALSE)","v":"Cplx"}]
[null,null,"Simplification"]
[null,null,{"$f":"VLOOKUP($D$3,SAMICBIS!$A$3:$T$70,20,FALSE)","v":"Simpli"}]

{"sheet":"REFERENTIELS","index":9,"n_rows":47,"n_cols":7,"rows_kept":47,"cut":false,"hidden":false,"merged":[[44,2,45,2],[44,3,45,3],[46,8,46,9],[25,2,26,2],[25,3,26,3],[27,2,28,2],[27,3,28,3],[29,8,29,9],[30,2,30,9],[37,2,37,3],[37,4,37,9],[38,2,38,3],[38,4,38,9],[39,4,39,5],[39,6,39,9],[40,2,41,2],[40,3,41,3],[42,2,43,2],[3,2,3,3],[4,2,4,3],[20,2,20,3],[21,2,21,3],[42,3,43,3],[3,4,3,9],[4,4,4,9],[13,2,13,9],[5,4,5,5],[5,6,5,9],[20,4,20,9],[8,3,9,3],[6,3,7,3],[6,2,7,2],[8,2,9,2],[10,2,11,2],[10,3,11,3],[12,8,12,9],[21,4,21,9],[22,4,22,5],[22,6,22,9],[23,2,24,2],[23,3,24,3]]}
[]
[]
[null,null,"APSA N3"]
[null,null,"COMPETENCES ATTENDUES",null,"PRINCIPES D’ELABORATION DE L’EPREUVE"]
[]
[null,null,"POINTS A AFFECTER","ELEMENTS A EVALUER","COMPETENCE DE NIVEAU 3 EN COURS D’ACQUISITION\nDe 0 à 09 pts",null,"COMPETENCE DE NIVEAU 3 ACQUISE\nDe 10 à 20 pts"]
[null,null,"05 Points","Performance Individuelle sur 50m.\nTemps individuel sur 50 mètres"]
[]
[null,null,"05 Points","Indice de transmission. Différence entre  le meilleur temps réalisé sur 4x50 mètres (2) et la somme des temps des 4 coureurs sur 50m"]
[]
[null,null,"05 Points","Performances sur 4X50m.\nTemps cumulés des 2 4x50m, sans et avec changement de rôle (3)"]
[]
[null,null,"05 Points","Préparation avant l’épreuve et récupération après l’effort.\nEtre capable d’assurer une transmission valide\n(zone de transmission respectée)."]
[null,null,"COMMENTAIRES"]
[null,null,-1]
[]
[]
[]
[]
[null,null,"APSA N4"]
[null,null,"COMPETENCES ATTENDUES",null,"PRINCIPES D’ELABORATION DE L’EPREUVE"]
[]
[null,null,"POINTS A AFFECTER","ELEMENTS A EVALUER","COMPETENCE DE NIVEAU 3 EN COURS D’ACQUISITION\nDe 0 à 09 pts",null,"COMPETENCE DE NIVEAU 3 ACQUISE\nDe 10 à 20 pts"]
[null,null,"05 Points","Performance Individuelle sur 50m.\nTemps individuel sur 50 mètres"]
[]
[null,null,"05 Points","Indice de transmission. Différence entre  le meilleur temps réalisé sur 4x50 mètres (2) et la somme des temps des 4 coureurs sur 50m"]
[]
[null,null,"05 Points","Performances sur 4X50m.\nTemps cumulés des 2 4x50m, sans et avec changement de rôle (3)"]
[]
[null,null,"05 Points","Préparation avant l’épreuve et récupération après l’effort.\nEtre capable d’assurer une transmission valide\n(zone de transmission respectée)."]
[null,null,"COMMENTAIRES"]
[null,null,-1]
[]
[]
[]
[]
[null,null,"APSA EVALUATION CYCLE"]
[null,null,"COMPETENCES ATTENDUES",null,"PRINCIPES D’ELABORATION DE L’EPREUVE"]
[]
[null,null,"POINTS A AFFECTER","ELEMENTS A EVALUER","COMPETENCE DE NIVEAU 3 EN COURS D’ACQUISITION\nDe 0 à 09 pts",null,"COMPETENCE DE NIVEAU 3 ACQUISE\nDe 10 à 20 pts"]
[null,null,"05 Points","Performance Individuelle sur 50m.\nTemps individuel sur 50 mètres"]
[]
[null,null,"05 Points","Indice de transmission. Différence entre  le meilleur temps réalisé sur 4x50 mètres (2) et la somme des temps des 4 coureurs sur 50m"]
[]
[null,null,"05 Points","Performances sur 4X50m.\nTemps cumulés des 2 4x50m, sans et avec changement de rôle (3)"]
[]
[null,null,"05 Points","Préparation avant l’épreuve et récupération après l’effort.\nEtre capable d’assurer une transmission valide\n(zone de transmission respectée)."]

{"sheet":"APPEL","index":10,"n_rows":38,"n_cols":28,"rows_kept":38,"cut":false,"hidden":false,"merged":[[0,19,0,20],[0,22,0,23],[0,25,0,26],[0,1,0,2],[0,4,0,5],[0,7,0,8],[0,10,0,11],[0,13,0,14],[0,16,0,17]]}
[null,"1TU-GA",null,null,"1TU-GA2",null,null,"STAGE",null,null,"1EVS",null,null,"1GA",null,null,"1TU",null,null,"STAGE",null,null,"classe8",null,null,"classe9"]
[null,"NOMS","PRENOMS","sexe","NOMS","PRENOMS","sexe","NOMS","PRENOMS","sexe","NOMS","PRENOMS","sexe","NOMS","PRENOMS","sexe","NOMS","PRENOMS","sexe","NOMS","PRENOMS","sexe","NOMS","PRENOMS","sexe","NOMS","PRENOMS","sexe"]
[1,null,"Abraham","g",null,"Ali Malek","g",null,"Rémi","g"]
[2,null,"Aimane","f",null,"Aline","f",null,"Timothée","g"]
[3,null,"Amel","f",null,"Alya","f",null,"Virginie","f"]
[4,null,"Amira","f",null,"Amine","g",null,"Quentin","g"]
[5,null,"Anis","g",null,"Badis","g",null,"Mick"]
[6,null,"Beyza","f",null,"Jean-Michaël","g"]
[7,null,"Clarky","g",null,"Jessica","f"]
[8,null,"Djamel","g",null,"Kaïna","f"]
[9,null,"Dounia","f",null,"Katy","f"]
[10,null,"Eyat","g",null,"Léonard","g"]
[11,null,"Fatima-Zohra","f",null,"Marinho","g"]
[12,null,"Hana","f",null,"Mervé","f"]
[13,null,"Ikram","f",null,"Mouhamadou Moustapha","g"]
[14,null,"Jairzhino","g",null,"Rayane","g"]
[15,null,"Mergim","f",null,"Sania","f"]
[16,null,"Myriam","f",null,"Sonia","f"]
[17,null,"Serone","f",null,"Suzana","f"]
[18,null,"Suha","f",null,"Thomas","g"]
[19,null,"Yassine","g"]
[20]
[21]
[22]
[23]
[24]
[25]
[26]
[27]
[28]
[29]
[30]
[31]
[32]
[33]
[34]
[35]
[36]

{"sheet":"DEBUT","index":11,"n_rows":22,"n_cols":42,"rows_kept":22,"cut":false,"hidden":false,"merged":[[0,1,2,4],[0,11,2,16],[0,6,2,9]]}
[null,"Nombre de critères",null,null,null,null,"MON BAREME 2",null,null,null,null,"MES DONNES DE VALIDATION MODIFIABLES"]
[]
[]
["IT",0,1,2,3,4,"C1","C2","C3","C4",null,"Temps 25m",null,"Main opposée",null,"Orientation relayeur",null,"Moment transmission",null,"Communication D-R",null,"Temps /50m","DV12","DV13","DV14","DV15","DV16","DV17",null,null,null,null,null,null,null,null,"IT","0","1","2","3",4]
[-20,12,12,12,12,12,"Très inusffisant",null,null,null,null,null,null,null,null,null,null,null,null,null,null,null,null,null,null,null,null,null,null,null,null,null,null,null,null,null,-100,12,12,12,12,12]
[-1,12,12,12,12,12,"Insuffisant",null,null,null,null,3.5,null,"Oui",1,"De face",0,"Début",1,"Oui",1,6,null,null,null,null,null,null,null,null,null,null,null,null,null,null,-0.8,12,12,12,12,12]
[-0.6,12,12,12,12,12,null,null,null,null,null,3.6,null,"Non",0,"De profil",0,"Milieu",1,"Non",0,6.1,null,null,null,null,null,null,null,null,null,null,null,null,null,null,-0.7,12,12,12,12,12]
[-0.4,11,11,11,11,12,null,null,null,null,null,null,null,null,null,"De dos",1,"Fin",1,null,null,null,null,null,null,null,null,null,null,null,null,null,null,null,null,null,-0.6,11,11,11,11,12]
[-0.2,10,10,10,10,11,null,null,null,null,null,null,null,null,null,null,null,"Hors zone",0,null,null,null,null,null,null,null,null,null,null,null,null,null,null,null,null,null,-0.5,10,10,10,10,11]
[0,9,9,9,9,10,"Moyen",null,null,null,null,null,null,null,null,null,null,null,null,null,null,null,null,null,null,null,null,null,null,null,null,null,null,null,null,null,-0.4,9,9,9,9,10]
[0.2,8,8,8,9,10,"Satisfaisant",null,null,null,null,null,null,null,null,null,null,null,null,null,null,null,null,null,null,null,null,null,null,null,null,null,null,null,null,null,-0.3,8,8,8,9,10]
[0.4,7,7,7,8,9,"Assez satisfaisant",null,null,null,null,null,null,null,null,null,null,null,null,null,null,null,null,null,null,null,null,null,null,null,null,null,null,null,null,null,-0.2,7,7,7,8,9]
[0.6,6,6,6,7,8,null,null,null,null,null,null,null,null,null,null,null,null,null,null,null,null,null,null,null,null,null,null,null,null,null,null,null,null,null,null,-0.1,6,6,6,7,8]
[0.8,5,5,6,7,8,null,null,null,null,null,null,null,null,null,null,null,null,null,null,null,null,null,null,null,null,null,null,null,null,null,null,null,null,null,null,0,5,5,6,7,8]
[1,4,4,5,6,7,"Très satisfaisant",null,null,null,null,null,null,null,null,null,null,null,null,null,null,null,null,null,null,null,null,null,null,null,null,null,null,null,null,null,0.1,4,4,5,6,7]
[1.2,3,4,5,6,7,"Escellent",null,null,null,null,null,null,null,null,null,null,null,null,null,null,null,null,null,null,null,null,null,null,null,null,null,null,null,null,null,0.2,3,4,5,6,7]
[1.4,2,3,4,5,6,null,null,null,null,null,null,null,null,null,null,null,null,null,null,null,null,null,null,null,null,null,null,null,null,null,null,null,null,null,null,0.3,2,3,4,5,6]
[1.6,2,3,4,5,6,null,null,null,null,null,null,null,null,null,null,null,null,null,null,null,null,null,null,null,null,null,null,null,null,null,null,null,null,null,null,0.4,2,3,4,5,6]
[1.8,1,2,3,4,5,null,null,null,null,null,null,null,null,null,null,null,null,null,null,null,null,null,null,null,null,null,null,null,null,null,null,null,null,null,null,0.5,1,2,3,4,5]
[2,0,1,2,3,4,null,null,null,null,null,null,null,null,null,null,null,null,null,null,null,null,null,null,null,null,null,null,null,null,null,null,null,null,null,null,0.6,0,1,2,3,4]
[2.2000000000000002,0,0,0,0,0,null,null,null,null,null,null,null,null,null,null,null,null,null,null,null,null,null,null,null,null,null,null,null,null,null,null,null,null,null,null,100,0,0,0,0,0]
[10,0,0,0,0,0]

{"sheet":"SAMICBIS","index":12,"n_rows":5,"n_cols":20,"rows_kept":5,"cut":false,"hidden":false,"merged":[]}
[null,null,null,null,null,null,null,null,"Taille schéma PC : 1,25x2,26",null,"Taille schéma tablette : 1,85x3,4\"",null,null,null,null,null,null,null,null,"Conseil pour "]
["nom SA","n° SA","OBJ GENERAL","APSA","Obj SA","But","Type SA","Consignes","Schéma","Consignes 2","Schéma 2","Réussir","Matériel ","CR","Intérêt SA","Connaissances","Capacités","Attitudes","Complexification","Simplification"]
["Max Tirs en 1'","T1'","Améliorer la qualité du tir en course. Construire une continuité dribble-tir","BAD","Améliorer la qualité du tir en course","Marquer le plus de paniers possibles en 1 minute","Défi","Mini défi 1 contre 1. Les joueurs se placent à leur plot. AU signal d'un camarade ils dribblent pour aller shooter au panier. Que le tir soit réussi ou non, les 2 joueurs retournent faire le tour du plot en dribblant pour tenter un nouveau tir. Ils tournent pendant 1 minute. chacun compte son score en même temps que les observateurs et le relève sur la tablette à la fin. 2 nouveaux élèves passent quand la minute est finie.",null,"Consignes 2",null,"JE dribble rapidement pour pouvoir effectuer plusieurs shoots. Je m'applique sur chaque tir en m'aidant de l'angle du carré de la planche. ","2 ballons (1 chacun). 1 panier. 2 plots. 1 chrono. 1 tablette.","Je réussi au moins 3 tirs à l'arrêt et 5 tirs en course.","Intérêt SA","Cns","Cap","Att","Cplx","Simpli"]
["1000 plots",1000]
["PASSE et VA","PVA"]