{"text_format":"1","workbook":"xlsx","n_sheets":18,"sheets":["Accueil","Mode d'emploi","NomsPrénoms","Tournoi","DebuterTournoi","Feuil1","T1","T2","T3","T4","T5","T6","T7","T8","T9","T10","T11","T12"],"not_rendered":{"charts":0,"images":9,"macros":1,"external_links":0,"defined_names":34,"comments":0,"pivot_tables":0},"unopened":[],"bounds":{"document_bytes":16777216,"sheet_cells":100000,"rows_first":2000,"rows_last":500,"rows_between":2000,"halvings":0,"cell_chars":16384,"cell_head_chars":4096},"cells_cut":0,"cells_raw":0,"read":"whole","date_system":"1900"}

{"sheet":"Accueil","index":0,"n_rows":20,"n_cols":11,"rows_kept":20,"cut":false,"hidden":false,"merged":[[18,2,18,9],[19,2,19,9],[19,10,19,11],[20,2,20,9],[1,2,1,11],[3,2,3,11],[4,2,4,11],[16,2,16,11],[17,2,17,11]]}
[]
[null,null,"Présentation de Tournoi Poules"]
[]
[null,null,"Pour la gestion d'un tournoi de sport de raquette jusqu'à 12 terrains avec reclassement par poules de 3 ou 4 joueurs"]
[]
[]
[]
[]
[]
[]
{"$rows_left_out":11}
{"sheet":"Mode d'emploi","index":1,"n_rows":191,"n_cols":5,"rows_kept":191,"cut":false,"hidden":false,"merged":[[54,4,54,10],[0,1,0,11],[1,1,1,11],[44,1,44,3],[45,1,45,2],[53,4,53,10]]}
[null,"Explication Tournoi poules de 12 terrains"]
[]
[]
[]
[]
[]
[]
[]
[null,null,null,null,"Accès au mode d'emploi"]
[]
{"$rows_left_out":182}
{"sheet":"NomsPrénoms","index":2,"n_rows":43,"n_cols":8,"rows_kept":43,"cut":false,"hidden":false,"merged":[[0,1,0,3]]}
[null,"Feuille de saisie des Noms et des Prénoms des participants dans l'ordre du classement.",null,null,null,null,null,"Classe"]
[]
[null,"NOM","Prénom",null,"NOM Prénom ou  Equipes",null,"NOM Prénom"]
[1,null,null,1,null,1,{"$f":"IF(E4<>\"\",E4,IF(OR(B4<>\"\",C4<>\"\"),CONCATENATE(B4,\" \",C4),\"zzz\"))","v":"zzz"}]
[2,null,null,2,null,2,{"$f":"IF(E5<>\"\",E5,IF(OR(B5<>\"\",C5<>\"\"),CONCATENATE(B5,\" \",C5),\"zzz\"))","v":"zzz"}]
[3,null,null,3,null,3,{"$f":"IF(E6<>\"\",E6,IF(OR(B6<>\"\",C6<>\"\"),CONCATENATE(B6,\" \",C6),\"zzz\"))","v":"zzz"}]
[4,null,null,4,null,4,"zzz"]
[5,null,null,5,null,5,"zzz"]
[6,null,null,6,null,6,"zzz"]
[7,null,null,7,null,7,"zzz"]
{"$rows_left_out":34}
{"sheet":"Tournoi","index":3,"n_rows":102,"n_cols":41,"rows_kept":102,"cut":false,"hidden":false,"merged":[[52,3,52,6],[2,3,2,7],[56,20,59,20],[44,20,47,20],[48,20,51,20],[52,20,55,20],[40,20,43,20],[2,8,2,9],[2,27,2,30],[1,10,1,12],[60,20,63,20],[64,20,67,20],[20,20,23,20],[24,20,27,20],[28,20,31,20],[32,20,35,20],[36,20,39,20]]}
[]
[null,null,null,null,null,null,null,null,null,null," "]
[null,null,null,null,null,null,null,null,"    Rotation     "]
[null,null,"Noms Prénoms","Terrain\nTable\n(T1 à T12)","Lettre\nJoueurs\nou Equipe\nTerrain","Joueur\nOU\nEquipe","Nb Joueur ou Equipe\npar terrain/table","Classement\nTerrain/Table",null,null,1,2,3,4,5,6]
[1,null,null,{"$f":"IF(F5=\"\",\"\",VLOOKUP(F5,Numerodetable,3))","v":""},{"$f":"IF(F5=\"\",\"\",VLOOKUP(F5,LETTRESJOUEURS,2))","v":""},null,{"$f":"IF(D5=\"\",\"\",VLOOKUP(D5,NBJOUEURPARTABLE,2))","v":""},{"$f":"IF(F5=\"\",\"\",VLOOKUP(F5,classement,3))","v":""},{"$f":"IF(C5=\"\",\"\",C5)","v":""},"A",{"$f":"IF(COUNTIF($F$5:$F$44,N20)=1,IF($K$20>=3,VLOOKUP('T1'!A5,groupe1,4,0)),\"\")","v":""},{"$f":"IF(COUNTIF($F$5:$F$44,N24)=1,IF($K$20>=3,VLOOKUP('T2'!A4,groupe1,4,0)),\"\")","v":""},{"$f":"IF(COUNTIF($F$5:$F$44,N28)=1,IF($K$20>=3,VLOOKUP('T3'!A4,groupe1,4,0)),\"\")","v":""},{"$f":"IF(COUNTIF($F$5:$F$44,N32)=1,IF($K$20>=3,VLOOKUP('T4'!A4,groupe1,4,0)),\"\")","v":""},{"$f":"IF(COUNTIF($F$5:$F$44,N36)=1,IF($K$20>=3,VLOOKUP('T5'!A4,groupe1,4,0)),\"\")","v":""},{"$f":"IF(COUNTIF($F$5:$F$44,N40)=1,IF($K$20>=3,VLOOKUP('T6'!A4,groupe1,4,0)),\"\")","v":""},{"$f":"IF(COUNTIF($F$5:$F$44,N44)=1,IF($K$20>=3,VLOOKUP('T7'!A4,groupe1,4,0)),\"\")","v":""},{"$f":"IF(COUNTIF($F$5:$F$44,N48)=1,IF($K$20>=3,VLOOKUP('T8'!A4,groupe1,4,0)),\"\")","v":""},{"$f":"IF(COUNTIF($F$5:$F$44,N52)=1,IF($K$20>=3,VLOOKUP('T9'!A4,groupe1,4,0)),\"\")","v":""},{"$f":"IF(COUNTIF($F$5:$F$44,N56)=1,IF($K$20>=3,VLOOKUP('T10'!A4,groupe1,4,0)),\"\")","v":""},{"$f":"IF(COUNTIF($F$5:$F$44,N60)=1,IF($K$20>=3,VLOOKUP('T11'!A4,groupe1,4,0)),\"\")","v":""},{"$f":"IF(COUNTIF($F$5:$F$44,N64)=1,IF($K$20>=3,VLOOKUP('T12'!A4,groupe1,4,0)),\"\")","v":""},1,null,null,null,null,null,null,null,null,null,null,null,null,null,"Nombre de matchs joués"]
[2,null,null,"","",null,"",{"$f":"IF(F6=\"\",\"\",VLOOKUP(F6,classement,3))","v":""},{"$f":"IF(C6=\"\",\"\",C6)","v":""},"B",{"$f":"IF(COUNTIF($F$5:$F$44,N21)=1,IF($K$20>=3,VLOOKUP('T1'!A6,groupe1,4,0)),\"\")","v":""},{"$f":"IF(COUNTIF($F$5:$F$44,N25)=1,IF($K$20>=3,VLOOKUP('T2'!A5,groupe1,4,0)),\"\")","v":""},{"$f":"IF(COUNTIF($F$5:$F$44,N29)=1,IF($K$20>=3,VLOOKUP('T3'!A5,groupe1,4,0)),\"\")","v":""},{"$f":"IF(COUNTIF($F$5:$F$44,N33)=1,IF($K$20>=3,VLOOKUP('T4'!A5,groupe1,4,0)),\"\")","v":""},{"$f":"IF(COUNTIF($F$5:$F$44,N37)=1,IF($K$20>=3,VLOOKUP('T5'!A5,groupe1,4,0)),\"\")","v":""},{"$f":"IF(COUNTIF($F$5:$F$44,N41)=1,IF($K$20>=3,VLOOKUP('T6'!A5,groupe1,4,0)),\"\")","v":""},{"$f":"IF(COUNTIF($F$5:$F$44,N45)=1,IF($K$20>=3,VLOOKUP('T7'!A5,groupe1,4,0)),\"\")","v":""},{"$f":"IF(COUNTIF($F$5:$F$44,N49)=1,IF($K$20>=3,VLOOKUP('T8'!A5,groupe1,4,0)),\"\")","v":""},{"$f":"IF(COUNTIF($F$5:$F$44,N53)=1,IF($K$20>=3,VLOOKUP('T9'!A5,groupe1,4,0)),\"\")","v":""},{"$f":"IF(COUNTIF($F$5:$F$44,N57)=1,IF($K$20>=3,VLOOKUP('T10'!A5,groupe1,4,0)),\"\")","v":""},{"$f":"IF(COUNTIF($F$5:$F$44,N61)=1,IF($K$20>=3,VLOOKUP('T11'!A5,groupe1,4,0)),\"\")","v":""},{"$f":"IF(COUNTIF($F$5:$F$44,N65)=1,IF($K$20>=3,VLOOKUP('T12'!A5,groupe1,4,0)),\"\")","v":""},2,null,null,null,null,null,null,null,null,null,null,null,null,null,1,{"$f":"IF('T1'!H11=0,0,IF('T1'!H11=4,COUNTA('T1'!D15:D20),COUNTA('T1'!K15:K20)))","v":0},null,{"$f":"LARGE(D5:D44,1)","v":{"$error":"#NUM!"}},{"$f":"SUM(AL6:AL17)/2","v":0}]
[3,null,null,"","",null,"","","","C",{"$f":"IF(COUNTIF($F$5:$F$44,N22)=1,IF($K$20>=3,VLOOKUP('T1'!A7,groupe1,4,0)),\"\")","v":""},{"$f":"IF(COUNTIF($F$5:$F$44,N26)=1,IF($K$20>=3,VLOOKUP('T2'!A6,groupe1,4,0)),\"\")","v":""},{"$f":"IF(COUNTIF($F$5:$F$44,N30)=1,IF($K$20>=3,VLOOKUP('T3'!A6,groupe1,4,0)),\"\")","v":""},{"$f":"IF(COUNTIF($F$5:$F$44,N34)=1,IF($K$20>=3,VLOOKUP('T4'!A6,groupe1,4,0)),\"\")","v":""},{"$f":"IF(COUNTIF($F$5:$F$44,N38)=1,IF($K$20>=3,VLOOKUP('T5'!A6,groupe1,4,0)),\"\")","v":""},{"$f":"IF(COUNTIF($F$5:$F$44,N42)=1,IF($K$20>=3,VLOOKUP('T6'!A6,groupe1,4,0)),\"\")","v":""},{"$f":"IF(COUNTIF($F$5:$F$44,N46)=1,IF($K$20>=3,VLOOKUP('T7'!A6,groupe1,4,0)),\"\")","v":""},{"$f":"IF(COUNTIF($F$5:$F$44,N50)=1,IF($K$20>=3,VLOOKUP('T8'!A6,groupe1,4,0)),\"\")","v":""},{"$f":"IF(COUNTIF($F$5:$F$44,N54)=1,IF($K$20>=3,VLOOKUP('T9'!A6,groupe1,4,0)),\"\")","v":""},{"$f":"IF(COUNTIF($F$5:$F$44,N58)=1,IF($K$20>=3,VLOOKUP('T10'!A6,groupe1,4,0)),\"\")","v":""},{"$f":"IF(COUNTIF($F$5:$F$44,N62)=1,IF($K$20>=3,VLOOKUP('T11'!A6,groupe1,4,0)),\"\")","v":""},{"$f":"IF(COUNTIF($F$5:$F$44,N66)=1,IF($K$20>=3,VLOOKUP('T12'!A6,groupe1,4,0)),\"\")","v":""},3,null,null,null,null,null,null,null,null,null,null,null,null,null,2,{"$f":"IF('T2'!H10=0,0,IF('T2'!H10=4,COUNTA('T2'!D14:D19),COUNTA('T2'!K14:K19)))","v":0}]
[4,null,null,"","",null,"","","","D",{"$f":"IF(COUNTIF($F$5:$F$44,N23)=1,IF($K$20>=3,VLOOKUP('T1'!A8,groupe1,4,0)),\"\")","v":""},{"$f":"IF(COUNTIF($F$5:$F$44,N27)=1,IF($K$20>=3,VLOOKUP('T2'!A7,groupe1,4,0)),\"\")","v":""},{"$f":"IF(COUNTIF($F$5:$F$44,N31)=1,IF($K$20>=3,VLOOKUP('T3'!A7,groupe1,4,0)),\"\")","v":""},{"$f":"IF(COUNTIF($F$5:$F$44,N35)=1,IF($K$20>=3,VLOOKUP('T4'!A7,groupe1,4,0)),\"\")","v":""},{"$f":"IF(COUNTIF($F$5:$F$44,N39)=1,IF($K$20>=3,VLOOKUP('T5'!A7,groupe1,4,0)),\"\")","v":""},{"$f":"IF(COUNTIF($F$5:$F$44,N43)=1,IF($K$20>=3,VLOOKUP('T6'!A7,groupe1,4,0)),\"\")","v":""},{"$f":"IF(COUNTIF($F$5:$F$44,N47)=1,IF($K$20>=3,VLOOKUP('T7'!A7,groupe1,4,0)),\"\")","v":""},{"$f":"IF(COUNTIF($F$5:$F$44,N51)=1,IF($K$20>=3,VLOOKUP('T8'!A7,groupe1,4,0)),\"\")","v":""},{"$f":"IF(COUNTIF($F$5:$F$44,N55)=1,IF($K$20>=3,VLOOKUP('T9'!A7,groupe1,4,0)),\"\")","v":""},{"$f":"IF(COUNTIF($F$5:$F$44,N59)=1,IF($K$20>=3,VLOOKUP('T10'!A7,groupe1,4,0)),\"\")","v":""},{"$f":"IF(COUNTIF($F$5:$F$44,N63)=1,IF($K$20>=3,VLOOKUP('T11'!A7,groupe1,4,0)),\"\")","v":""},{"$f":"IF(COUNTIF($F$5:$F$44,N67)=1,IF($K$20>=3,VLOOKUP('T12'!A7,groupe1,4,0)),\"\")","v":""},4,null,null,null,null,null,null,null,null,null,null,null,null,null,3,{"$f":"IF('T3'!H10=0,0,IF('T3'!H10=4,COUNTA('T3'!D14:D19),COUNTA('T3'!K14:K19)))","v":0}]
[5,null,null,"","",null,"","","",null,null,null,null,null,null,null,null,null,null,null,null,null,5,null,null,null,null,null,null,null,null,null,null,null,null,null,4,{"$f":"IF('T4'!H10=0,0,IF('T4'!H10=4,COUNTA('T4'!D14:D19),COUNTA('T4'!K14:K19)))","v":0}]
[6,null,null,"","",null,"","","",null,null,null,null,null,null,null,null,null,null,null,null,null,6,null,null,null,null,null,null,null,null,null,null,null,null,null,5,{"$f":"IF('T5'!H10=0,0,IF('T5'!H10=4,COUNTA('T5'!D14:D19),COUNTA('T5'!K14:K19)))","v":0}]
{"$rows_left_out":93}
{"sheet":"DebuterTournoi","index":4,"n_rows":21,"n_cols":11,"rows_kept":21,"cut":false,"hidden":false,"merged":[[14,5,15,5],[14,6,15,6],[14,7,15,7],[14,8,15,8],[14,9,15,9],[16,5,17,5],[16,6,17,6],[16,7,17,7],[16,8,17,8],[16,9,17,9],[18,5,19,5],[18,6,19,6],[18,7,19,7],[18,8,19,8],[18,9,19,9],[20,5,21,5],[20,6,21,6],[20,7,21,7],[20,8,21,8],[20,9,21,9],[14,2,15,3],[18,2,19,3],[16,2,17,3],[20,2,21,3],[20,4,21,4],[18,4,19,4],[14,4,15,4],[16,4,17,4]]}
[]
[]
[]
[]
[]
[]
[]
[]
[]
[]
{"$rows_left_out":12}
{"sheet":"Feuil1","index":5,"n_rows":69,"n_cols":23,"rows_kept":69,"cut":false,"hidden":false,"merged":[[26,16,26,18]]}
[]
[]
[]
[null,"Noms Prénoms","Table (T1 à T12)","Table\ndans\nl'absolu","Joueurs","Joueur","Nb Joueur par table","Clast\n table","Nouvelle table\ndans\nl'absolu","Nouvelle\ntable\nou\nterrain","Nombre\njoueur/\nTerrain","Nouveau\nrang du\njoueur/\nTerrain","Nouveau\nnumero\njoueur/\nTerrain"]
[1,{"$f":"IF(Tournoi!$C$5=\"\",\"\",Tournoi!$C$5)","v":""},{"$f":"IF(Tournoi!$D$5=\"\",\"\",Tournoi!$D$5)","v":""},{"$f":"IF(C5=\"\",\"\",IF(G5=3,IF(AND(C5=NbreTerrainsUtilises,H5=3),12,C5),IF(G5=4,IF(AND(C5=NbreTerrainsUtilises,H5=4),12,C5))))","v":""},{"$f":"IF(Tournoi!$E$5=\"\",\"\",Tournoi!$E$5)","v":""},null,{"$f":"IF(Tournoi!$G$5=\"\",\"\",Tournoi!$G$5)","v":""},{"$f":"IF(Tournoi!$H$5=\"\",\"\",Tournoi!$H$5)","v":""},{"$f":"IF(OR(G5=\"\",H5=\"\"),\"\",IF(G5=3,INDEX($C$49:$F$60,MATCH(D5,$B$49:$B$60,0),MATCH(H5,$C$48:$F$48,0)),INDEX($H$49:$K$60,MATCH(D5,$G$49:$G$60,0),MATCH(H5,$H$48:$K$48,0))))","v":""},{"$f":"IF(I5=\"\",\"\",IF(I5<NbreTerrainsUtilises,I5,NbreTerrainsUtilises))","v":""},{"$f":"IF(J5=\"\",\"\",COUNTIF($J$5:$J$44,J5))","v":""},{"$f":"IF(H5=\"\",\"\",IF(AND(C5=1,H5=1),1,IF(AND(C5<>1,K5=4,H5=1),4,IF(AND(C5<>1,K5=3,H5=1),3,IF(H5=2,2,IF(AND(J5=C5,G5=4,H5=3),3,IF(AND(J5<C5,K5=4),4,IF(AND(J5<C5,K5=3),3,IF(J5>C5,1,IF(AND(J5=C5,J5=NbreTerrainsUtilises,K5=3,H5=3),3,IF(AND(J5=C5,J5=NbreTerrainsUtilises,K5=4,H5=4),4)))))))))))","v":""},{"$f":"IF(OR(J5=\"\",L5=\"\"),\"\",(J5*10)+L5)","v":""}]
[2,{"$f":"IF(Tournoi!$C$6=\"\",\"\",Tournoi!$C$6)","v":""},{"$f":"IF(Tournoi!$D$6=\"\",\"\",Tournoi!$D$6)","v":""},"",{"$f":"IF(Tournoi!$E$6=\"\",\"\",Tournoi!$E$6)","v":""},null,{"$f":"IF(Tournoi!$G$6=\"\",\"\",Tournoi!$G$6)","v":""},{"$f":"IF(Tournoi!$H$6=\"\",\"\",Tournoi!$H$6)","v":""},{"$f":"IF(OR(G6=\"\",H6=\"\"),\"\",IF(G6=3,INDEX($C$49:$F$60,MATCH(D6,$B$49:$B$60,0),MATCH(H6,$C$48:$F$48,0)),INDEX($H$49:$K$60,MATCH(D6,$G$49:$G$60,0),MATCH(H6,$H$48:$K$48,0))))","v":""},"",{"$f":"IF(J6=\"\",\"\",COUNTIF($J$5:$J$44,J6))","v":""},"",{"$f":"IF(OR(J6=\"\",L6=\"\"),\"\",(J6*10)+L6)","v":""}]
[3,{"$f":"IF(Tournoi!$C$7=\"\",\"\",Tournoi!$C$7)","v":""},{"$f":"IF(Tournoi!$D$7=\"\",\"\",Tournoi!$D$7)","v":""},"",{"$f":"IF(Tournoi!$E$7=\"\",\"\",Tournoi!$E$7)","v":""},null,{"$f":"IF(Tournoi!$G$7=\"\",\"\",Tournoi!$G$7)","v":""},{"$f":"IF(Tournoi!$H$7=\"\",\"\",Tournoi!$H$7)","v":""},"","","","",""]
[4,{"$f":"IF(Tournoi!$C$8=\"\",\"\",Tournoi!$C$8)","v":""},{"$f":"IF(Tournoi!$D$8=\"\",\"\",Tournoi!$D$8)","v":""},"",{"$f":"IF(Tournoi!$E$8=\"\",\"\",Tournoi!$E$8)","v":""},null,{"$f":"IF(Tournoi!$G$8=\"\",\"\",Tournoi!$G$8)","v":""},{"$f":"IF(Tournoi!$H$8=\"\",\"\",Tournoi!$H$8)","v":""},"","","","",""]
[5,{"$f":"IF(Tournoi!$C$9=\"\",\"\",Tournoi!$C$9)","v":""},{"$f":"IF(Tournoi!$D$9=\"\",\"\",Tournoi!$D$9)","v":""},"",{"$f":"IF(Tournoi!$E$9=\"\",\"\",Tournoi!$E$9)","v":""},null,{"$f":"IF(Tournoi!$G$9=\"\",\"\",Tournoi!$G$9)","v":""},{"$f":"IF(Tournoi!$H$9=\"\",\"\",Tournoi!$H$9)","v":""},"","","","",""]
[6,{"$f":"IF(Tournoi!$C$10=\"\",\"\",Tournoi!$C$10)","v":""},{"$f":"IF(Tournoi!$D$10=\"\",\"\",Tournoi!$D$10)","v":""},"",{"$f":"IF(Tournoi!$E$10=\"\",\"\",Tournoi!$E$10)","v":""},null,{"$f":"IF(Tournoi!$G$10=\"\",\"\",Tournoi!$G$10)","v":""},{"$f":"IF(Tournoi!$H$10=\"\",\"\",Tournoi!$H$10)","v":""},"","","","",""]
{"$rows_left_out":60}
{"sheet":"T1","index":6,"n_rows":35,"n_cols":17,"rows_kept":35,"cut":false,"hidden":false,"merged":[[32,2,32,4],[34,2,34,4],[34,6,34,7],[29,6,30,7],[33,6,33,7],[32,6,32,7],[33,2,33,4],[29,12,29,13],[31,6,31,7],[29,8,30,11],[12,1,12,6],[3,2,3,4],[13,12,13,13],[13,8,13,9],[31,2,31,4],[1,1,1,2],[12,8,12,13],[13,3,13,4],[13,5,13,6],[13,10,13,11],[13,1,13,2],[4,3,4,7],[5,3,5,7],[6,3,6,7],[7,3,7,7]]}
[]
[null,"TERRAIN/TABLE",null,1]
[]
[null,null,"Joueurs/Equipes"]
[11,null,"A",{"$f":"IF(Tournoi!K5=\"zzz\",\"\",Tournoi!K5)","v":""},null,null,null,null,null,null,"Victoire",3,"Pts"]
[12,null,"B",{"$f":"IF(Tournoi!K6=\"zzz\",\"\",Tournoi!K6)","v":""},null,null,null,null,null,null,"Défaite",1,"Pt"]
[13,null,"C",{"$f":"IF(Tournoi!K7=\"zzz\",\"\",Tournoi!K7)","v":""}]
[14,null,"D",{"$f":"IF(Tournoi!K8=\"zzz\",\"\",Tournoi!K8)","v":""}]
[]
[]
{"$rows_left_out":26}
{"sheet":"T2","index":7,"n_rows":34,"n_cols":17,"rows_kept":34,"cut":false,"hidden":false,"merged":[[30,2,30,4],[31,2,31,4],[32,2,32,4],[33,2,33,4],[12,8,12,9],[33,6,33,7],[32,6,32,7],[31,6,31,7],[30,6,30,7],[12,1,12,2],[12,3,12,4],[12,10,12,11],[28,8,29,11],[12,12,12,13],[12,5,12,6],[11,8,11,13],[28,6,29,7],[28,12,28,13],[0,1,0,2],[11,1,11,6],[2,2,2,4],[3,3,3,7],[4,3,4,7],[5,3,5,7],[6,3,6,7]]}
[null,"TERRAIN/TABLE",null,2]
[]
[null,null,"Joueurs/Equipes"]
[21,null,"A",{"$f":"IF(Tournoi!L5=\"zzz\",\"\",Tournoi!L5)","v":""},null,null,null,null,null,null,"Victoire",3,"Pts"]
[22,null,"B",{"$f":"IF(Tournoi!L6=\"zzz\",\"\",Tournoi!L6)","v":""},null,null,null,null,null,null,"Défaite",1,"Pt"]
[23,null,"C",{"$f":"IF(Tournoi!L7=\"zzz\",\"\",Tournoi!L7)","v":""}]
[24,null,"D",{"$f":"IF(Tournoi!L8=\"zzz\",\"\",Tournoi!L8)","v":""}]
[]
[]
[null,null,null,null,"Poule de",null,null,{"$f":"Tournoi!K21","v":0},"Joueurs/Equipes"]
{"$rows_left_out":25}
{"sheet":"T3","index":8,"n_rows":34,"n_cols":17,"rows_kept":34,"cut":false,"hidden":false,"merged":[[28,14,29,14],[28,12,28,13],[30,6,30,7],[28,8,29,11],[12,8,12,9],[33,6,33,7],[28,6,29,7],[31,6,31,7],[32,6,32,7],[30,2,30,4],[31,2,31,4],[32,2,32,4],[33,2,33,4],[0,1,0,2],[11,1,11,6],[2,2,2,4],[12,1,12,2],[11,8,11,13],[12,3,12,4],[12,5,12,6],[12,10,12,11],[12,12,12,13],[3,3,3,7],[4,3,4,7],[5,3,5,7],[6,3,6,7]]}
[null,"TERRAIN/TABLE",null,3]
[]
[null,null,"Joueurs/Equipes"]
[31,null,"A",{"$f":"IF(Tournoi!M5=\"zzz\",\"\",Tournoi!M5)","v":""},null,null,null,null,null,null,"Victoire",3,"Pts"]
[32,null,"B",{"$f":"IF(Tournoi!M6=\"zzz\",\"\",Tournoi!M6)","v":""},null,null,null,null,null,null,"Défaite",1,"Pt"]
[33,null,"C",{"$f":"IF(Tournoi!M7=\"zzz\",\"\",Tournoi!M7)","v":""}]
[34,null,"D",{"$f":"IF(Tournoi!M8=\"zzz\",\"\",Tournoi!M8)","v":""}]
[]
[]
[null,null,null,null,"Poule de",null,null,{"$f":"Tournoi!K22","v":0},"Joueurs/Equipes"]
{"$rows_left_out":25}
{"sheet":"T4","index":9,"n_rows":34,"n_cols":17,"rows_kept":34,"cut":false,"hidden":false,"merged":[[0,1,0,2],[11,1,11,6],[2,2,2,4],[30,6,30,7],[3,3,3,7],[4,3,4,7],[5,3,5,7],[6,3,6,7],[28,4,29,5],[30,2,30,4],[28,14,29,14],[33,6,33,7],[28,6,29,7],[32,6,32,7],[28,12,28,13],[28,8,29,11],[31,6,31,7],[33,2,33,4],[12,8,12,9],[11,8,11,13],[12,3,12,4],[12,5,12,6],[12,10,12,11],[12,12,12,13],[12,1,12,2],[31,2,31,4],[32,2,32,4]]}
[null,"TERRAIN/TABLE",null,4]
[]
[null,null,"Joueurs/Equipes"]
[41,null,"A",{"$f":"IF(Tournoi!N5=\"zzz\",\"\",Tournoi!N5)","v":""},null,null,null,null,null,null,"Victoire",3,"Pts"]
[42,null,"B",{"$f":"IF(Tournoi!N6=\"zzz\",\"\",Tournoi!N6)","v":""},null,null,null,null,null,null,"Défaite",1,"Pt"]
[43,null,"C",{"$f":"IF(Tournoi!N7=\"zzz\",\"\",Tournoi!N7)","v":""}]
[44,null,"D",{"$f":"IF(Tournoi!N8=\"zzz\",\"\",Tournoi!N8)","v":""}]
[]
[]
[null,null,null,null,"Poule de",null,null,{"$f":"Tournoi!K23","v":0},"Joueurs/Equipes"]
{"$rows_left_out":25}
{"sheet":"T5","index":10,"n_rows":34,"n_cols":17,"rows_kept":34,"cut":false,"hidden":false,"merged":[[30,2,30,4],[31,2,31,4],[32,2,32,4],[33,2,33,4],[0,1,0,2],[11,1,11,6],[12,3,12,4],[12,5,12,6],[12,1,12,2],[33,6,33,7],[28,6,29,7],[32,6,32,7],[30,6,30,7],[31,6,31,7],[12,12,12,13],[28,12,28,13],[28,8,29,11],[2,2,2,4],[11,8,11,13],[12,10,12,11],[12,8,12,9],[3,3,3,7],[4,3,4,7],[5,3,5,7],[6,3,6,7]]}
[null,"TERRAIN/TABLE",null,5]
[]
[null,null,"Joueurs/Equipes"]
[51,null,"A",{"$f":"IF(Tournoi!O5=\"zzz\",\"\",Tournoi!O5)","v":""},null,null,null,null,null,null,"Victoire",3,"Pts"]
[52,null,"B",{"$f":"IF(Tournoi!O6=\"zzz\",\"\",Tournoi!O6)","v":""},null,null,null,null,null,null,"Défaite",1,"Pt"]
[53,null,"C",{"$f":"IF(Tournoi!O7=\"zzz\",\"\",Tournoi!O7)","v":""}]
[54,null,"D",{"$f":"IF(Tournoi!O8=\"zzz\",\"\",Tournoi!O8)","v":""}]
[]
[]
[null,null,null,null,"Poule de",null,null,{"$f":"Tournoi!K24","v":0},"Joueurs/Equipes"]
{"$rows_left_out":25}
{"sheet":"T6","index":11,"n_rows":34,"n_cols":17,"rows_kept":34,"cut":false,"hidden":false,"merged":[[28,12,28,13],[30,6,30,7],[12,8,12,9],[12,10,12,11],[28,8,29,11],[33,6,33,7],[28,6,29,7],[32,6,32,7],[31,6,31,7],[31,2,31,4],[32,2,32,4],[33,2,33,4],[30,2,30,4],[0,1,0,2],[11,1,11,6],[11,8,11,13],[12,3,12,4],[12,5,12,6],[2,2,2,4],[12,12,12,13],[3,3,3,7],[4,3,4,7],[5,3,5,7],[6,3,6,7],[12,1,12,2]]}
[null,"TERRAIN/TABLE",null,6]
[]
[null,null,"Joueurs/Equipes"]
[61,null,"A",{"$f":"IF(Tournoi!P5=\"zzz\",\"\",Tournoi!P5)","v":""},null,null,null,null,null,null,"Victoire",3,"Pts"]
[62,null,"B",{"$f":"IF(Tournoi!P6=\"zzz\",\"\",Tournoi!P6)","v":""},null,null,null,null,null,null,"Défaite",1,"Pt"]
[63,null,"C",{"$f":"IF(Tournoi!P7=\"zzz\",\"\",Tournoi!P7)","v":""}]
[64,null,"D",{"$f":"IF(Tournoi!P8=\"zzz\",\"\",Tournoi!P8)","v":""}]
[]
[]
[null,null,null,null,"Poule de",null,null,{"$f":"Tournoi!K25","v":0},"Joueurs/Equipes"]
{"$rows_left_out":25}
{"sheet":"T7","index":12,"n_rows":34,"n_cols":17,"rows_kept":34,"cut":false,"hidden":false,"merged":[[30,2,30,4],[31,2,31,4],[32,2,32,4],[33,2,33,4],[0,1,0,2],[11,1,11,6],[12,3,12,4],[12,5,12,6],[12,1,12,2],[33,6,33,7],[28,6,29,7],[32,6,32,7],[30,6,30,7],[31,6,31,7],[12,12,12,13],[28,12,28,13],[28,8,29,11],[2,2,2,4],[11,8,11,13],[12,10,12,11],[12,8,12,9],[3,3,3,7],[4,3,4,7],[5,3,5,7],[6,3,6,7]]}
[null,"TERRAIN/TABLE",null,7]
[]
[null,null,"Joueurs/Equipes"]
[71,null,"A",{"$f":"IF(Tournoi!Q5=\"zzz\",\"\",Tournoi!Q5)","v":""},null,null,null,null,null,null,"Victoire",3,"Pts"]
[72,null,"B",{"$f":"IF(Tournoi!Q6=\"zzz\",\"\",Tournoi!Q6)","v":""},null,null,null,null,null,null,"Défaite",1,"Pt"]
[73,null,"C",{"$f":"IF(Tournoi!Q7=\"zzz\",\"\",Tournoi!Q7)","v":""}]
[74,null,"D",{"$f":"IF(Tournoi!Q8=\"zzz\",\"\",Tournoi!Q8)","v":""}]
[]
[]
[null,null,null,null,"Poule de",null,null,{"$f":"Tournoi!K26","v":0},"Joueurs/Equipes"]
{"$rows_left_out":25}
{"sheet":"T8","index":13,"n_rows":34,"n_cols":17,"rows_kept":34,"cut":false,"hidden":false,"merged":[[30,2,30,4],[31,2,31,4],[32,2,32,4],[33,2,33,4],[0,1,0,2],[11,1,11,6],[12,3,12,4],[12,5,12,6],[12,1,12,2],[33,6,33,7],[28,6,29,7],[32,6,32,7],[30,6,30,7],[31,6,31,7],[12,12,12,13],[28,12,28,13],[28,8,29,11],[2,2,2,4],[11,8,11,13],[12,10,12,11],[12,8,12,9],[3,3,3,7],[4,3,4,7],[5,3,5,7],[6,3,6,7]]}
[null,"TERRAIN/TABLE",null,8]
[]
[null,null,"Joueurs/Equipes"]
[81,null,"A",{"$f":"IF(Tournoi!R5=\"zzz\",\"\",Tournoi!R5)","v":""},null,null,null,null,null,null,"Victoire",3,"Pts"]
[82,null,"B",{"$f":"IF(Tournoi!R6=\"zzz\",\"\",Tournoi!R6)","v":""},null,null,null,null,null,null,"Défaite",1,"Pt"]
[83,null,"C",{"$f":"IF(Tournoi!R7=\"zzz\",\"\",Tournoi!R7)","v":""}]
[84,null,"D",{"$f":"IF(Tournoi!R8=\"zzz\",\"\",Tournoi!R8)","v":""}]
[]
[]
[null,null,null,null,"Poule de",null,null,{"$f":"Tournoi!K27","v":0},"Joueurs/Equipes"]
{"$rows_left_out":25}
{"sheet":"T9","index":14,"n_rows":34,"n_cols":17,"rows_kept":34,"cut":false,"hidden":false,"merged":[[30,2,30,4],[31,2,31,4],[32,2,32,4],[33,2,33,4],[0,1,0,2],[11,1,11,6],[12,3,12,4],[12,5,12,6],[12,1,12,2],[33,6,33,7],[28,6,29,7],[32,6,32,7],[30,6,30,7],[31,6,31,7],[12,12,12,13],[28,12,28,13],[28,8,29,11],[2,2,2,4],[11,8,11,13],[12,10,12,11],[12,8,12,9],[3,3,3,7],[4,3,4,7],[5,3,5,7],[6,3,6,7]]}
[null,"TERRAIN/TABLE",null,9]
[]
[null,null,"Joueurs/Equipes"]
[91,null,"A",{"$f":"IF(Tournoi!S5=\"zzz\",\"\",Tournoi!S5)","v":""},null,null,null,null,null,null,"Victoire",3,"Pts"]
[92,null,"B",{"$f":"IF(Tournoi!S6=\"zzz\",\"\",Tournoi!S6)","v":""},null,null,null,null,null,null,"Défaite",1,"Pt"]
[93,null,"C",{"$f":"IF(Tournoi!S7=\"zzz\",\"\",Tournoi!S7)","v":""}]
[94,null,"D",{"$f":"IF(Tournoi!S8=\"zzz\",\"\",Tournoi!S8)","v":""}]
[]
[]
[null,null,null,null,"Poule de",null,null,{"$f":"Tournoi!K28","v":0},"Joueurs/Equipes"]
{"$rows_left_out":25}
{"sheet":"T10","index":15,"n_rows":34,"n_cols":17,"rows_kept":34,"cut":false,"hidden":false,"merged":[[30,2,30,4],[31,2,31,4],[32,2,32,4],[33,2,33,4],[0,1,0,2],[11,1,11,6],[12,3,12,4],[12,5,12,6],[12,1,12,2],[33,6,33,7],[28,6,29,7],[32,6,32,7],[30,6,30,7],[31,6,31,7],[12,12,12,13],[28,12,28,13],[28,8,29,11],[2,2,2,4],[11,8,11,13],[12,10,12,11],[12,8,12,9],[3,3,3,7],[4,3,4,7],[5,3,5,7],[6,3,6,7]]}
[null,"TERRAIN/TABLE",null,10]
[]
[null,null,"Joueurs/Equipes"]
[101,null,"A",{"$f":"IF(Tournoi!T5=\"zzz\",\"\",Tournoi!T5)","v":""},null,null,null,null,null,null,"Victoire",3,"Pts"]
[102,null,"B",{"$f":"IF(Tournoi!T6=\"zzz\",\"\",Tournoi!T6)","v":""},null,null,null,null,null,null,"Défaite",1,"Pt"]
[103,null,"C",{"$f":"IF(Tournoi!T7=\"zzz\",\"\",Tournoi!T7)","v":""}]
[104,null,"D",{"$f":"IF(Tournoi!T8=\"zzz\",\"\",Tournoi!T8)","v":""}]
[]
[]
[null,null,null,null,"Poule de",null,null,{"$f":"Tournoi!K29","v":0},"Joueurs/Equipes"]
{"$rows_left_out":25}
{"sheet":"T11","index":16,"n_rows":34,"n_cols":17,"rows_kept":34,"cut":false,"hidden":false,"merged":[[30,2,30,4],[31,2,31,4],[32,2,32,4],[33,2,33,4],[0,1,0,2],[11,1,11,6],[12,3,12,4],[12,5,12,6],[12,1,12,2],[33,6,33,7],[28,6,29,7],[32,6,32,7],[30,6,30,7],[31,6,31,7],[12,12,12,13],[28,12,28,13],[28,8,29,11],[2,2,2,4],[11,8,11,13],[12,10,12,11],[12,8,12,9],[3,3,3,7],[4,3,4,7],[5,3,5,7],[6,3,6,7]]}
[null,"TERRAIN/TABLE",null,11]
[]
[null,null,"Joueurs/Equipes"]
[111,null,"A",{"$f":"IF(Tournoi!U5=\"zzz\",\"\",Tournoi!U5)","v":""},null,null,null,null,null,null,"Victoire",3,"Pts"]
[112,null,"B",{"$f":"IF(Tournoi!U6=\"zzz\",\"\",Tournoi!U6)","v":""},null,null,null,null,null,null,"Défaite",1,"Pt"]
[113,null,"C",{"$f":"IF(Tournoi!U7=\"zzz\",\"\",Tournoi!U7)","v":""}]
[114,null,"D",{"$f":"IF(Tournoi!U8=\"zzz\",\"\",Tournoi!U8)","v":""}]
[]
[]
[null,null,null,null,"Poule de",null,null,{"$f":"Tournoi!K30","v":0},"Joueurs/Equipes"]
{"$rows_left_out":25}
{"sheet":"T12","index":17,"n_rows":34,"n_cols":17,"rows_kept":34,"cut":false,"hidden":false,"merged":[[28,14,29,14],[28,12,28,13],[30,6,30,7],[28,8,29,11],[30,2,30,4],[31,2,31,4],[32,2,32,4],[33,2,33,4],[6,3,6,7],[33,6,33,7],[28,6,29,7],[31,6,31,7],[32,6,32,7],[0,1,0,2],[11,1,11,6],[11,8,11,13],[12,3,12,4],[12,5,12,6],[12,10,12,11],[2,2,2,4],[12,1,12,2],[12,12,12,13],[12,8,12,9],[3,3,3,7],[4,3,4,7],[5,3,5,7]]}
[null,"TERRAIN/TABLE",null,12]
[]
[null,null,"Joueurs/Equipes"]
[121,null,"A",{"$f":"IF(Tournoi!V5=\"zzz\",\"\",Tournoi!V5)","v":""},null,null,null,null,null,null,"Victoire",3,"Pts"]
[122,null,"B",{"$f":"IF(Tournoi!V6=\"zzz\",\"\",Tournoi!V6)","v":""},null,null,null,null,null,null,"Défaite",1,"Pt"]
[123,null,"C",{"$f":"IF(Tournoi!V7=\"zzz\",\"\",Tournoi!V7)","v":""}]
[124,null,"D",{"$f":"IF(Tournoi!V8=\"zzz\",\"\",Tournoi!V8)","v":""}]
[]
[]
[null,null,null,null,"Poule de",null,null,{"$f":"Tournoi!K31","v":0},"Joueurs/Equipes"]
{"$rows_left_out":24}